{
  "compilerOptions": {
    "baseUrl": ".",
    "paths": {
      "@pages/*": ["pages/*"],
      "@components/*": ["components/*"],
      "@hooks/*": ["hooks/*"],
      "@styles/*": ["styles/*"],
      "@data/*": ["data/*"],
      "@utils/*": ["utils/*"]
    }
  }
}
