=====================
実習課題
=====================

a. 作成したプログラムを使って、図6.2の再現を行う。
 
* 初期値として、表に示した値を代入してプログラムを実行した結果をfigure_1_2.pdfに示す。このグラフから、 :math:`r=0.75` で周期が2になり、 :math:`r=0.86` のあたりで周期が4となり、また :math:`r=0.89` のあたりで周期が8となっていく様子を見ることができる。また、それ以降は判別が難しくなり、カオス的な振る舞いとなった。しかし、ところどころには周期的振る舞いを示す領域も存在していることも見て取れる。

.. csv-table::
    :header: パラメータ, 値
    :widths: 10, 6

    x0, 0.3
    ntransient, 1000
    nplot, 50
    r0, 0.7
    dr, 0.0005


.. figure:: figure_1_2.pdf
    :width: 17.0cm
    :alt: figure_1_2.pdf
    
表で定めたパラメータでのBifurcation-Diaglam

