.. 12-4_history-dependent_rw documentation master file, created by
   sphinx-quickstart on Mon Jun  2 10:28:12 2014.
   You can adapt this file completely to your liking, but it should at least
   contain the root `toctree` directive.

計算機実習 問題12-4 継続型ランダムウォーク
=====================================================

Contents:

.. toctree::
   :maxdepth: 2
   
   before



Indices and tables
==================

* :ref:`genindex`
* :ref:`modindex`
* :ref:`search`

