=====================
実習課題
=====================

a. :math:`r=0.24` とおいてさまざまな初期値 :math:`x_{0}` について動的な振る舞いを調べよ。 :math:`x=0` が安定な固定点であることを示せ。 :math:`r` の値が十分に小さいときには、計算を反復して求めた :math:`x` の値が、初期値 :math:`x_{0}` とは無関係に :math:`x=0` に収束する。 :math:`x` が昆虫の個体数を表すと考えて、個体数の定性的な振る舞いについて調べよ。


* :math:`r=0.24` とおいて :math:`x_{0}=0, 0.2, 0.4, 0.6, 0.8, 1.0` とした時のグラフをfigure_1.pdfに示した。このグラフから確かめられるように、 :math:`r` の値が十分小さい時には、初期値によらず :math:`x` の値は :math:`x=0` に単調に収束する。 :math:`x` が昆虫の個体数を表すと見るなら、 :math:`r` の値が小さいということは、個体数の増加率が1よりも小さくなる状態を表しており、生まれてくる個体よりも死ぬ個体のほうが多い状態とも言えるだろう。そのような状況では、個体数は減り続け、いずれ0になる。

.. figure:: figure_1.pdf
    :width: 14.0cm
    :alt: figure_1.pdf
    
    :math:`r=0.24` とおいて :math:`x_{0}=0, 0.2, 0.4, 0.6, 0.8, 1.0` とした時のグラフ
  
b. 式(1)の動的な性質を :math:`r=0.26, 0.5, 0.74, 0.748` について調べよ。 :math:`r > 0.25` では :math:`x=0` が不安定な固定点であることを確かめよ。与えられた :math:`r` の値では、計算の反復で得られる :math:`x` の値は初期値の過渡点を過ぎると変化しないこと、つまり、長時間後の動的な振る舞いは周期1であることを示せ。 :math:`r < 3/4` について区間 :math:`0 < x_{0} < 1` の :math:`x_{0}` を初期値とするすべての軌跡が :math:`x=1-1/4r` のアトラクタに近づくことが示されている。軌跡がアトラクタに吸い込まれる初期値の集合をそのアトラクタの吸引域と呼ぶ。ロジスティック写像では、領域 :math:`0 < x_{0} < 1` は :math:`x=1-1/4r` のアトラクタの吸引域である。
 

* :math:`r=0.26, 0.5, 0.74, 0.748` とおいたとき、さまざまな :math:`x_{0}` を初期値として設定しグラフを描いた。これらをfigure_2.pdf、figure_3.pdf、figure_4.pdf、figure_5.pdfに示す。これらの結果から、この範囲の :math:`r` では :math:`x` の値は、振動しながら一定の値に収束していき、長時間後にはその動的な振る舞いが周期1であることがわかる。また、その時収束する値は :math:`1-1/4r` と等しくなっていることがわかる。

.. figure:: figure_2.pdf
    :width: 8.5cm
    :alt: figure_2.pdf
    
    :math:`r=0.26` とおいて :math:`x_{0}=0.2, 0.4, 0.6, 0.8` とした時のグラフ

.. figure:: figure_3.pdf
    :width: 8.5cm
    :alt: figure_3.pdf
    
    :math:`0.5` とおいて :math:`x_{0}=0.2, 0.4, 0.6, 0.8` とした時のグラフ

.. figure:: figure_4.pdf
    :width: 8.5cm
    :alt: figure_4.pdf
    
    :math:`r=0.74` とおいて :math:`x_{0}=0.2, 0.4, 0.6, 0.8` とした時のグラフ

.. figure:: figure_5.pdf
    :width: 8.5cm
    :alt: figure_5.pdf
    
    :math:`r=0.748` とおいて :math:`x_{0}=0.2, 0.8` とした時のグラフ
  
c. :math:`r=0.752, 0.76, 0.8, 0.862` について式(1)の動的な性質を調べよ。 :math:`r` を0.75よりほんの少し大きくすると、初期値の過渡的な振る舞いの後に、2つの数値の間を振動することを示せ。つまり、単一の固定点に対応する周期1の安定なサイクルの代わりに、系は周期2の安定なサイクルを持つようになる。1つの固定点 :math:`x^{*}` が2つの :math:`x_{1}^{*}` と :math:`x_{2}^{*}` に分かれる。つまり、分岐する :math:`r` の値は :math:`r=b_{1}=3/4` である。1対の :math:`x` ( :math:`x_{1}^{*}` と :math:`x_{2}^{*}` )は1つの、周期2の安定なアトラクタを形成する。
 
* :math:`r=0.752, 0.76, 0.8, 0.862` について :math:`x_{0}` をさまざまに変えたときのグラフをfigure_6.pdf、figure_7.pdf、figure_8.pdf、figure_9.pdfに示す。これらのグラフから見て取れるように、十分時間が経過した後も、 :math:`x` の値は一つの値に収束することなく、二つの値の間を周期2で振動していることがわかる。


.. figure:: figure_6.pdf
    :width: 8.5cm
    :alt: figure_6.pdf
    
    :math:`r=0.752` とおいて :math:`x_{0}=0.2, 0.8` とした時のグラフ

.. figure:: figure_7.pdf
    :width: 8.5cm
    :alt: figure_7.pdf
    
    :math:`r=0.76` とおいて :math:`x_{0}==0.2, 0.8` とした時のグラフ

.. figure:: figure_8.pdf
    :width: 8.5cm
    :alt: figure_8.pdf
    
    :math:`r=0.8` とおいて :math:`x_{0}=0.2, 0.8` とした時のグラフ

.. figure:: figure_9.pdf
    :width: 8.5cm
    :alt: figure_9.pdf
    
    :math:`r=0.862` とおいて :math:`x_{0}=0.2, 0.8` とした時のグラフ   

  
d. 設問cで観測したものと同様な動的振る舞いを示す、昆虫の個体数の生態学的なシナリオについて述べよ。
 

* 設問cで観測されたような動的な振る舞いは、ある昆虫が、限られた環境の中で成長率が十分にあるために個体数が増えていき、しかし一方で個体数の増加による各種資源の枯渇など、成長率への負の影響のために、個体数を増やし続けることができず、次の世代ではその数が減少してしまうような場合であると考えることができる。
  \end{enumerate}
  
e. :math:`r=0.863, 0.88` では、式(\ref{eq:logistic})の安定なアトラクタとその周期はどうなるか。
 

* :math:`r=0.863, 0.88` で :math:`x_{0}=0.2` とした時のグラフをfigure_10.pdf、figure_11.pdfに示す。これらのグラフを注意深く見ると、設問cのように周期2で振動しているのではなく、その二つのアトラクタがさらに二つのアトラクタに分岐していることがわかる。つまり、十分時間が経ったのちに、 :math:`x` は周期4で振動している。

.. figure:: figure_10.pdf
    :width: 8.5cm
    :alt: figure_10.pdf
    
    :math:`r=0.863` とおいて :math:`x_{0}=0.2` とした時のグラフ

.. figure:: figure_11.pdf
    :width: 8.5cm
    :alt: figure_11.pdf
    
    :math:`r=0.88` とおいて :math:`x_{0}=0.2` とした時のグラフ   

  
f. :math:`r=0.89, 0.891, 0.8922` ではアトラクタとその周期はどうなるか。
 
* :math:`r=0.89, 0.891, 0.8922` で :math:`x_{0}=0.2` とした時のグラフをfigure_12.pdf、figure_13.pdf、figure_14.pdfに示す。これらのグラフは、設問eでのアトラクタがそれぞれさらに二つのアトラクタに分岐しているものであることがわかる。つまり、十分時間が経ったのちに、 :math:`x` は周期8で振動している。以上の結果から、特に観測した :math:`r` の領域については、 :math:`r` の値が増加するにつれて、アトラクタの数、または振動の周期が倍化していることがわかる。

.. figure:: figure_12.pdf
    :width: 8.5cm
    :alt: figure_12.pdf
    
    :math:`r=0.89` とおいて :math:`x_{0}=0.2` とした時のグラフ

.. figure:: figure_13.pdf
    :width: 8.5cm
    :alt: figure_13.pdf
    
    :math:`r=0.891` とおいて :math:`x_{0}=0.2` とした時のグラフ   

.. figure:: figure_14.pdf
    :width: 8.5cm
    :alt: figure_14.pdf
    
    :math:`r=0.5` とおいて :math:`x_{0}=0.2, 0.4, 0.6, 0.8` とした時のグラフ


