.. 問題12.2 2次元ランダムウォーク documentation master file, created by
   sphinx-quickstart on Wed Jun  4 14:36:04 2014.
   You can adapt this file completely to your liking, but it should at least
   contain the root `toctree` directive.

Welcome to 問題12.2 2次元ランダムウォーク's documentation!
==========================================================

Contents:

.. toctree::
   :maxdepth: 2



Indices and tables
==================

* :ref:`genindex`
* :ref:`modindex`
* :ref:`search`

