<?xml version="1.0" encoding="UTF-8"?>
<session version="1.0">
<refactoring comment="Copy element &apos;feeds&apos; to &apos;rest/src/main/java&apos;&#x0D;&#x0A;- Original project: &apos;vertx-feeds-master&apos;&#x0D;&#x0A;- Destination element: &apos;rest/src/main/java&apos;&#x0D;&#x0A;- Original element: &apos;feeds&apos;" description="Copy folder" destination="=rest/src\/main\/java" element1="src/main/java/io/vertx/examples/feeds" files="0" flags="589830" folders="1" id="org.eclipse.jdt.ui.copy" policy="org.eclipse.jdt.ui.copyResources" stamp="1529389263180" units="0" version="1.0"/>
</session>