<?xml version="1.0" encoding="iso-8859-1"?>
<svg 
	version="1.1"
	xmlns="http://www.w3.org/2000/svg"
	x="0"
	y="0"
	width="44"
	height="44"
	viewBox="0 0 44 44"
	enable-background="new 0 0 44 44"
	xml:space="preserve">
	<g id="e6c6b53d3c8160b22dad35a0f709c725">
		<g></g>
		<g fill="#232323">
			<path display="inline" d="M0.5,32.438v447.125h511V32.438H0.5z M447.625,415.688H64.375V256l106.458-53.229l170.333,149.042
		l106.458-66.536V415.688z M447.625,221.401l-106.458,66.537L170.833,138.896L64.375,192.125v-42.583l106.458-53.229
		l170.333,149.042l106.458-66.536V221.401z">
			</path>
		</g>
	</g>
</svg>