<?xml version="1.0" encoding="UTF-8" standalone="no"?>
<!DOCTYPE svg PUBLIC "-//W3C//DTD SVG 20010904//EN"
        "http://www.w3.org/TR/2001/REC-SVG-20010904/DTD/svg10.dtd">

<svg xmlns="http://www.w3.org/2000/svg"
     width="4.71001in" height="4.71001in"
     viewBox="0 0 1413 1413">
    <path id="Selection"
          fill="black" stroke="black" stroke-width="1"
          d="M 601.00,718.05
           C 549.99,685.32 513.31,626.38 502.58,567.00
             500.71,556.68 498.13,543.41 498.00,533.00
             498.00,533.00 497.00,515.00 497.00,515.00
             497.00,515.00 498.00,500.00 498.00,500.00
             498.10,491.27 498.97,482.61 500.41,474.00
             500.41,474.00 504.00,455.00 504.00,455.00
             504.52,452.57 505.82,448.46 504.81,446.18
             503.86,444.06 500.89,442.28 499.00,441.00
             499.00,441.00 484.00,431.31 484.00,431.31
             484.00,431.31 427.00,394.31 427.00,394.31
             427.00,394.31 373.00,359.05 373.00,359.05
             353.82,346.88 333.78,335.10 317.09,319.58
             310.55,313.49 302.52,303.58 297.69,296.00
             295.29,292.22 292.14,285.01 289.61,282.32
             287.06,279.61 277.75,274.16 274.00,271.67
             274.00,271.67 239.00,249.00 239.00,249.00
             239.00,249.00 214.00,233.11 214.00,233.11
             209.55,231.81 205.02,239.03 202.00,241.96
             192.88,250.78 179.57,259.55 168.00,264.82
             125.75,284.08 78.09,274.52 44.00,243.83
             -25.79,181.02 -11.69,48.85 76.00,9.31
             95.21,0.65 109.46,-0.24 130.00,0.00
             140.33,0.12 153.43,3.57 163.00,7.40
             206.48,24.79 234.58,65.58 242.08,111.00
             243.12,117.27 243.99,123.64 244.00,130.00
             244.02,144.10 244.32,147.69 242.27,162.00
             241.83,165.04 239.49,174.77 240.32,176.82
             241.21,179.00 244.11,180.72 246.00,182.00
             246.00,182.00 261.00,191.69 261.00,191.69
             261.00,191.69 299.00,216.34 299.00,216.34
             303.85,219.51 314.92,227.74 320.00,228.87
             320.00,228.87 328.00,228.87 328.00,228.87
             353.76,229.31 377.05,244.46 398.00,257.58
             398.00,257.58 498.00,322.34 498.00,322.34
             498.00,322.34 535.00,346.34 535.00,346.34
             537.35,347.88 547.64,355.28 549.58,355.40
             552.75,355.60 558.74,347.40 561.04,345.00
             571.16,334.41 578.27,327.67 590.00,318.87
             617.21,298.47 658.51,280.41 693.00,280.00
             693.00,280.00 708.00,279.32 708.00,279.32
             708.00,279.32 716.00,280.00 716.00,280.00
             750.23,280.40 788.08,294.21 816.00,313.72
             830.38,323.77 839.85,332.34 851.96,345.00
             854.55,347.70 860.17,356.27 864.17,355.15
             865.70,354.72 872.24,350.17 874.00,349.00
             874.00,349.00 892.00,337.33 892.00,337.33
             892.00,337.33 948.00,301.00 948.00,301.00
             948.00,301.00 1002.00,266.00 1002.00,266.00
             1016.96,256.13 1035.50,243.20 1052.00,236.81
             1062.62,232.69 1074.54,229.06 1086.00,229.00
             1098.78,228.94 1102.62,223.85 1113.00,217.00
             1113.00,217.00 1145.00,196.33 1145.00,196.33
             1145.00,196.33 1164.00,184.00 1164.00,184.00
             1166.08,182.62 1171.01,179.62 1172.23,177.68
             1174.02,174.83 1172.05,170.14 1171.46,167.00
             1170.29,160.79 1169.01,150.26 1169.00,144.00
             1169.00,144.00 1169.00,128.00 1169.00,128.00
             1169.00,128.00 1170.92,111.00 1170.92,111.00
             1177.68,70.10 1202.27,30.69 1240.00,11.81
             1260.61,1.50 1275.48,-0.26 1298.00,0.00
             1308.63,0.13 1319.04,2.79 1329.00,6.31
             1366.93,19.73 1394.15,52.23 1406.25,90.00
             1412.99,111.02 1413.25,125.41 1413.00,147.00
             1412.87,157.43 1410.28,169.97 1407.42,180.00
             1394.34,225.84 1359.20,264.46 1311.00,272.92
             1283.72,277.70 1256.86,272.77 1233.00,258.55
             1225.34,253.98 1215.21,246.36 1209.04,240.00
             1206.38,237.25 1203.27,231.86 1199.00,233.11
             1199.00,233.11 1174.00,249.00 1174.00,249.00
             1174.00,249.00 1139.00,271.67 1139.00,271.67
             1135.25,274.16 1125.94,279.61 1123.39,282.32
             1123.39,282.32 1111.96,301.00 1111.96,301.00
             1104.97,310.95 1095.45,320.56 1086.00,328.20
             1086.00,328.20 1039.00,359.69 1039.00,359.69
             1039.00,359.69 957.00,413.00 957.00,413.00
             957.00,413.00 925.00,433.81 925.00,433.81
             921.94,435.71 910.26,442.98 908.69,445.32
             906.47,448.63 909.76,458.06 910.55,462.00
             913.12,474.85 914.85,487.90 915.00,501.00
             915.00,501.00 915.99,514.00 915.99,514.00
             915.99,514.00 915.00,527.00 915.00,527.00
             914.89,536.70 914.11,546.40 912.56,556.00
             902.00,621.69 867.57,682.14 811.00,718.69
             795.57,728.66 770.18,741.20 752.00,744.00
             752.00,744.00 752.00,957.00 752.00,957.00
             752.00,957.00 751.00,973.00 751.00,973.00
             750.94,985.97 748.84,999.51 745.29,1012.00
             741.20,1026.40 735.46,1036.26 734.64,1039.00
             733.89,1041.55 734.00,1044.36 734.00,1047.00
             734.00,1047.00 734.00,1133.00 734.00,1133.00
             734.00,1135.18 733.78,1138.73 735.02,1140.57
             736.56,1142.84 749.62,1146.98 753.00,1148.43
             764.46,1153.33 777.17,1162.27 786.00,1171.00
             815.54,1200.20 829.48,1237.73 829.00,1279.00
             829.00,1279.00 828.09,1289.00 828.09,1289.00
             824.35,1340.23 793.77,1389.45 744.00,1407.14
             726.80,1413.25 715.76,1413.20 698.00,1413.00
             683.63,1412.83 665.52,1406.74 653.00,1399.86
             612.08,1377.36 588.26,1334.88 584.91,1289.00
             584.91,1289.00 584.00,1279.00 584.00,1279.00
             583.52,1237.89 597.58,1200.08 627.00,1171.00
             635.83,1162.27 648.54,1153.33 660.00,1148.43
             663.38,1146.98 676.44,1142.84 677.98,1140.57
             679.22,1138.73 679.00,1135.18 679.00,1133.00
             679.00,1133.00 679.00,1047.00 679.00,1047.00
             679.00,1044.36 679.11,1041.55 678.36,1039.00
             677.54,1036.26 671.80,1026.40 667.71,1012.00
             664.54,1000.85 662.02,985.57 662.00,974.00
             662.00,974.00 661.00,957.00 661.00,957.00
             661.00,957.00 661.00,744.00 661.00,744.00
             642.09,741.09 617.04,728.34 601.00,718.05 Z
           M 210.00,134.00
           C 209.92,85.19 172.10,37.41 121.00,38.00
             114.21,38.08 104.48,39.67 98.00,41.75
             87.02,45.27 76.87,51.16 68.00,58.46
             58.80,66.04 50.14,78.33 44.81,89.00
             35.74,107.14 33.77,123.09 34.00,143.00
             34.46,181.85 60.80,220.51 98.00,232.64
             109.04,236.24 115.70,236.13 127.00,236.00
             140.32,235.84 154.81,230.16 166.00,223.19
             171.42,219.81 177.20,215.87 180.00,210.00
             159.62,196.41 133.66,177.09 120.92,156.00
             114.53,145.42 109.15,130.69 126.00,126.68
             128.31,126.13 130.64,125.95 133.00,126.09
             150.64,127.12 173.61,137.86 189.00,146.31
             195.37,149.81 201.14,154.47 208.00,157.00
             210.12,148.40 210.01,142.66 210.00,134.00 Z
           M 1248.00,223.80
           C 1265.31,234.32 1277.23,236.23 1297.00,236.00
             1304.18,235.91 1313.33,233.44 1320.00,230.80
             1354.49,217.14 1378.56,179.97 1379.00,143.00
             1379.22,124.11 1377.31,107.21 1368.73,90.00
             1363.20,78.90 1354.58,66.35 1345.00,58.46
             1335.92,50.99 1326.23,45.33 1315.00,41.75
             1309.25,39.91 1298.03,38.06 1292.00,38.00
             1240.92,37.49 1203.08,85.24 1203.00,134.00
             1202.99,142.66 1202.88,148.40 1205.00,157.00
             1211.86,154.47 1217.63,149.81 1224.00,146.31
             1239.39,137.86 1262.36,127.12 1280.00,126.09
             1282.36,125.95 1284.69,126.13 1287.00,126.68
             1303.85,130.69 1298.47,145.42 1292.08,156.00
             1279.24,177.25 1253.51,196.32 1233.00,210.00
             1235.96,216.20 1242.25,220.30 1248.00,223.80 Z
           M 788.00,353.00
           C 741.80,322.60 683.39,321.58 635.00,347.22
             623.52,353.30 614.82,359.51 605.00,368.00
             599.67,372.61 594.04,377.53 591.00,384.00
             591.00,384.00 624.00,404.95 624.00,404.95
             648.05,420.21 672.85,435.09 690.50,458.00
             695.40,464.36 700.39,472.56 703.40,480.00
             703.40,480.00 707.00,489.00 707.00,489.00
             708.80,477.51 717.61,463.87 724.92,455.00
             742.62,433.54 765.82,419.65 789.00,404.95
             789.00,404.95 822.00,384.00 822.00,384.00
             816.80,372.94 798.32,359.79 788.00,353.00 Z
           M 542.85,490.00
           C 542.85,490.00 541.04,515.00 541.04,515.00
             541.04,515.00 542.00,530.00 542.00,530.00
             542.12,539.93 545.55,557.21 548.12,567.00
             558.30,605.82 578.76,640.02 610.00,665.58
             622.83,676.07 644.81,689.21 661.00,693.00
             661.00,654.35 658.19,601.40 668.15,565.00
             673.51,545.43 680.41,539.47 684.00,531.00
             643.71,536.31 621.14,519.40 589.00,498.69
             589.00,498.69 547.00,471.00 547.00,471.00
             544.11,475.94 543.53,484.26 542.85,490.00 Z
           M 832.00,493.66
           C 798.13,515.77 771.69,536.63 729.00,531.00
             732.59,539.47 739.49,545.43 744.85,565.00
             754.81,601.40 752.00,654.35 752.00,693.00
             769.97,688.79 791.94,674.82 806.00,663.08
             846.48,629.29 868.77,577.01 871.04,525.00
             871.04,525.00 871.98,515.00 871.98,515.00
             871.98,515.00 871.09,504.00 871.09,504.00
             870.34,493.09 869.83,482.68 867.00,472.00
             860.70,474.00 839.03,489.06 832.00,493.66 Z
           M 645.92,1204.04
           C 629.60,1221.01 620.61,1243.70 618.91,1267.00
             618.63,1270.87 617.85,1272.80 618.09,1277.00
             620.27,1315.38 637.04,1351.80 674.00,1368.14
             682.57,1371.93 693.61,1374.89 703.00,1375.00
             713.56,1375.12 721.89,1374.39 732.00,1370.92
             799.28,1347.85 814.29,1253.14 767.08,1204.04
             758.08,1194.67 746.72,1185.63 734.00,1182.00
             734.00,1182.00 733.00,1206.00 733.00,1206.00
             732.97,1222.61 728.93,1246.22 723.67,1262.00
             721.35,1268.95 714.37,1285.50 705.00,1283.53
             696.50,1281.73 691.07,1267.37 688.67,1260.00
             683.88,1245.32 680.02,1221.41 680.00,1206.00
             680.00,1206.00 679.00,1182.00 679.00,1182.00
             666.28,1185.63 654.92,1194.67 645.92,1204.04 Z"/>
</svg>
