SEARCH_DIR(E:\Lazarus\components\zeos\lib\i386-win32\)
SEARCH_DIR(E:\Lazarus\components\sqldb\lib\i386-win32\win32\)
SEARCH_DIR(E:\Lazarus\components\richmemo\lib\i386-win32\)
SEARCH_DIR(E:\Lazarus\components\ideintf\units\i386-win32\win32\)
SEARCH_DIR(E:\Lazarus\components\synedit\units\i386-win32\win32\)
SEARCH_DIR(E:\Lazarus\components\lazcontrols\lib\i386-win32\win32\)
SEARCH_DIR(E:\Lazarus\lcl\units\i386-win32\win32\)
SEARCH_DIR(E:\Lazarus\lcl\units\i386-win32\)
SEARCH_DIR(E:\Lazarus\components\codetools\units\i386-win32\)
SEARCH_DIR(E:\Lazarus\components\synapse\lib\i386-win32\)
SEARCH_DIR(E:\Lazarus\components\lazutils\lib\i386-win32\)
SEARCH_DIR(E:\Lazarus\packager\units\i386-win32\)
SEARCH_DIR(.\)
SEARCH_DIR(E:\Lazarus\components\indy\)
SEARCH_DIR(E:\Lazarus\fpc\2.6.4\source\packages\indy\)
SEARCH_DIR(E:\Lazarus\fpc\2.6.4\units\i386-win32\httpd22\)
SEARCH_DIR(E:\Lazarus\fpc\2.6.4\units\i386-win32\rtl\)
SEARCH_DIR(E:\Lazarus\fpc\2.6.4\units\i386-win32\zorba\)
SEARCH_DIR(E:\Lazarus\fpc\2.6.4\units\i386-win32\zlib\)
SEARCH_DIR(E:\Lazarus\fpc\2.6.4\units\i386-win32\winunits-jedi\)
SEARCH_DIR(E:\Lazarus\fpc\2.6.4\units\i386-win32\winunits-base\)
SEARCH_DIR(E:\Lazarus\fpc\2.6.4\units\i386-win32\winceunits\)
SEARCH_DIR(E:\Lazarus\fpc\2.6.4\units\i386-win32\unzip\)
SEARCH_DIR(E:\Lazarus\fpc\2.6.4\units\i386-win32\tcl\)
SEARCH_DIR(E:\Lazarus\fpc\2.6.4\units\i386-win32\symbolic\)
SEARCH_DIR(E:\Lazarus\fpc\2.6.4\units\i386-win32\sqlite\)
SEARCH_DIR(E:\Lazarus\fpc\2.6.4\units\i386-win32\sdl\)
SEARCH_DIR(E:\Lazarus\fpc\2.6.4\units\i386-win32\rsvg\)
SEARCH_DIR(E:\Lazarus\fpc\2.6.4\units\i386-win32\regexpr\)
SEARCH_DIR(E:\Lazarus\fpc\2.6.4\units\i386-win32\pxlib\)
SEARCH_DIR(E:\Lazarus\fpc\2.6.4\units\i386-win32\ptc\)
SEARCH_DIR(E:\Lazarus\fpc\2.6.4\units\i386-win32\postgres\)
SEARCH_DIR(E:\Lazarus\fpc\2.6.4\units\i386-win32\pcap\)
SEARCH_DIR(E:\Lazarus\fpc\2.6.4\units\i386-win32\paszlib\)
SEARCH_DIR(E:\Lazarus\fpc\2.6.4\units\i386-win32\pasjpeg\)
SEARCH_DIR(E:\Lazarus\fpc\2.6.4\units\i386-win32\oracle\)
SEARCH_DIR(E:\Lazarus\fpc\2.6.4\units\i386-win32\openssl\)
SEARCH_DIR(E:\Lazarus\fpc\2.6.4\units\i386-win32\opengl\)
SEARCH_DIR(E:\Lazarus\fpc\2.6.4\units\i386-win32\opencl\)
SEARCH_DIR(E:\Lazarus\fpc\2.6.4\units\i386-win32\openal\)
SEARCH_DIR(E:\Lazarus\fpc\2.6.4\units\i386-win32\oggvorbis\)
SEARCH_DIR(E:\Lazarus\fpc\2.6.4\units\i386-win32\odbc\)
SEARCH_DIR(E:\Lazarus\fpc\2.6.4\units\i386-win32\nvapi\)
SEARCH_DIR(E:\Lazarus\fpc\2.6.4\units\i386-win32\numlib\)
SEARCH_DIR(E:\Lazarus\fpc\2.6.4\units\i386-win32\mysql\)
SEARCH_DIR(E:\Lazarus\fpc\2.6.4\units\i386-win32\mad\)
SEARCH_DIR(E:\Lazarus\fpc\2.6.4\units\i386-win32\lua\)
SEARCH_DIR(E:\Lazarus\fpc\2.6.4\units\i386-win32\libxml2\)
SEARCH_DIR(E:\Lazarus\fpc\2.6.4\units\i386-win32\libvlc\)
SEARCH_DIR(E:\Lazarus\fpc\2.6.4\units\i386-win32\libsee\)
SEARCH_DIR(E:\Lazarus\fpc\2.6.4\units\i386-win32\libpng\)
SEARCH_DIR(E:\Lazarus\fpc\2.6.4\units\i386-win32\libgd\)
SEARCH_DIR(E:\Lazarus\fpc\2.6.4\units\i386-win32\lexyacc\)
SEARCH_DIR(E:\Lazarus\fpc\2.6.4\units\i386-win32\imagemagick\)
SEARCH_DIR(E:\Lazarus\fpc\2.6.4\units\i386-win32\ibase\)
SEARCH_DIR(E:\Lazarus\fpc\2.6.4\units\i386-win32\httpd24\)
SEARCH_DIR(E:\Lazarus\fpc\2.6.4\units\i386-win32\hermes\)
SEARCH_DIR(E:\Lazarus\fpc\2.6.4\units\i386-win32\hash\)
SEARCH_DIR(E:\Lazarus\fpc\2.6.4\units\i386-win32\gtk2\)
SEARCH_DIR(E:\Lazarus\fpc\2.6.4\units\i386-win32\gtk1\)
SEARCH_DIR(E:\Lazarus\fpc\2.6.4\units\i386-win32\graph\)
SEARCH_DIR(E:\Lazarus\fpc\2.6.4\units\i386-win32\gmp\)
SEARCH_DIR(E:\Lazarus\fpc\2.6.4\units\i386-win32\gdbint\)
SEARCH_DIR(E:\Lazarus\fpc\2.6.4\units\i386-win32\fv\)
SEARCH_DIR(E:\Lazarus\fpc\2.6.4\units\i386-win32\fppkg\)
SEARCH_DIR(E:\Lazarus\fpc\2.6.4\units\i386-win32\fpmkunit\)
SEARCH_DIR(E:\Lazarus\fpc\2.6.4\units\i386-win32\fpindexer\)
SEARCH_DIR(E:\Lazarus\fpc\2.6.4\units\i386-win32\fpgtk\)
SEARCH_DIR(E:\Lazarus\fpc\2.6.4\units\i386-win32\fftw\)
SEARCH_DIR(E:\Lazarus\fpc\2.6.4\units\i386-win32\fcl-xml\)
SEARCH_DIR(E:\Lazarus\fpc\2.6.4\units\i386-win32\fcl-web\)
SEARCH_DIR(E:\Lazarus\fpc\2.6.4\units\i386-win32\fcl-res\)
SEARCH_DIR(E:\Lazarus\fpc\2.6.4\units\i386-win32\fcl-registry\)
SEARCH_DIR(E:\Lazarus\fpc\2.6.4\units\i386-win32\fcl-process\)
SEARCH_DIR(E:\Lazarus\fpc\2.6.4\units\i386-win32\fcl-passrc\)
SEARCH_DIR(E:\Lazarus\fpc\2.6.4\units\i386-win32\fcl-net\)
SEARCH_DIR(E:\Lazarus\fpc\2.6.4\units\i386-win32\fcl-json\)
SEARCH_DIR(E:\Lazarus\fpc\2.6.4\units\i386-win32\fcl-js\)
SEARCH_DIR(E:\Lazarus\fpc\2.6.4\units\i386-win32\fcl-image\)
SEARCH_DIR(E:\Lazarus\fpc\2.6.4\units\i386-win32\fcl-fpcunit\)
SEARCH_DIR(E:\Lazarus\fpc\2.6.4\units\i386-win32\fcl-extra\)
SEARCH_DIR(E:\Lazarus\fpc\2.6.4\units\i386-win32\fcl-db\)
SEARCH_DIR(E:\Lazarus\fpc\2.6.4\units\i386-win32\fcl-base\)
SEARCH_DIR(E:\Lazarus\fpc\2.6.4\units\i386-win32\fastcgi\)
SEARCH_DIR(E:\Lazarus\fpc\2.6.4\units\i386-win32\dblib\)
SEARCH_DIR(E:\Lazarus\fpc\2.6.4\units\i386-win32\chm\)
SEARCH_DIR(E:\Lazarus\fpc\2.6.4\units\i386-win32\cdrom\)
SEARCH_DIR(E:\Lazarus\fpc\2.6.4\units\i386-win32\cairo\)
SEARCH_DIR(E:\Lazarus\fpc\2.6.4\units\i386-win32\bzip2\)
SEARCH_DIR(E:\Lazarus\fpc\2.6.4\units\i386-win32\aspell\)
SEARCH_DIR(E:\Lazarus\fpc\2.6.4\units\i386-win32\a52\)
SEARCH_DIR(E:\Lazarus\fpc\2.6.4\units\i386-win32\)
SEARCH_DIR(E:\Lazarus\fpc\2.6.4\bin\i386-win32\)
INPUT(
C:\Users\GinTR1k\Desktop\geography\lib\i386-win32\project1.o
C:\Users\GinTR1k\Desktop\geography\lib\i386-win32\project1.or
E:\Lazarus\fpc\2.6.4\units\i386-win32\rtl\system.o
E:\Lazarus\fpc\2.6.4\units\i386-win32\rtl\lineinfo.o
E:\Lazarus\fpc\2.6.4\units\i386-win32\rtl\exeinfo.o
E:\Lazarus\fpc\2.6.4\units\i386-win32\rtl\strings.o
E:\Lazarus\fpc\2.6.4\units\i386-win32\rtl\windows.o
E:\Lazarus\fpc\2.6.4\units\i386-win32\rtl\objpas.o
E:\Lazarus\fpc\2.6.4\units\i386-win32\rtl\fpintres.o
E:\Lazarus\lcl\units\i386-win32\win32\interfaces.o
E:\Lazarus\lcl\units\i386-win32\forms.o
C:\Users\GinTR1k\Desktop\geography\lib\i386-win32\unit1.o
E:\Lazarus\components\zeos\lib\i386-win32\zcomponent.o
E:\Lazarus\components\synapse\lib\i386-win32\laz_synapse.o
C:\Users\GinTR1k\Desktop\geography\lib\i386-win32\unit2.o
C:\Users\GinTR1k\Desktop\geography\lib\i386-win32\unit3.o
C:\Users\GinTR1k\Desktop\geography\lib\i386-win32\unit4.o
C:\Users\GinTR1k\Desktop\geography\lib\i386-win32\unit5.o
C:\Users\GinTR1k\Desktop\geography\lib\i386-win32\unit6.o
C:\Users\GinTR1k\Desktop\geography\lib\i386-win32\unit7.o
C:\Users\GinTR1k\Desktop\geography\lib\i386-win32\unit8.o
C:\Users\GinTR1k\Desktop\geography\lib\i386-win32\unit9.o
C:\Users\GinTR1k\Desktop\geography\lib\i386-win32\unit10.o
C:\Users\GinTR1k\Desktop\geography\lib\i386-win32\unit11.o
C:\Users\GinTR1k\Desktop\geography\lib\i386-win32\unit12.o
C:\Users\GinTR1k\Desktop\geography\lib\i386-win32\unit13.o
E:\Lazarus\lcl\units\i386-win32\interfacebase.o
E:\Lazarus\fpc\2.6.4\units\i386-win32\rtl\types.o
E:\Lazarus\fpc\2.6.4\units\i386-win32\rtl\classes.o
E:\Lazarus\fpc\2.6.4\units\i386-win32\rtl\sysutils.o
E:\Lazarus\fpc\2.6.4\units\i386-win32\rtl\math.o
E:\Lazarus\lcl\units\i386-win32\lclstrconsts.o
E:\Lazarus\lcl\units\i386-win32\lcltype.o
E:\Lazarus\lcl\units\i386-win32\lclproc.o
E:\Lazarus\lcl\units\i386-win32\lmessages.o
E:\Lazarus\fpc\2.6.4\units\i386-win32\fcl-image\fpimage.o
E:\Lazarus\lcl\units\i386-win32\graphtype.o
E:\Lazarus\lcl\units\i386-win32\graphmath.o
E:\Lazarus\lcl\units\i386-win32\intfgraphics.o
E:\Lazarus\lcl\units\i386-win32\themes.o
E:\Lazarus\fpc\2.6.4\units\i386-win32\rtl\rtlconsts.o
E:\Lazarus\fpc\2.6.4\units\i386-win32\rtl\typinfo.o
E:\Lazarus\fpc\2.6.4\units\i386-win32\rtl\sysconst.o
E:\Lazarus\fpc\2.6.4\units\i386-win32\rtl\windirs.o
E:\Lazarus\fpc\2.6.4\units\i386-win32\winunits-base\win9xwsmanager.o
E:\Lazarus\components\lazutils\lib\i386-win32\lazlogger.o
E:\Lazarus\components\lazutils\lib\i386-win32\fpcadds.o
E:\Lazarus\components\lazutils\lib\i386-win32\avglvltree.o
E:\Lazarus\components\lazutils\lib\i386-win32\fileutil.o
E:\Lazarus\lcl\units\i386-win32\wsreferences.o
E:\Lazarus\components\lazutils\lib\i386-win32\lazmethodlist.o
E:\Lazarus\components\lazutils\lib\i386-win32\lazutf8.o
E:\Lazarus\components\lazutils\lib\i386-win32\lazutf8classes.o
E:\Lazarus\components\lazutils\lib\i386-win32\lazloggerbase.o
E:\Lazarus\components\lazutils\lib\i386-win32\lazclasses.o
E:\Lazarus\fpc\2.6.4\units\i386-win32\fcl-base\gettext.o
E:\Lazarus\components\lazutils\lib\i386-win32\masks.o
E:\Lazarus\components\lazutils\lib\i386-win32\lazfileutils.o
E:\Lazarus\fpc\2.6.4\units\i386-win32\fcl-base\contnrs.o
E:\Lazarus\components\lazutils\lib\i386-win32\lazutilsstrconsts.o
E:\Lazarus\fpc\2.6.4\units\i386-win32\winunits-base\shlobj.o
E:\Lazarus\fpc\2.6.4\units\i386-win32\winunits-base\activex.o
E:\Lazarus\fpc\2.6.4\units\i386-win32\winunits-base\shellapi.o
E:\Lazarus\fpc\2.6.4\units\i386-win32\winunits-base\commctrl.o
E:\Lazarus\fpc\2.6.4\units\i386-win32\rtl\variants.o
E:\Lazarus\fpc\2.6.4\units\i386-win32\rtl\ctypes.o
E:\Lazarus\fpc\2.6.4\units\i386-win32\rtl\varutils.o
E:\Lazarus\fpc\2.6.4\units\i386-win32\rtl\messages.o
E:\Lazarus\fpc\2.6.4\units\i386-win32\fcl-image\fpreadbmp.o
E:\Lazarus\fpc\2.6.4\units\i386-win32\fcl-image\fpwritebmp.o
E:\Lazarus\fpc\2.6.4\units\i386-win32\fcl-image\bmpcomn.o
E:\Lazarus\lcl\units\i386-win32\lclversion.o
E:\Lazarus\fpc\2.6.4\units\i386-win32\fcl-image\fpreadpng.o
E:\Lazarus\fpc\2.6.4\units\i386-win32\fcl-image\fpwritepng.o
E:\Lazarus\fpc\2.6.4\units\i386-win32\fcl-image\fpreadtiff.o
E:\Lazarus\fpc\2.6.4\units\i386-win32\fcl-image\fpwritetiff.o
E:\Lazarus\fpc\2.6.4\units\i386-win32\fcl-image\fptiffcmn.o
E:\Lazarus\lcl\units\i386-win32\icnstypes.o
E:\Lazarus\fpc\2.6.4\units\i386-win32\fcl-image\fpimgcmn.o
E:\Lazarus\fpc\2.6.4\units\i386-win32\fcl-image\pngcomn.o
E:\Lazarus\fpc\2.6.4\units\i386-win32\paszlib\zstream.o
E:\Lazarus\fpc\2.6.4\units\i386-win32\paszlib\zbase.o
E:\Lazarus\fpc\2.6.4\units\i386-win32\paszlib\gzio.o
E:\Lazarus\fpc\2.6.4\units\i386-win32\rtl\dos.o
E:\Lazarus\fpc\2.6.4\units\i386-win32\hash\crc.o
E:\Lazarus\fpc\2.6.4\units\i386-win32\paszlib\zdeflate.o
E:\Lazarus\fpc\2.6.4\units\i386-win32\paszlib\zinflate.o
E:\Lazarus\fpc\2.6.4\units\i386-win32\paszlib\trees.o
E:\Lazarus\fpc\2.6.4\units\i386-win32\paszlib\adler.o
E:\Lazarus\fpc\2.6.4\units\i386-win32\paszlib\infblock.o
E:\Lazarus\fpc\2.6.4\units\i386-win32\paszlib\infutil.o
E:\Lazarus\fpc\2.6.4\units\i386-win32\paszlib\infcodes.o
E:\Lazarus\fpc\2.6.4\units\i386-win32\paszlib\inftrees.o
E:\Lazarus\fpc\2.6.4\units\i386-win32\paszlib\inffast.o
E:\Lazarus\lcl\units\i386-win32\graphics.o
E:\Lazarus\lcl\units\i386-win32\lclintf.o
E:\Lazarus\fpc\2.6.4\units\i386-win32\fcl-image\fpcanvas.o
E:\Lazarus\fpc\2.6.4\units\i386-win32\fcl-image\fpreadpnm.o
E:\Lazarus\fpc\2.6.4\units\i386-win32\fcl-image\fpwritepnm.o
E:\Lazarus\fpc\2.6.4\units\i386-win32\fcl-image\fpreadjpeg.o
E:\Lazarus\fpc\2.6.4\units\i386-win32\fcl-image\fpwritejpeg.o
E:\Lazarus\fpc\2.6.4\units\i386-win32\fcl-image\fpreadgif.o
E:\Lazarus\lcl\units\i386-win32\lresources.o
E:\Lazarus\lcl\units\i386-win32\lclrescache.o
E:\Lazarus\fpc\2.6.4\units\i386-win32\fcl-image\clipping.o
E:\Lazarus\fpc\2.6.4\units\i386-win32\pasjpeg\jpeglib.o
E:\Lazarus\fpc\2.6.4\units\i386-win32\pasjpeg\jdapimin.o
E:\Lazarus\fpc\2.6.4\units\i386-win32\pasjpeg\jdatasrc.o
E:\Lazarus\fpc\2.6.4\units\i386-win32\pasjpeg\jdapistd.o
E:\Lazarus\fpc\2.6.4\units\i386-win32\pasjpeg\jmorecfg.o
E:\Lazarus\fpc\2.6.4\units\i386-win32\pasjpeg\jdeferr.o
E:\Lazarus\fpc\2.6.4\units\i386-win32\pasjpeg\jinclude.o
E:\Lazarus\fpc\2.6.4\units\i386-win32\pasjpeg\jerror.o
E:\Lazarus\fpc\2.6.4\units\i386-win32\pasjpeg\jmemmgr.o
E:\Lazarus\fpc\2.6.4\units\i386-win32\pasjpeg\jdmarker.o
E:\Lazarus\fpc\2.6.4\units\i386-win32\pasjpeg\jdinput.o
E:\Lazarus\fpc\2.6.4\units\i386-win32\pasjpeg\jcomapi.o
E:\Lazarus\fpc\2.6.4\units\i386-win32\pasjpeg\jutils.o
E:\Lazarus\fpc\2.6.4\units\i386-win32\pasjpeg\jmemnobs.o
E:\Lazarus\fpc\2.6.4\units\i386-win32\pasjpeg\jdmaster.o
E:\Lazarus\fpc\2.6.4\units\i386-win32\pasjpeg\jdcolor.o
E:\Lazarus\fpc\2.6.4\units\i386-win32\pasjpeg\jdsample.o
E:\Lazarus\fpc\2.6.4\units\i386-win32\pasjpeg\jdpostct.o
E:\Lazarus\fpc\2.6.4\units\i386-win32\pasjpeg\jddctmgr.o
E:\Lazarus\fpc\2.6.4\units\i386-win32\pasjpeg\jdphuff.o
E:\Lazarus\fpc\2.6.4\units\i386-win32\pasjpeg\jdhuff.o
E:\Lazarus\fpc\2.6.4\units\i386-win32\pasjpeg\jdcoefct.o
E:\Lazarus\fpc\2.6.4\units\i386-win32\pasjpeg\jdmainct.o
E:\Lazarus\fpc\2.6.4\units\i386-win32\pasjpeg\jquant1.o
E:\Lazarus\fpc\2.6.4\units\i386-win32\pasjpeg\jquant2.o
E:\Lazarus\fpc\2.6.4\units\i386-win32\pasjpeg\jdmerge.o
E:\Lazarus\fpc\2.6.4\units\i386-win32\pasjpeg\jdct.o
E:\Lazarus\fpc\2.6.4\units\i386-win32\pasjpeg\jidctfst.o
E:\Lazarus\fpc\2.6.4\units\i386-win32\pasjpeg\jidctint.o
E:\Lazarus\fpc\2.6.4\units\i386-win32\pasjpeg\jidctflt.o
E:\Lazarus\fpc\2.6.4\units\i386-win32\pasjpeg\jidctred.o
E:\Lazarus\fpc\2.6.4\units\i386-win32\pasjpeg\jcapistd.o
E:\Lazarus\fpc\2.6.4\units\i386-win32\pasjpeg\jcapimin.o
E:\Lazarus\fpc\2.6.4\units\i386-win32\pasjpeg\jdatadst.o
E:\Lazarus\fpc\2.6.4\units\i386-win32\pasjpeg\jcparam.o
E:\Lazarus\fpc\2.6.4\units\i386-win32\pasjpeg\jcinit.o
E:\Lazarus\fpc\2.6.4\units\i386-win32\pasjpeg\jcmarker.o
E:\Lazarus\fpc\2.6.4\units\i386-win32\pasjpeg\jcphuff.o
E:\Lazarus\fpc\2.6.4\units\i386-win32\pasjpeg\jchuff.o
E:\Lazarus\fpc\2.6.4\units\i386-win32\pasjpeg\jcmaster.o
E:\Lazarus\fpc\2.6.4\units\i386-win32\pasjpeg\jccolor.o
E:\Lazarus\fpc\2.6.4\units\i386-win32\pasjpeg\jcsample.o
E:\Lazarus\fpc\2.6.4\units\i386-win32\pasjpeg\jcprepct.o
E:\Lazarus\fpc\2.6.4\units\i386-win32\pasjpeg\jcdctmgr.o
E:\Lazarus\fpc\2.6.4\units\i386-win32\pasjpeg\jccoefct.o
E:\Lazarus\fpc\2.6.4\units\i386-win32\pasjpeg\jcmainct.o
E:\Lazarus\fpc\2.6.4\units\i386-win32\pasjpeg\jfdctint.o
E:\Lazarus\fpc\2.6.4\units\i386-win32\pasjpeg\jfdctfst.o
E:\Lazarus\fpc\2.6.4\units\i386-win32\pasjpeg\jfdctflt.o
E:\Lazarus\lcl\units\i386-win32\dynqueue.o
E:\Lazarus\components\lazutils\lib\i386-win32\lazconfigstorage.o
E:\Lazarus\fpc\2.6.4\units\i386-win32\fcl-base\syncobjs.o
E:\Lazarus\components\lazutils\lib\i386-win32\utf8process.o
E:\Lazarus\lcl\units\i386-win32\maps.o
E:\Lazarus\components\lazutils\lib\i386-win32\lazutf8sysutils.o
E:\Lazarus\lcl\units\i386-win32\tmschema.o
E:\Lazarus\fpc\2.6.4\units\i386-win32\fcl-process\process.o
E:\Lazarus\fpc\2.6.4\units\i386-win32\fcl-process\pipes.o
E:\Lazarus\lcl\units\i386-win32\win32\win32int.o
E:\Lazarus\lcl\units\i386-win32\translations.o
E:\Lazarus\lcl\units\i386-win32\comctrls.o
E:\Lazarus\lcl\units\i386-win32\controls.o
E:\Lazarus\lcl\units\i386-win32\buttons.o
E:\Lazarus\lcl\units\i386-win32\dialogs.o
E:\Lazarus\lcl\units\i386-win32\stdctrls.o
E:\Lazarus\lcl\units\i386-win32\win32\win32def.o
E:\Lazarus\lcl\units\i386-win32\menus.o
E:\Lazarus\fpc\2.6.4\units\i386-win32\winunits-base\multimon.o
E:\Lazarus\lcl\units\i386-win32\stringhashlist.o
E:\Lazarus\components\lazutils\lib\i386-win32\lconvencoding.o
E:\Lazarus\fpc\2.6.4\units\i386-win32\fcl-json\jsonparser.o
E:\Lazarus\fpc\2.6.4\units\i386-win32\fcl-json\fpjson.o
E:\Lazarus\fpc\2.6.4\units\i386-win32\fcl-json\jsonscanner.o
E:\Lazarus\lcl\units\i386-win32\imglist.o
E:\Lazarus\lcl\units\i386-win32\actnlist.o
E:\Lazarus\lcl\units\i386-win32\extctrls.o
E:\Lazarus\lcl\units\i386-win32\toolwin.o
E:\Lazarus\lcl\units\i386-win32\wslclclasses.o
E:\Lazarus\lcl\units\i386-win32\lclclasses.o
E:\Lazarus\lcl\units\i386-win32\wsimglist.o
E:\Lazarus\lcl\units\i386-win32\wsproc.o
E:\Lazarus\lcl\units\i386-win32\wsfactory.o
E:\Lazarus\lcl\units\i386-win32\propertystorage.o
E:\Lazarus\fpc\2.6.4\units\i386-win32\fcl-base\rttiutils.o
E:\Lazarus\fpc\2.6.4\units\i386-win32\rtl\strutils.o
E:\Lazarus\lcl\units\i386-win32\wsmenus.o
E:\Lazarus\lcl\units\i386-win32\customtimer.o
E:\Lazarus\lcl\units\i386-win32\clipbrd.o
E:\Lazarus\fpc\2.6.4\units\i386-win32\fcl-base\custapp.o
E:\Lazarus\lcl\units\i386-win32\helpintfs.o
E:\Lazarus\lcl\units\i386-win32\wscontrols.o
E:\Lazarus\lcl\units\i386-win32\wsforms.o
E:\Lazarus\lcl\units\i386-win32\extendedstrings.o
E:\Lazarus\lcl\units\i386-win32\textstrings.o
E:\Lazarus\lcl\units\i386-win32\wsstdctrls.o
E:\Lazarus\lcl\units\i386-win32\popupnotifier.o
E:\Lazarus\fpc\2.6.4\units\i386-win32\rtl\fgl.o
E:\Lazarus\lcl\units\i386-win32\wsextctrls.o
E:\Lazarus\lcl\units\i386-win32\imagelistcache.o
E:\Lazarus\lcl\units\i386-win32\wsbuttons.o
E:\Lazarus\lcl\units\i386-win32\wscomctrls.o
E:\Lazarus\lcl\units\i386-win32\wstoolwin.o
E:\Lazarus\lcl\units\i386-win32\buttonpanel.o
E:\Lazarus\lcl\units\i386-win32\wsdialogs.o
E:\Lazarus\lcl\units\i386-win32\win32\win32proc.o
E:\Lazarus\lcl\units\i386-win32\win32\win32wsfactory.o
E:\Lazarus\lcl\units\i386-win32\win32\win32wscontrols.o
E:\Lazarus\lcl\units\i386-win32\win32\win32wsbuttons.o
E:\Lazarus\lcl\units\i386-win32\win32\win32wsmenus.o
E:\Lazarus\lcl\units\i386-win32\win32\win32wsstdctrls.o
E:\Lazarus\lcl\units\i386-win32\win32\win32wsdialogs.o
E:\Lazarus\lcl\units\i386-win32\win32\win32themes.o
E:\Lazarus\lcl\units\i386-win32\win32\win32extra.o
E:\Lazarus\lcl\units\i386-win32\lclmessageglue.o
E:\Lazarus\lcl\units\i386-win32\calendar.o
E:\Lazarus\lcl\units\i386-win32\spin.o
E:\Lazarus\lcl\units\i386-win32\extdlgs.o
E:\Lazarus\lcl\units\i386-win32\checklst.o
E:\Lazarus\lcl\units\i386-win32\grids.o
E:\Lazarus\lcl\units\i386-win32\wscalendar.o
E:\Lazarus\lcl\units\i386-win32\wsspin.o
E:\Lazarus\lcl\units\i386-win32\wsextdlgs.o
E:\Lazarus\lcl\units\i386-win32\wschecklst.o
E:\Lazarus\lcl\units\i386-win32\dynamicarray.o
E:\Lazarus\lcl\units\i386-win32\maskedit.o
E:\Lazarus\components\lazutils\lib\i386-win32\laz2_xmlcfg.o
E:\Lazarus\components\lazutils\lib\i386-win32\lazfilecache.o
E:\Lazarus\components\lazutils\lib\i386-win32\laz2_dom.o
E:\Lazarus\components\lazutils\lib\i386-win32\laz2_xmlread.o
E:\Lazarus\components\lazutils\lib\i386-win32\laz2_xmlwrite.o
E:\Lazarus\components\lazutils\lib\i386-win32\lazutilities.o
E:\Lazarus\components\lazutils\lib\i386-win32\lazdbglog.o
E:\Lazarus\fpc\2.6.4\units\i386-win32\fcl-base\avl_tree.o
E:\Lazarus\components\lazutils\lib\i386-win32\laz2_xmlutils.o
E:\Lazarus\fpc\2.6.4\units\i386-win32\fcl-base\uriparser.o
E:\Lazarus\lcl\units\i386-win32\wsgrids.o
E:\Lazarus\lcl\units\i386-win32\win32\win32wscalendar.o
E:\Lazarus\lcl\units\i386-win32\win32\win32wschecklst.o
E:\Lazarus\lcl\units\i386-win32\win32\win32wscomctrls.o
E:\Lazarus\lcl\units\i386-win32\win32\win32wsextctrls.o
E:\Lazarus\lcl\units\i386-win32\win32\win32wsextdlgs.o
E:\Lazarus\lcl\units\i386-win32\win32\win32wsforms.o
E:\Lazarus\lcl\units\i386-win32\win32\win32wsgrids.o
E:\Lazarus\lcl\units\i386-win32\win32\win32wsimglist.o
E:\Lazarus\lcl\units\i386-win32\win32\win32wsspin.o
E:\Lazarus\fpc\2.6.4\units\i386-win32\winunits-base\uxtheme.o
E:\Lazarus\fpc\2.6.4\units\i386-win32\winunits-base\commdlg.o
E:\Lazarus\fpc\2.6.4\units\i386-win32\fcl-db\mysql56conn.o
E:\Lazarus\fpc\2.6.4\units\i386-win32\fcl-db\sqldb.o
E:\Lazarus\fpc\2.6.4\units\i386-win32\fcl-db\db.o
E:\Lazarus\components\zeos\lib\i386-win32\ZConnection.o
E:\Lazarus\components\zeos\lib\i386-win32\ZDataset.o
E:\Lazarus\fpc\2.6.4\units\i386-win32\hash\md5.o
C:\Users\GinTR1k\Desktop\geography\lib\i386-win32\httpsend.o
E:\Lazarus\fpc\2.6.4\units\i386-win32\rtl\winsock.o
E:\Lazarus\fpc\2.6.4\units\i386-win32\fcl-res\resource.o
E:\Lazarus\fpc\2.6.4\units\i386-win32\fcl-res\versiontypes.o
E:\Lazarus\fpc\2.6.4\units\i386-win32\fcl-res\versionresource.o
E:\Lazarus\fpc\2.6.4\units\i386-win32\winunits-base\comobj.o
E:\Lazarus\fpc\2.6.4\units\i386-win32\fcl-db\bufdataset.o
E:\Lazarus\fpc\2.6.4\units\i386-win32\mysql\mysql56dyn.o
E:\Lazarus\fpc\2.6.4\units\i386-win32\fcl-db\bufdataset_parser.o
E:\Lazarus\fpc\2.6.4\units\i386-win32\rtl\fmtbcd.o
E:\Lazarus\fpc\2.6.4\units\i386-win32\fcl-base\maskutils.o
E:\Lazarus\fpc\2.6.4\units\i386-win32\fcl-db\dbconst.o
E:\Lazarus\fpc\2.6.4\units\i386-win32\fcl-db\dbf_prscore.o
E:\Lazarus\fpc\2.6.4\units\i386-win32\fcl-db\dbf_prsdef.o
E:\Lazarus\fpc\2.6.4\units\i386-win32\fcl-db\dbf_prssupp.o
E:\Lazarus\fpc\2.6.4\units\i386-win32\fcl-db\sqlscript.o
E:\Lazarus\fpc\2.6.4\units\i386-win32\rtl\dynlibs.o
E:\Lazarus\fpc\2.6.4\units\i386-win32\rtl\dateutils.o
E:\Lazarus\components\zeos\lib\i386-win32\ZAbstractConnection.o
E:\Lazarus\components\zeos\lib\i386-win32\ZClasses.o
E:\Lazarus\components\zeos\lib\i386-win32\ZDbcDbLib.o
E:\Lazarus\components\zeos\lib\i386-win32\ZDbcMySql.o
E:\Lazarus\components\zeos\lib\i386-win32\ZDbcPostgreSql.o
E:\Lazarus\components\zeos\lib\i386-win32\ZDbcInterbase6.o
E:\Lazarus\components\zeos\lib\i386-win32\ZDbcSqLite.o
E:\Lazarus\components\zeos\lib\i386-win32\ZDbcOracle.o
E:\Lazarus\components\zeos\lib\i386-win32\ZDbcASA.o
E:\Lazarus\components\zeos\lib\i386-win32\ZDbcPooled.o
E:\Lazarus\components\zeos\lib\i386-win32\ZDbcIntfs.o
E:\Lazarus\components\zeos\lib\i386-win32\ZCompatibility.o
E:\Lazarus\components\zeos\lib\i386-win32\ZURL.o
E:\Lazarus\components\zeos\lib\i386-win32\ZDbcConnection.o
E:\Lazarus\components\zeos\lib\i386-win32\ZDbcLogging.o
E:\Lazarus\components\zeos\lib\i386-win32\ZPlainDbLibDriver.o
E:\Lazarus\components\zeos\lib\i386-win32\ZPlainDbLibConstants.o
E:\Lazarus\components\zeos\lib\i386-win32\ZTokenizer.o
E:\Lazarus\components\zeos\lib\i386-win32\ZGenericSqlAnalyser.o
E:\Lazarus\components\zeos\lib\i386-win32\ZPlainDriver.o
E:\Lazarus\fpc\2.6.4\units\i386-win32\winunits-base\comconst.o
E:\Lazarus\fpc\2.6.4\units\i386-win32\winunits-base\ole2.o
E:\Lazarus\fpc\2.6.4\units\i386-win32\fcl-registry\registry.o
E:\Lazarus\fpc\2.6.4\units\i386-win32\fcl-base\inifiles.o
E:\Lazarus\components\zeos\lib\i386-win32\ZGenericSqlToken.o
E:\Lazarus\components\zeos\lib\i386-win32\ZCollections.o
E:\Lazarus\components\zeos\lib\i386-win32\ZVariant.o
E:\Lazarus\components\zeos\lib\i386-win32\ZMessages.o
E:\Lazarus\components\zeos\lib\i386-win32\ZEncoding.o
E:\Lazarus\components\zeos\lib\i386-win32\ZSysUtils.o
E:\Lazarus\components\zeos\lib\i386-win32\ZMatchPattern.o
E:\Lazarus\components\zeos\lib\i386-win32\ZSelectSchema.o
E:\Lazarus\components\zeos\lib\i386-win32\ZPlainLoader.o
E:\Lazarus\components\zeos\lib\i386-win32\ZDbcMetadata.o
E:\Lazarus\components\zeos\lib\i386-win32\ZDbcUtils.o
E:\Lazarus\components\zeos\lib\i386-win32\ZDbcResultSetMetadata.o
E:\Lazarus\components\zeos\lib\i386-win32\ZDbcCachedResultSet.o
E:\Lazarus\components\zeos\lib\i386-win32\ZDbcCache.o
E:\Lazarus\components\zeos\lib\i386-win32\ZDbcResultSet.o
E:\Lazarus\components\zeos\lib\i386-win32\ZDbcGenericResolver.o
E:\Lazarus\components\zeos\lib\i386-win32\ZDbcDbLibStatement.o
E:\Lazarus\components\zeos\lib\i386-win32\ZDbcDbLibMetadata.o
E:\Lazarus\components\zeos\lib\i386-win32\ZSybaseToken.o
E:\Lazarus\components\zeos\lib\i386-win32\ZSybaseAnalyser.o
E:\Lazarus\components\zeos\lib\i386-win32\ZDbcStatement.o
E:\Lazarus\components\zeos\lib\i386-win32\ZDbcDbLibUtils.o
E:\Lazarus\components\zeos\lib\i386-win32\ZDbcDbLibResultSet.o
E:\Lazarus\components\zeos\lib\i386-win32\ZPlainMySqlDriver.o
E:\Lazarus\components\zeos\lib\i386-win32\ZPlainMySqlConstants.o
E:\Lazarus\components\zeos\lib\i386-win32\ZDbcMySqlStatement.o
E:\Lazarus\components\zeos\lib\i386-win32\ZMySqlToken.o
E:\Lazarus\components\zeos\lib\i386-win32\ZDbcMySqlUtils.o
E:\Lazarus\components\zeos\lib\i386-win32\ZDbcMySqlMetadata.o
E:\Lazarus\components\zeos\lib\i386-win32\ZMySqlAnalyser.o
E:\Lazarus\components\zeos\lib\i386-win32\ZDbcMySqlResultSet.o
E:\Lazarus\components\zeos\lib\i386-win32\ZPlainPostgreSqlDriver.o
E:\Lazarus\components\zeos\lib\i386-win32\ZDbcPostgreSqlStatement.o
E:\Lazarus\components\zeos\lib\i386-win32\ZDbcPostgreSqlUtils.o
E:\Lazarus\components\zeos\lib\i386-win32\ZDbcPostgreSqlMetadata.o
E:\Lazarus\components\zeos\lib\i386-win32\ZPostgreSqlToken.o
E:\Lazarus\components\zeos\lib\i386-win32\ZPostgreSqlAnalyser.o
E:\Lazarus\components\zeos\lib\i386-win32\ZDbcPostgreSqlResultSet.o
E:\Lazarus\components\zeos\lib\i386-win32\ZPlainFirebirdDriver.o
E:\Lazarus\components\zeos\lib\i386-win32\ZPlainFirebirdInterbaseConstants.o
E:\Lazarus\components\zeos\lib\i386-win32\ZDbcInterbase6Utils.o
E:\Lazarus\components\zeos\lib\i386-win32\ZDbcInterbase6Statement.o
E:\Lazarus\components\zeos\lib\i386-win32\ZDbcInterbase6Metadata.o
E:\Lazarus\components\zeos\lib\i386-win32\ZInterbaseToken.o
E:\Lazarus\components\zeos\lib\i386-win32\ZInterbaseAnalyser.o
E:\Lazarus\components\zeos\lib\i386-win32\ZDbcInterbase6ResultSet.o
E:\Lazarus\components\zeos\lib\i386-win32\ZPlainSqLiteDriver.o
E:\Lazarus\components\zeos\lib\i386-win32\ZDbcSqLiteStatement.o
E:\Lazarus\components\zeos\lib\i386-win32\ZSqLiteToken.o
E:\Lazarus\components\zeos\lib\i386-win32\ZDbcSqLiteUtils.o
E:\Lazarus\components\zeos\lib\i386-win32\ZDbcSqLiteMetadata.o
E:\Lazarus\components\zeos\lib\i386-win32\ZSqLiteAnalyser.o
E:\Lazarus\components\zeos\lib\i386-win32\ZDbcSqLiteResultSet.o
E:\Lazarus\components\zeos\lib\i386-win32\ZPlainOracleDriver.o
E:\Lazarus\components\zeos\lib\i386-win32\ZPlainOracleConstants.o
E:\Lazarus\components\zeos\lib\i386-win32\ZDbcOracleStatement.o
E:\Lazarus\components\zeos\lib\i386-win32\ZDbcOracleUtils.o
E:\Lazarus\components\zeos\lib\i386-win32\ZDbcOracleMetadata.o
E:\Lazarus\components\zeos\lib\i386-win32\ZOracleToken.o
E:\Lazarus\components\zeos\lib\i386-win32\ZOracleAnalyser.o
E:\Lazarus\components\zeos\lib\i386-win32\ZDbcOracleResultSet.o
E:\Lazarus\components\zeos\lib\i386-win32\ZPlainASADriver.o
E:\Lazarus\components\zeos\lib\i386-win32\ZPlainASAConstants.o
E:\Lazarus\components\zeos\lib\i386-win32\ZDbcASAMetadata.o
E:\Lazarus\components\zeos\lib\i386-win32\ZDbcASAStatement.o
E:\Lazarus\components\zeos\lib\i386-win32\ZDbcASAUtils.o
E:\Lazarus\components\zeos\lib\i386-win32\ZDbcASAResultSet.o
E:\Lazarus\components\zeos\lib\i386-win32\ZAbstractRODataset.o
E:\Lazarus\components\zeos\lib\i386-win32\ZSequence.o
E:\Lazarus\components\zeos\lib\i386-win32\ZAbstractDataset.o
E:\Lazarus\components\zeos\lib\i386-win32\ZSqlStrings.o
E:\Lazarus\components\zeos\lib\i386-win32\ZExpression.o
E:\Lazarus\components\zeos\lib\i386-win32\ZDatasetUtils.o
E:\Lazarus\components\zeos\lib\i386-win32\ZSqlProcessor.o
E:\Lazarus\components\zeos\lib\i386-win32\ZExprParser.o
E:\Lazarus\components\zeos\lib\i386-win32\ZExprToken.o
E:\Lazarus\components\zeos\lib\i386-win32\ZVariables.o
E:\Lazarus\components\zeos\lib\i386-win32\ZFunctions.o
E:\Lazarus\components\zeos\lib\i386-win32\ZFunctionsMath.o
E:\Lazarus\components\zeos\lib\i386-win32\ZFunctionsDateTime.o
E:\Lazarus\components\zeos\lib\i386-win32\ZFunctionsStrings.o
E:\Lazarus\components\zeos\lib\i386-win32\ZFunctionsConvert.o
E:\Lazarus\components\zeos\lib\i386-win32\ZFunctionsOther.o
E:\Lazarus\components\zeos\lib\i386-win32\ZStreamBlob.o
E:\Lazarus\components\zeos\lib\i386-win32\ZSqlUpdate.o
E:\Lazarus\components\zeos\lib\i386-win32\ZScriptParser.o
E:\Lazarus\components\zeos\lib\i386-win32\ZAbstractTable.o
C:\Users\GinTR1k\Desktop\geography\lib\i386-win32\blcksock.o
C:\Users\GinTR1k\Desktop\geography\lib\i386-win32\synautil.o
C:\Users\GinTR1k\Desktop\geography\lib\i386-win32\synaip.o
C:\Users\GinTR1k\Desktop\geography\lib\i386-win32\synacode.o
C:\Users\GinTR1k\Desktop\geography\lib\i386-win32\synsock.o
C:\Users\GinTR1k\Desktop\geography\lib\i386-win32\synafpc.o
E:\Lazarus\fpc\2.6.4\units\i386-win32\fcl-res\resdatastream.o
E:\Lazarus\fpc\2.6.4\units\i386-win32\fcl-res\resourcetree.o
E:\Lazarus\fpc\2.6.4\units\i386-win32\fcl-res\resmerger.o
E:\Lazarus\fpc\2.6.4\units\i386-win32\fcl-res\resfactory.o
E:\Lazarus\fpc\2.6.4\units\i386-win32\fcl-res\stringtableresource.o
E:\Lazarus\fpc\2.6.4\units\i386-win32\fcl-res\groupiconresource.o
E:\Lazarus\fpc\2.6.4\units\i386-win32\fcl-res\groupcursorresource.o
E:\Lazarus\fpc\2.6.4\units\i386-win32\fcl-res\groupresource.o
E:\Lazarus\fpc\2.6.4\units\i386-win32\fcl-res\icocurtypes.o
E:\Lazarus\fpc\2.6.4\units\i386-win32\fcl-res\versionconsts.o
C:\Users\GinTR1k\Desktop\geography\lib\i386-win32\thread.o
C:\Users\GinTR1k\Desktop\geography\lib\i386-win32\IdSMTP.o
C:\Users\GinTR1k\Desktop\geography\lib\i386-win32\IdMessage.o
C:\Users\GinTR1k\Desktop\geography\lib\i386-win32\IdSSLOpenSSL.o
C:\Users\GinTR1k\Desktop\geography\lib\i386-win32\IdAntiFreeze.o
C:\Users\GinTR1k\Desktop\geography\lib\i386-win32\IdText.o
C:\Users\GinTR1k\Desktop\geography\lib\i386-win32\IdExplicitTLSClientServerBase.o
C:\Users\GinTR1k\Desktop\geography\lib\i386-win32\IdCoderHeader.o
C:\Users\GinTR1k\Desktop\geography\lib\i386-win32\IdComponent.o
C:\Users\GinTR1k\Desktop\geography\lib\i386-win32\IdAssignedNumbers.o
C:\Users\GinTR1k\Desktop\geography\lib\i386-win32\IdEMailAddress.o
C:\Users\GinTR1k\Desktop\geography\lib\i386-win32\IdException.o
C:\Users\GinTR1k\Desktop\geography\lib\i386-win32\IdHeaderList.o
C:\Users\GinTR1k\Desktop\geography\lib\i386-win32\IdMessageClient.o
C:\Users\GinTR1k\Desktop\geography\lib\i386-win32\IdSASL.o
C:\Users\GinTR1k\Desktop\geography\lib\i386-win32\IdSASLCollection.o
C:\Users\GinTR1k\Desktop\geography\lib\i386-win32\IdSMTPBase.o
C:\Users\GinTR1k\Desktop\geography\lib\i386-win32\IdBaseComponent.o
C:\Users\GinTR1k\Desktop\geography\lib\i386-win32\IdGlobal.o
C:\Users\GinTR1k\Desktop\geography\lib\i386-win32\IdGlobalProtocols.o
C:\Users\GinTR1k\Desktop\geography\lib\i386-win32\IdExceptionCore.o
C:\Users\GinTR1k\Desktop\geography\lib\i386-win32\IdResourceStringsProtocols.o
C:\Users\GinTR1k\Desktop\geography\lib\i386-win32\IdResourceStrings.o
C:\Users\GinTR1k\Desktop\geography\lib\i386-win32\IdStream.o
C:\Users\GinTR1k\Desktop\geography\lib\i386-win32\IdStreamVCL.o
C:\Users\GinTR1k\Desktop\geography\lib\i386-win32\IdCharsets.o
C:\Users\GinTR1k\Desktop\geography\lib\i386-win32\IdResourceStringsCore.o
C:\Users\GinTR1k\Desktop\geography\lib\i386-win32\IdStack.o
C:\Users\GinTR1k\Desktop\geography\lib\i386-win32\IdStackConsts.o
C:\Users\GinTR1k\Desktop\geography\lib\i386-win32\IdWship6.o
C:\Users\GinTR1k\Desktop\geography\lib\i386-win32\IdWinsock2.o
C:\Users\GinTR1k\Desktop\geography\lib\i386-win32\IdStackWindows.o
C:\Users\GinTR1k\Desktop\geography\lib\i386-win32\IdStackBSDBase.o
C:\Users\GinTR1k\Desktop\geography\lib\i386-win32\IdCmdTCPServer.o
C:\Users\GinTR1k\Desktop\geography\lib\i386-win32\IdIOHandler.o
C:\Users\GinTR1k\Desktop\geography\lib\i386-win32\IdServerIOHandler.o
C:\Users\GinTR1k\Desktop\geography\lib\i386-win32\IdTCPClient.o
C:\Users\GinTR1k\Desktop\geography\lib\i386-win32\IdCommandHandlers.o
C:\Users\GinTR1k\Desktop\geography\lib\i386-win32\IdContext.o
C:\Users\GinTR1k\Desktop\geography\lib\i386-win32\IdReply.o
C:\Users\GinTR1k\Desktop\geography\lib\i386-win32\IdTCPServer.o
C:\Users\GinTR1k\Desktop\geography\lib\i386-win32\IdReplyRFC.o
C:\Users\GinTR1k\Desktop\geography\lib\i386-win32\IdAntiFreezeBase.o
C:\Users\GinTR1k\Desktop\geography\lib\i386-win32\IdSocketHandle.o
C:\Users\GinTR1k\Desktop\geography\lib\i386-win32\IdTCPConnection.o
C:\Users\GinTR1k\Desktop\geography\lib\i386-win32\IdTask.o
C:\Users\GinTR1k\Desktop\geography\lib\i386-win32\IdYarn.o
C:\Users\GinTR1k\Desktop\geography\lib\i386-win32\IdIntercept.o
C:\Users\GinTR1k\Desktop\geography\lib\i386-win32\IdIOHandlerSocket.o
C:\Users\GinTR1k\Desktop\geography\lib\i386-win32\IdIOHandlerStack.o
C:\Users\GinTR1k\Desktop\geography\lib\i386-win32\IdBuffer.o
C:\Users\GinTR1k\Desktop\geography\lib\i386-win32\IdCustomTransparentProxy.o
C:\Users\GinTR1k\Desktop\geography\lib\i386-win32\IdSocks.o
C:\Users\GinTR1k\Desktop\geography\lib\i386-win32\IdIPAddress.o
C:\Users\GinTR1k\Desktop\geography\lib\i386-win32\IdCustomTCPServer.o
C:\Users\GinTR1k\Desktop\geography\lib\i386-win32\IdScheduler.o
C:\Users\GinTR1k\Desktop\geography\lib\i386-win32\IdSchedulerOfThread.o
C:\Users\GinTR1k\Desktop\geography\lib\i386-win32\IdServerIOHandlerStack.o
C:\Users\GinTR1k\Desktop\geography\lib\i386-win32\IdThread.o
C:\Users\GinTR1k\Desktop\geography\lib\i386-win32\IdThreadSafe.o
C:\Users\GinTR1k\Desktop\geography\lib\i386-win32\IdServerIOHandlerSocket.o
C:\Users\GinTR1k\Desktop\geography\lib\i386-win32\IdGlobalCore.o
C:\Users\GinTR1k\Desktop\geography\lib\i386-win32\IdSchedulerOfThreadDefault.o
C:\Users\GinTR1k\Desktop\geography\lib\i386-win32\IdSSL.o
C:\Users\GinTR1k\Desktop\geography\lib\i386-win32\IdAttachment.o
C:\Users\GinTR1k\Desktop\geography\lib\i386-win32\IdMessageParts.o
C:\Users\GinTR1k\Desktop\geography\lib\i386-win32\IdMessageCoder.o
C:\Users\GinTR1k\Desktop\geography\lib\i386-win32\IdHeaderCoderBase.o
C:\Users\GinTR1k\Desktop\geography\lib\i386-win32\IdAllHeaderCoders.o
C:\Users\GinTR1k\Desktop\geography\lib\i386-win32\IdHeaderCoderPlain.o
C:\Users\GinTR1k\Desktop\geography\lib\i386-win32\IdHeaderCoder2022JP.o
C:\Users\GinTR1k\Desktop\geography\lib\i386-win32\IdHeaderCoderUTF8.o
C:\Users\GinTR1k\Desktop\geography\lib\i386-win32\IdIOHandlerStream.o
C:\Users\GinTR1k\Desktop\geography\lib\i386-win32\IdMessageCoderMIME.o
C:\Users\GinTR1k\Desktop\geography\lib\i386-win32\IdAttachmentFile.o
C:\Users\GinTR1k\Desktop\geography\lib\i386-win32\IdTCPStream.o
C:\Users\GinTR1k\Desktop\geography\lib\i386-win32\IdCoder.o
C:\Users\GinTR1k\Desktop\geography\lib\i386-win32\IdCoderMIME.o
C:\Users\GinTR1k\Desktop\geography\lib\i386-win32\IdCoderQuotedPrintable.o
C:\Users\GinTR1k\Desktop\geography\lib\i386-win32\IdCoderBinHex4.o
C:\Users\GinTR1k\Desktop\geography\lib\i386-win32\IdCoder3to4.o
C:\Users\GinTR1k\Desktop\geography\lib\i386-win32\IdMessageCoderQuotedPrintable.o
C:\Users\GinTR1k\Desktop\geography\lib\i386-win32\IdMessageCoderUUE.o
C:\Users\GinTR1k\Desktop\geography\lib\i386-win32\IdMessageCoderXXE.o
C:\Users\GinTR1k\Desktop\geography\lib\i386-win32\IdCoderUUE.o
C:\Users\GinTR1k\Desktop\geography\lib\i386-win32\IdCoderXXE.o
C:\Users\GinTR1k\Desktop\geography\lib\i386-win32\IdCoder00E.o
C:\Users\GinTR1k\Desktop\geography\lib\i386-win32\IdReplySMTP.o
C:\Users\GinTR1k\Desktop\geography\lib\i386-win32\IdCTypes.o
C:\Users\GinTR1k\Desktop\geography\lib\i386-win32\IdSSLOpenSSLHeaders.o
C:\Users\GinTR1k\Desktop\geography\lib\i386-win32\IdHTTP.o
E:\Lazarus\components\richmemo\lib\i386-win32\richmemo.o
C:\Users\GinTR1k\Desktop\geography\lib\i386-win32\IdHTTPHeaderInfo.o
C:\Users\GinTR1k\Desktop\geography\lib\i386-win32\IdZLibCompressorBase.o
C:\Users\GinTR1k\Desktop\geography\lib\i386-win32\IdURI.o
C:\Users\GinTR1k\Desktop\geography\lib\i386-win32\IdCookie.o
C:\Users\GinTR1k\Desktop\geography\lib\i386-win32\IdCookieManager.o
C:\Users\GinTR1k\Desktop\geography\lib\i386-win32\IdAuthentication.o
C:\Users\GinTR1k\Desktop\geography\lib\i386-win32\IdAuthenticationManager.o
C:\Users\GinTR1k\Desktop\geography\lib\i386-win32\IdMultipartFormData.o
C:\Users\GinTR1k\Desktop\geography\lib\i386-win32\IdAllAuthentications.o
C:\Users\GinTR1k\Desktop\geography\lib\i386-win32\IdAuthenticationNTLM.o
C:\Users\GinTR1k\Desktop\geography\lib\i386-win32\IdAuthenticationDigest.o
C:\Users\GinTR1k\Desktop\geography\lib\i386-win32\IdNTLM.o
C:\Users\GinTR1k\Desktop\geography\lib\i386-win32\IdHash.o
C:\Users\GinTR1k\Desktop\geography\lib\i386-win32\IdHashMessageDigest.o
E:\Lazarus\lcl\units\i386-win32\printers.o
E:\Lazarus\components\richmemo\lib\i386-win32\richmemofactory.o
E:\Lazarus\components\richmemo\lib\i386-win32\wsrichmemo.o
E:\Lazarus\components\richmemo\lib\i386-win32\win32richmemo.o
E:\Lazarus\fpc\2.6.4\units\i386-win32\winunits-base\richedit.o
E:\Lazarus\components\richmemo\lib\i386-win32\win32richmemoproc.o
E:\Lazarus\components\richmemo\lib\i386-win32\win32richmemoole.o
E:\Lazarus\components\richmemo\lib\i386-win32\richmemoutils.o
E:\Lazarus\components\zeos\lib\i386-win32\ZComponentReg.o
E:\Lazarus\components\zeos\lib\i386-win32\ZUpdateSqlEditor.o
E:\Lazarus\components\zeos\lib\i386-win32\ZConnectionGroup.o
E:\Lazarus\components\zeos\lib\i386-win32\ZGroupedConnection.o
E:\Lazarus\packager\units\i386-win32\lazaruspackageintf.o
E:\Lazarus\components\zeos\lib\i386-win32\ZPropertyEditor.o
E:\Lazarus\components\ideintf\units\i386-win32\win32\propedits.o
E:\Lazarus\components\ideintf\units\i386-win32\win32\componenteditors.o
E:\Lazarus\components\zeos\lib\i386-win32\ZStoredProcedure.o
E:\Lazarus\components\zeos\lib\i386-win32\ZSqlMonitor.o
E:\Lazarus\components\zeos\lib\i386-win32\ZSqlMetadata.o
E:\Lazarus\components\zeos\lib\i386-win32\ZIBEventAlerter.o
E:\Lazarus\components\zeos\lib\i386-win32\ZPgEventAlerter.o
E:\Lazarus\lcl\units\i386-win32\editbtn.o
E:\Lazarus\lcl\units\i386-win32\valedit.o
E:\Lazarus\lcl\units\i386-win32\filectrl.o
E:\Lazarus\components\ideintf\units\i386-win32\win32\objinspstrconsts.o
E:\Lazarus\components\ideintf\units\i386-win32\win32\propeditutils.o
E:\Lazarus\components\ideintf\units\i386-win32\win32\frmselectprops.o
E:\Lazarus\components\ideintf\units\i386-win32\win32\stringspropeditdlg.o
E:\Lazarus\components\ideintf\units\i386-win32\win32\keyvalpropeditdlg.o
E:\Lazarus\components\ideintf\units\i386-win32\win32\collectionpropeditform.o
E:\Lazarus\components\ideintf\units\i386-win32\win32\filefilterpropeditor.o
E:\Lazarus\lcl\units\i386-win32\calendarpopup.o
E:\Lazarus\lcl\units\i386-win32\shellctrls.o
E:\Lazarus\components\ideintf\units\i386-win32\win32\idewindowintf.o
E:\Lazarus\components\ideintf\units\i386-win32\win32\texttools.o
E:\Lazarus\components\ideintf\units\i386-win32\win32\ideimagesintf.o
E:\Lazarus\components\ideintf\units\i386-win32\win32\lazstringgridedit.o
E:\Lazarus\components\ideintf\units\i386-win32\win32\checklistboxeditordlg.o
E:\Lazarus\components\ideintf\units\i386-win32\win32\checkgroupeditordlg.o
E:\Lazarus\lcl\units\i386-win32\arrow.o
E:\Lazarus\lcl\units\i386-win32\industrialbase.o
E:\Lazarus\components\synapse\lib\i386-win32\asn1util.o
E:\Lazarus\components\synapse\lib\i386-win32\clamsend.o
E:\Lazarus\components\synapse\lib\i386-win32\dnssend.o
E:\Lazarus\components\synapse\lib\i386-win32\ftpsend.o
E:\Lazarus\components\synapse\lib\i386-win32\ftptsend.o
E:\Lazarus\components\synapse\lib\i386-win32\imapsend.o
E:\Lazarus\components\synapse\lib\i386-win32\ldapsend.o
E:\Lazarus\components\synapse\lib\i386-win32\mimeinln.o
E:\Lazarus\components\synapse\lib\i386-win32\mimemess.o
E:\Lazarus\components\synapse\lib\i386-win32\mimepart.o
E:\Lazarus\components\synapse\lib\i386-win32\nntpsend.o
E:\Lazarus\components\synapse\lib\i386-win32\pingsend.o
E:\Lazarus\components\synapse\lib\i386-win32\pop3send.o
E:\Lazarus\components\synapse\lib\i386-win32\slogsend.o
E:\Lazarus\components\synapse\lib\i386-win32\smtpsend.o
E:\Lazarus\components\synapse\lib\i386-win32\snmpsend.o
E:\Lazarus\components\synapse\lib\i386-win32\sntpsend.o
E:\Lazarus\components\synapse\lib\i386-win32\synachar.o
E:\Lazarus\components\synapse\lib\i386-win32\synacrypt.o
E:\Lazarus\components\synapse\lib\i386-win32\synadbg.o
E:\Lazarus\components\synapse\lib\i386-win32\synaicnv.o
E:\Lazarus\components\synapse\lib\i386-win32\synamisc.o
E:\Lazarus\components\synapse\lib\i386-win32\synaser.o
E:\Lazarus\components\synapse\lib\i386-win32\tlntsend.o
E:\Lazarus\fpc\2.6.4\units\i386-win32\winunits-base\winver.o
E:\Lazarus\fpc\2.6.4\units\i386-win32\rtl\sysinitpas.o
)
GROUP(
E:\Lazarus\fpc\2.6.4\units\i386-win32\rtl\libimpsystem.a
E:\Lazarus\fpc\2.6.4\units\i386-win32\rtl\libimpwindows.a
E:\Lazarus\fpc\2.6.4\units\i386-win32\rtl\libimpfpintres.a
C:\Users\GinTR1k\Desktop\geography\lib\i386-win32\libimpunit1.a
E:\Lazarus\fpc\2.6.4\units\i386-win32\rtl\libimpsysutils.a
E:\Lazarus\fpc\2.6.4\units\i386-win32\winunits-base\libimpshlobj.a
E:\Lazarus\fpc\2.6.4\units\i386-win32\winunits-base\libimpactivex.a
E:\Lazarus\fpc\2.6.4\units\i386-win32\winunits-base\libimpshellapi.a
E:\Lazarus\fpc\2.6.4\units\i386-win32\winunits-base\libimpcommctrl.a
E:\Lazarus\fpc\2.6.4\units\i386-win32\rtl\libimpvarutils.a
E:\Lazarus\fpc\2.6.4\units\i386-win32\rtl\libimpdos.a
E:\Lazarus\lcl\units\i386-win32\win32\libimpwin32extra.a
E:\Lazarus\lcl\units\i386-win32\win32\libimpwin32wsforms.a
E:\Lazarus\fpc\2.6.4\units\i386-win32\winunits-base\libimpcommdlg.a
E:\Lazarus\fpc\2.6.4\units\i386-win32\rtl\libimpwinsock.a
E:\Lazarus\fpc\2.6.4\units\i386-win32\rtl\libimpsysinitpas.a
)
SEARCH_DIR("/usr/i686-pc-cygwin/lib"); SEARCH_DIR("/usr/lib"); SEARCH_DIR("/usr/lib/w32api");
OUTPUT_FORMAT(pei-i386)
ENTRY(_mainCRTStartup)
SECTIONS
{
  . = SIZEOF_HEADERS;
  . = ALIGN(__section_alignment__);
  .text  __image_base__ + ( __section_alignment__ < 0x1000 ? . : __section_alignment__ ) :
  {
    *(.init)
    *(.text .stub .text.* .gnu.linkonce.t.*)
    *(SORT(.text$*))
    *(.glue_7t)
    *(.glue_7)
    . = ALIGN(8);
     ___CTOR_LIST__ = .; __CTOR_LIST__ = . ;
    LONG (-1);
    *(.ctors); *(.ctor); *(SORT(.ctors.*));  LONG (0);
     ___DTOR_LIST__ = .; __DTOR_LIST__ = . ;
    LONG (-1);
    *(.dtors); *(.dtor); *(SORT(.dtors.*));  LONG (0);
     *(.fini)
    PROVIDE (etext = .);
    *(.gcc_except_table)
  }
  .data BLOCK(__section_alignment__) :
  {
    __data_start__ = . ;
    *(.data .data.* .gnu.linkonce.d.* .fpc*)
    *(.data2)
    *(SORT(.data$*))
    *(.jcr)
    PROVIDE (__tls_index = .);
    LONG (0);
    __data_end__ = . ;
    *(.data_cygwin_nocopy)
  }
  .rdata BLOCK(__section_alignment__) :
  {
    *(.rdata)
    *(.rodata .rodata.* .gnu.linkonce.r.*)
    *(SORT(.rdata$*))
    *(.eh_frame)
    ___RUNTIME_PSEUDO_RELOC_LIST__ = .;
    __RUNTIME_PSEUDO_RELOC_LIST__ = .;
    *(.rdata_runtime_pseudo_reloc)
    ___RUNTIME_PSEUDO_RELOC_LIST_END__ = .;
    __RUNTIME_PSEUDO_RELOC_LIST_END__ = .;
  }
  .pdata BLOCK(__section_alignment__) : { *(.pdata) }
  .bss BLOCK(__section_alignment__) :
  {
    __bss_start__ = . ;
    *(.bss .bss.* .gnu.linkonce.b.*)
    *(SORT(.bss$*))
    *(COMMON)
    __bss_end__ = . ;
  }
  .edata BLOCK(__section_alignment__) : { *(.edata) }
  .idata BLOCK(__section_alignment__) :
  {
    SORT(*)(.idata$2)
    SORT(*)(.idata$3)
    /* These zeroes mark the end of the import list.  */
    LONG (0); LONG (0); LONG (0); LONG (0); LONG (0);
    SORT(*)(.idata$4)
    SORT(*)(.idata$5)
    SORT(*)(.idata$6)
    SORT(*)(.idata$7)
  }
  .CRT BLOCK(__section_alignment__) :
  {
    ___crt_xc_start__ = . ;
    *(SORT(.CRT$XC*))  /* C initialization */
    ___crt_xc_end__ = . ;
    ___crt_xi_start__ = . ;
    *(SORT(.CRT$XI*))  /* C++ initialization */
    ___crt_xi_end__ = . ;
    ___crt_xl_start__ = . ;
    *(SORT(.CRT$XL*))  /* TLS callbacks */
    /* ___crt_xl_end__ is defined in the TLS Directory support code */
    PROVIDE (___crt_xl_end__ = .);
    ___crt_xp_start__ = . ;
    *(SORT(.CRT$XP*))  /* Pre-termination */
    ___crt_xp_end__ = . ;
    ___crt_xt_start__ = . ;
    *(SORT(.CRT$XT*))  /* Termination */
    ___crt_xt_end__ = . ;
  }
  .tls BLOCK(__section_alignment__) :
  {
    ___tls_start__ = . ;
    *(.tls .tls.*)
    *(.tls$)
    *(SORT(.tls$*))
    ___tls_end__ = . ;
  }
  .rsrc BLOCK(__section_alignment__) :
  {
    *(.rsrc)
    *(SORT(.rsrc$*))
  }
  .reloc BLOCK(__section_alignment__) : { *(.reloc) }
  .stab BLOCK(__section_alignment__) (NOLOAD) : { *(.stab) }
  .stabstr BLOCK(__section_alignment__) (NOLOAD) : { *(.stabstr) }
  .debug_aranges BLOCK(__section_alignment__) (NOLOAD) : { *(.debug_aranges) }
  .debug_pubnames BLOCK(__section_alignment__) (NOLOAD) : { *(.debug_pubnames) }
  .debug_info BLOCK(__section_alignment__) (NOLOAD) : { *(.debug_info) *(.gnu.linkonce.wi.*) }
  .debug_abbrev BLOCK(__section_alignment__) (NOLOAD) : { *(.debug_abbrev) }
  .debug_line BLOCK(__section_alignment__) (NOLOAD) : { *(.debug_line) }
  .debug_frame BLOCK(__section_alignment__) (NOLOAD) : { *(.debug_frame) }
  .debug_str BLOCK(__section_alignment__) (NOLOAD) : { *(.debug_str) }
  .debug_loc BLOCK(__section_alignment__) (NOLOAD) : { *(.debug_loc) }
  .debug_macinfo BLOCK(__section_alignment__) (NOLOAD) : { *(.debug_macinfo) }
  .debug_weaknames BLOCK(__section_alignment__) (NOLOAD) : { *(.debug_weaknames) }
  .debug_funcnames BLOCK(__section_alignment__) (NOLOAD) : { *(.debug_funcnames) }
  .debug_typenames BLOCK(__section_alignment__) (NOLOAD) : { *(.debug_typenames) }
  .debug_varnames BLOCK(__section_alignment__) (NOLOAD) : { *(.debug_varnames) }
  .debug_ranges BLOCK(__section_alignment__) (NOLOAD) : { *(.debug_ranges) }
}
