{"text_format":"1","workbook":"xlsx","n_sheets":3,"sheets":["Лист1","Лист2","Лист3"],"not_rendered":{"charts":2,"images":2,"macros":1,"external_links":2,"defined_names":0,"comments":0,"pivot_tables":0},"unopened":[],"bounds":{"document_bytes":16777216,"sheet_cells":100000,"rows_first":2000,"rows_last":500,"rows_between":2000,"halvings":0,"cell_chars":16384,"cell_head_chars":4096},"cells_cut":0,"cells_raw":0,"read":"whole","date_system":"1900"}

{"sheet":"Лист1","index":0,"n_rows":35,"n_cols":14,"rows_kept":35,"cut":false,"hidden":false,"merged":[[5,10,5,11],[5,13,5,14],[6,12,14,14],[15,0,15,1],[15,3,15,4],[15,6,15,7],[15,12,15,14],[0,0,1,14],[2,0,2,1],[2,3,2,4],[2,6,2,7],[3,1,3,14],[4,0,4,1],[4,3,4,4],[4,6,4,7],[4,13,4,14],[16,0,16,1],[16,3,16,4],[16,6,16,7],[16,12,34,14],[17,0,17,1],[17,3,17,4],[17,6,17,7],[18,0,18,1],[18,3,18,4],[18,6,18,7],[21,0,21,1],[21,3,21,4],[21,6,21,7],[22,0,22,1],[22,3,22,4],[22,6,22,7],[19,0,19,1],[19,3,19,4],[19,6,19,7],[20,0,20,1],[20,3,20,4],[20,6,20,7],[25,0,25,1],[25,3,25,4],[25,6,25,7],[26,0,26,1],[26,3,26,4],[26,6,26,7],[23,0,23,1],[23,3,23,4],[23,6,23,7],[24,0,24,1],[24,3,24,4],[24,6,24,7],[29,0,29,1],[29,3,29,4],[29,6,29,7],[30,0,30,1],[30,3,30,4],[30,6,30,7],[27,0,27,1],[27,3,27,4],[27,6,27,7],[28,0,28,1],[28,3,28,4],[28,6,28,7],[33,0,33,1],[33,3,33,4],[33,6,33,7],[34,0,34,1],[34,3,34,4],[34,6,34,7],[31,0,31,1],[31,3,31,4],[31,6,31,7],[32,0,32,1],[32,3,32,4],[32,6,32,7],[37,0,37,1],[37,3,37,4],[37,6,37,7],[38,0,38,1],[38,3,38,4],[38,6,38,7],[35,0,35,1],[35,3,35,4],[35,6,35,7],[36,0,36,1],[36,3,36,4],[36,6,36,7],[41,0,41,1],[41,3,41,4],[41,6,41,7],[42,0,42,1],[42,3,42,4],[42,6,42,7],[39,0,39,1],[39,3,39,4],[39,6,39,7],[40,0,40,1],[40,3,40,4],[40,6,40,7],[45,0,45,1],[45,3,45,4],[45,6,45,7],[46,0,46,1],[46,3,46,4],[46,6,46,7],[43,0,43,1],[43,3,43,4],[43,6,43,7],[44,0,44,1],[44,3,44,4],[44,6,44,7],[49,0,49,1],[49,3,49,4],[49,6,49,7],[47,0,47,1],[47,3,47,4],[47,6,47,7],[48,0,48,1],[48,3,48,4],[48,6,48,7]]}
["Для работы формул необходимо включить Макросы, после этого перезапустить файл!"]
[]
[]
[null,"Krypto-Manager"]
["BTC Kurs in Euro:",null,{"$f":"ROUND(VLOOKUP(\"BTC\",[1]API!1:1048576,13,FALSE),8)","v":6657.9362987000004},"ETH Kurs in Euro:",null,{"$f":"ROUND(VLOOKUP(\"ETH\",[1]API!1:1048576,13,FALSE),8)","v":494.55461677},"BCH Kurs in Euro:",null,{"$f":"ROUND(VLOOKUP(\"BCH\",[1]API!1:1048576,13,FALSE),8)","v":759.70533031000002},null,"CoinAlarm:","OFF","Version:","0.2.5"]
[null,null,null,null,null,null,null,null,null,null,"Arbitrage",null,"Arbitrage","Deaktiviert"]
[null,null,null,null,null,null,null,null,null,null,"Pair:","Deaktiv","Навигация"]
[null,null,null,null,null,null,null,null,null,null,"Profit:"]
[null,null,null,null,null,null,null,null,null,null,"Profit in %:"]
[null,null,null,null,null,null,null,null,null,null,"Kaufen von:"]
[null,null,null,null,null,null,null,null,null,null,"Preis:"]
[null,null,null,null,null,null,null,null,null,null,"Verkaufen an:"]
[null,null,null,null,null,null,null,null,null,null,"Preis:"]
[null,null,null,null,null,null,null,null,null,null,"Menge:"]
[null,null,null,null,null,null,null,null,null,null,"Gesamt :",{"$f":"ROUND(SUM(L8*L14),8)","v":0}]
["Investitionen:",null,{"$f":"SUM(C17:C35)","v":5},"Gewinn:",null,{"$f":"SUM(F17:F35)","v":41487.452399999995},"Ertrag:",null,{"$f":"SUM(I17:I35)","v":41492.452399999995},"Akt. Kurs","Stk. Preis EUR","EUR Differenz in %","Функции"]
["BTC",null,0,"BTC",null,0,{"$f":"A17","v":"BTC"},null,0,1,6657.85,0]
["ETH",null,0,"ETH",null,0,"ETH",null,0,7.4999999999999997E-2,8543,0]
["EUR",null,0,"EUR",null,0,"EUR",null,0,0,0,0]
[0,null,0,{"$f":"A20","v":0},null,0,0,null,0,0,0,0]
[0,null,0,0,null,0,0,null,0,0,0,0]
[0,null,0,0,null,0,0,null,0,0,0,0]
[0,null,0,0,null,0,0,null,0,0,0,0]
[0,null,0,0,null,0,0,null,0,0,0,0]
[0,null,0,0,null,{"$f":"SUM(I25-C25)","v":11.38},0,null,11.38,0,0,0]
[0,null,0,0,null,22.052399999999999,0,null,22.052399999999999,0,0,0]
[0,null,0,0,null,23.02,0,null,23.02,0,0,0]
["1.998",null,0,"1.998",null,16587,"1.998",null,16587,0,0,0]
[0,null,0,0,null,0,0,null,0,0,0,0]
["0.999",null,0,"0.999",null,8283,"0.999",null,8283,0,0,0]
["0.999",null,0,"0.999",null,8283,"0.999",null,8283,0,0,0]
[0,null,0,0,null,0,0,null,0,0,0,0]
["Coin",null,0,"Coin",null,0,"Coin",null,0,0,0,0]
[0,null,0,0,null,8283,0,null,8283,0,0,0]
[0,null,5,0,null,-5,0,null,0,0,0,-100]

{"sheet":"Лист2","index":1,"n_rows":0,"n_cols":0,"rows_kept":0,"cut":false,"hidden":false,"merged":[]}

{"sheet":"Лист3","index":2,"n_rows":0,"n_cols":0,"rows_kept":0,"cut":false,"hidden":false,"merged":[]}