{
	"parent": "ascore:block/steam_boiler",
	"display": {
        "thirdperson": {
            "rotation": [ 338, 134, 196 ],
        	"translation": [ 0.50, 1.75, -3.75 ],
        	"scale": [ 0.30, 0.30, 0.30 ]
        },
        "gui": {
        	"rotation": [ 0, 90, 0 ],
        	"translation": [ 1.25, -0.75, 1.50 ],
        	"scale": [ 0.70, 0.70, 0.70 ]
    	},
    	"firstperson": {
       		"rotation": [ 0, 220, 0 ],
       		"translation": [ -0.50, 3.00, -0.50 ],
        	"scale": [ 0.85, 0.85, 0.85 ]
    	},
    	"fixed": {
       	 	"rotation": [ 270, 0, 270 ],
        	"translation": [ -0.50, 3.75, -2.00 ],
        	"scale": [ 0.80, 0.80, 0.80 ]
    	}
    }
}
