{
    "elements": [
        {
            "name": "Top pipe part",
            "from": [ 6, 10, 1 ], 
            "to": [ 10, 11, 15 ], 
            "faces": {
                "east": { "texture": "#pipe", "uv": [ 1, 10, 15, 11 ] },
                "west": { "texture": "#pipe", "uv": [ 15, 6, 1, 5 ] },
                "up": { "texture": "#pipe", "uv": [ 15, 10, 1, 6 ], "rotation": 90 },
                "down": { "texture": "#pipe", "uv": [ 1, 6, 15, 10 ], "rotation": 90 }
            }
        },
        {
            "name": "Bottom pipe part",
            "from": [ 6, 5, 1 ], 
            "to": [ 10, 6, 15 ], 
            "faces": {
                "east": { "texture": "#pipe", "uv": [ 1, 5, 15, 6 ] },
                "west": { "texture": "#pipe", "uv": [ 15, 11, 1, 10 ] },
                "up": { "texture": "#pipe", "uv": [ 15, 10, 1, 6 ], "rotation": 90 },
                "down": { "texture": "#pipe", "uv": [ 1, 6, 15, 10 ], "rotation": 90 }
            }
        },
        {
            "name": "West pipe part",
            "from": [ 5, 6, 1 ], 
            "to": [ 6, 10, 15 ], 
            "faces": {
                "east": { "texture": "#pipe", "uv": [ 1, 6, 15, 10 ] },
                "west": { "texture": "#pipe", "uv": [ 15, 10, 1, 6 ] },
                "up": { "texture": "#pipe", "uv": [ 15, 11, 1, 10 ], "rotation": 90 },
                "down": { "texture": "#pipe", "uv": [ 1, 5, 15, 6 ], "rotation": 90 }
            }
        },
        {
            "name": "East pipe part",
            "from": [ 10, 6, 1 ], 
            "to": [ 11, 10, 15 ], 
            "faces": {
                "east": { "texture": "#pipe", "uv": [ 1, 6, 15, 10 ] },
                "west": { "texture": "#pipe", "uv": [ 15, 10, 1, 6 ] },
                "up": { "texture": "#pipe", "uv": [ 15, 6, 1, 5 ], "rotation": 90 },
                "down": { "texture": "#pipe", "uv": [ 1, 10, 15, 11 ], "rotation": 90 }
            }
        },
        {
            "name": "South top connector part",
            "from": [ 5, 10, 15 ], 
            "to": [ 11, 11, 16 ], 
            "faces": {
                "north": { "texture": "#pipe", "uv": [ 1, 5, 0, 11 ], "rotation": 90, "tintindex": 0 },
                "east": { "texture": "#pipe", "uv": [ 0, 5, 1, 6 ], "tintindex": 0 },
                "south": { "texture": "#pipe", "uv": [ 1, 11, 0, 5 ], "rotation": 90, "tintindex": 0 },
                "west": { "texture": "#pipe", "uv": [ 1, 11, 0, 10 ], "tintindex": 0 },
                "up": { "texture": "#pipe", "uv": [ 1, 11, 0, 5 ], "rotation": 90, "tintindex": 0 },
                "down": { "texture": "#pipe", "uv": [ 0, 11, 1, 5 ], "rotation": 90, "tintindex": 0 }
            }
        },
        {
            "name": "South bottom connector part",
            "from": [ 5, 5, 15 ], 
            "to": [ 11, 6, 16 ], 
            "faces": {
                "north": { "texture": "#pipe", "uv": [ 0, 11, 1, 5 ], "rotation": 90, "tintindex": 0 },
                "east": { "texture": "#pipe", "uv": [ 0, 10, 1, 11 ], "tintindex": 0 },
                "south": { "texture": "#pipe", "uv": [ 0, 5, 1, 11 ], "rotation": 90, "tintindex": 0 },
                "west": { "texture": "#pipe", "uv": [ 1, 6, 0, 5 ], "tintindex": 0 },
                "up": { "texture": "#pipe", "uv": [ 1, 5, 0, 11 ], "rotation": 90, "tintindex": 0 },
                "down": { "texture": "#pipe", "uv": [ 0, 5, 1, 11 ], "rotation": 90, "tintindex": 0 }
            }
        },
        {
            "name": "South west connector part",
            "from": [ 5, 6, 15 ], 
            "to": [ 6, 10, 16 ], 
            "faces": {
                "east": { "texture": "#pipe", "uv": [ 0, 10, 1, 6 ], "tintindex": 0 },
                "south": { "texture": "#pipe", "uv": [ 1, 10, 0, 6 ], "tintindex": 0 },
                "west": { "texture": "#pipe", "uv": [ 1, 10, 0, 6 ], "tintindex": 0 }
            }
        },
        {
            "name": "South east connector part",
            "from": [ 10, 6, 15 ], 
            "to": [ 11, 10, 16 ], 
            "faces": {
                "east": { "texture": "#pipe", "uv": [ 0, 6, 1, 10 ], "tintindex": 0 },
                "south": { "texture": "#pipe", "uv": [ 0, 6, 1, 10 ], "tintindex": 0 },
                "west": { "texture": "#pipe", "uv": [ 1, 6, 0, 10 ], "tintindex": 0 }
            }
        },
        {
            "name": "North top connector part",
            "from": [ 5, 10, 0 ], 
            "to": [ 11, 11, 1 ], 
            "faces": {
                "north": { "texture": "#pipe", "uv": [ 16, 5, 15, 11 ], "rotation": 90, "tintindex": 0 },
                "east": { "texture": "#pipe", "uv": [ 15, 5, 16, 6 ], "tintindex": 0 },
                "south": { "texture": "#pipe", "uv": [ 15, 11, 16, 5 ], "rotation": 90, "tintindex": 0 },
                "west": { "texture": "#pipe", "uv": [ 16, 11, 15, 10 ], "tintindex": 0 },
                "up": { "texture": "#pipe", "uv": [ 16, 11, 15, 5 ], "rotation": 90, "tintindex": 0 },
                "down": { "texture": "#pipe", "uv": [ 15, 5, 16, 11 ], "rotation": 90, "tintindex": 0 }
            }
        },
        {
            "name": "North bottom connector part",
            "from": [ 5, 5, 0 ], 
            "to": [ 11, 6, 1 ], 
            "faces": {
                "north": { "texture": "#pipe", "uv": [ 15, 11, 16, 5 ], "rotation": 90, "tintindex": 0 },
                "east": { "texture": "#pipe", "uv": [ 15, 10, 16, 11 ], "tintindex": 0 },
                "south": { "texture": "#pipe", "uv": [ 16, 5, 15, 11 ], "rotation": 90, "tintindex": 0 },
                "west": { "texture": "#pipe", "uv": [ 16, 6, 15, 5 ], "tintindex": 0 },
                "up": { "texture": "#pipe", "uv": [ 16, 11, 15, 5 ], "rotation": 90, "tintindex": 0 },
                "down": { "texture": "#pipe", "uv": [ 15, 5, 16, 11 ], "rotation": 90, "tintindex": 0 }
            }
        },
        {
            "name": "North west connector part",
            "from": [ 5, 6, 0 ], 
            "to": [ 6, 10, 1 ], 
            "faces": {
                "north": { "texture": "#pipe", "uv": [ 15, 10, 16, 6 ], "tintindex": 0 },
                "east": { "texture": "#pipe", "uv": [ 15, 6, 16, 10 ], "tintindex": 0 },
                "west": { "texture": "#pipe", "uv": [ 16, 10, 15, 6 ], "tintindex": 0 }
            }
        },
        {
            "name": "North east connector part",
            "from": [ 10, 6, 0 ], 
            "to": [ 11, 10, 1 ], 
            "faces": {
                "north": { "texture": "#pipe", "uv": [ 16, 6, 15, 10 ], "tintindex": 0 },
                "east": { "texture": "#pipe", "uv": [ 15, 6, 16, 10 ], "tintindex": 0 },
                "west": { "texture": "#pipe", "uv": [ 16, 10, 15, 6 ], "tintindex": 0 }
            }
        },
        {
            "name": "Top west center part",
            "from": [ 5, 10, 5 ], 
            "to": [ 6, 11, 11 ], 
            "faces": {
                "north": { "texture": "#pipe", "uv": [ 10, 11, 11, 10 ] },
                "south": { "texture": "#pipe", "uv": [ 5, 11, 6, 10 ] },
                "west": { "texture": "#pipe", "uv": [ 11, 11, 5, 10 ] },
                "up": { "texture": "#pipe", "uv": [ 11, 6, 5, 5 ], "rotation": 90 }
            }
        },
        {
            "name": "Top east center part",
            "from": [ 10, 10, 5 ], 
            "to": [ 11, 11, 11 ], 
            "faces": {
                "north": { "texture": "#pipe", "uv": [ 11, 5, 10, 6 ] },
                "east": { "texture": "#pipe", "uv": [ 5, 5, 11, 6 ] },
                "south": { "texture": "#pipe", "uv": [ 6, 5, 5, 6 ] },
                "up": { "texture": "#pipe", "uv": [ 11, 11, 5, 10 ], "rotation": 90 }
            }
        },
        {
            "name": "Bottom west center part",
            "from": [ 5, 5, 5 ], 
            "to": [ 6, 6, 11 ], 
            "faces": {
                "north": { "texture": "#pipe", "uv": [ 10, 6, 11, 5 ] },
                "south": { "texture": "#pipe", "uv": [ 6, 6, 5, 5 ] },
                "west": { "texture": "#pipe", "uv": [ 11, 6, 5, 5 ] },
                "down": { "texture": "#pipe", "uv": [ 5, 10, 11, 11 ], "rotation": 90 }
            }
        },
        {
            "name": "Bottom east center part",
            "from": [ 10, 5, 5 ], 
            "to": [ 11, 6, 11 ], 
            "faces": {
                "north": { "texture": "#pipe", "uv": [ 11, 10, 10, 11 ] },
                "east": { "texture": "#pipe", "uv": [ 5, 10, 11, 11 ] },
                "south": { "texture": "#pipe", "uv": [ 6, 10, 5, 11 ] },
                "down": { "texture": "#pipe", "uv": [ 5, 5, 11, 6 ], "rotation": 90 }
            }
        }
    ]
}