{
	"parent": "ascore:block/pressure_storage",
	"display": {
        "thirdperson": {
            "rotation": [ 10, -45, 170 ],
            "translation": [ 0, 1.5, -2.75 ],
            "scale": [ 0.375, 0.375, 0.375 ]
        },
        "fixed": {
        	"rotation": [0, 90, 0],
        	"translation": [0, 0, 0.1],
        	"scale": [1.2, 1.2, 1.2]
        }
    }
}
