^D:\USERS\USER-PC\DOCUMENTS\MAGSHIMIM\C++\CHESS\CHESS\DEBUG\BISHOP.OBJ|D:\USERS\USER-PC\DOCUMENTS\MAGSHIMIM\C++\CHESS\CHESS\DEBUG\BOARD.OBJ|D:\USERS\USER-PC\DOCUMENTS\MAGSHIMIM\C++\CHESS\CHESS\DEBUG\KING.OBJ|D:\USERS\USER-PC\DOCUMENTS\MAGSHIMIM\C++\CHESS\CHESS\DEBUG\KNIGHT.OBJ|D:\USERS\USER-PC\DOCUMENTS\MAGSHIMIM\C++\CHESS\CHESS\DEBUG\MAIN.OBJ|D:\USERS\USER-PC\DOCUMENTS\MAGSHIMIM\C++\CHESS\CHESS\DEBUG\PAWN.OBJ|D:\USERS\USER-PC\DOCUMENTS\MAGSHIMIM\C++\CHESS\CHESS\DEBUG\PIECE.OBJ|D:\USERS\USER-PC\DOCUMENTS\MAGSHIMIM\C++\CHESS\CHESS\DEBUG\QUEEN.OBJ|D:\USERS\USER-PC\DOCUMENTS\MAGSHIMIM\C++\CHESS\CHESS\DEBUG\ROOK.OBJ
/OUT:"D:\USERS\USER-PC\DOCUMENTS\MAGSHIMIM\C++\CHESS\DEBUG\CHESS.EXE" /INCREMENTAL /NOLOGO kernel32.lib user32.lib gdi32.lib winspool.lib comdlg32.lib advapi32.lib shell32.lib ole32.lib oleaut32.lib uuid.lib odbc32.lib odbccp32.lib /MANIFEST /MANIFESTUAC:"level='asInvoker' uiAccess='false'" /manifest:embed /DEBUG /PDB:"D:\USERS\USER-PC\DOCUMENTS\MAGSHIMIM\C++\CHESS\DEBUG\CHESS.PDB" /TLBID:1 /DYNAMICBASE /NXCOMPAT /IMPLIB:"D:\USERS\USER-PC\DOCUMENTS\MAGSHIMIM\C++\CHESS\DEBUG\CHESS.LIB" /MACHINE:X86 DEBUG\BISHOP.OBJDEBUG\BOARD.OBJDEBUG\KING.OBJDEBUG\KNIGHT.OBJDEBUG\MAIN.OBJDEBUG\PAWN.OBJDEBUG\PIECE.OBJDEBUG\QUEEN.OBJDEBUG\ROOK.OBJ
^D:\USERS\USER-PC\DESKTOP\CHESS\CHESS\CHESS\DEBUG\BISHOP.OBJ|D:\USERS\USER-PC\DESKTOP\CHESS\CHESS\CHESS\DEBUG\BOARD.OBJ|D:\USERS\USER-PC\DESKTOP\CHESS\CHESS\CHESS\DEBUG\KING.OBJ|D:\USERS\USER-PC\DESKTOP\CHESS\CHESS\CHESS\DEBUG\KNIGHT.OBJ|D:\USERS\USER-PC\DESKTOP\CHESS\CHESS\CHESS\DEBUG\MAIN.OBJ|D:\USERS\USER-PC\DESKTOP\CHESS\CHESS\CHESS\DEBUG\PAWN.OBJ|D:\USERS\USER-PC\DESKTOP\CHESS\CHESS\CHESS\DEBUG\PIECE.OBJ|D:\USERS\USER-PC\DESKTOP\CHESS\CHESS\CHESS\DEBUG\QUEEN.OBJ|D:\USERS\USER-PC\DESKTOP\CHESS\CHESS\CHESS\DEBUG\ROOK.OBJ
/OUT:"D:\USERS\USER-PC\DESKTOP\CHESS\CHESS\DEBUG\CHESS.EXE" /INCREMENTAL /NOLOGO kernel32.lib user32.lib gdi32.lib winspool.lib comdlg32.lib advapi32.lib shell32.lib ole32.lib oleaut32.lib uuid.lib odbc32.lib odbccp32.lib /MANIFEST /MANIFESTUAC:"level='asInvoker' uiAccess='false'" /manifest:embed /DEBUG /PDB:"D:\USERS\USER-PC\DESKTOP\CHESS\CHESS\DEBUG\CHESS.PDB" /TLBID:1 /DYNAMICBASE /NXCOMPAT /IMPLIB:"D:\USERS\USER-PC\DESKTOP\CHESS\CHESS\DEBUG\CHESS.LIB" /MACHINE:X86 DEBUG\BISHOP.OBJDEBUG\BOARD.OBJDEBUG\KING.OBJDEBUG\KNIGHT.OBJDEBUG\MAIN.OBJDEBUG\PAWN.OBJDEBUG\PIECE.OBJDEBUG\QUEEN.OBJDEBUG\ROOK.OBJ
^D:\USERS\USER-PC\DOCUMENTS\CHESS\CHESS\CHESS\DEBUG\BISHOP.OBJ|D:\USERS\USER-PC\DOCUMENTS\CHESS\CHESS\CHESS\DEBUG\BOARD.OBJ|D:\USERS\USER-PC\DOCUMENTS\CHESS\CHESS\CHESS\DEBUG\CHESS.OBJ|D:\USERS\USER-PC\DOCUMENTS\CHESS\CHESS\CHESS\DEBUG\KING.OBJ|D:\USERS\USER-PC\DOCUMENTS\CHESS\CHESS\CHESS\DEBUG\KNIGHT.OBJ|D:\USERS\USER-PC\DOCUMENTS\CHESS\CHESS\CHESS\DEBUG\MAIN.OBJ|D:\USERS\USER-PC\DOCUMENTS\CHESS\CHESS\CHESS\DEBUG\PAWN.OBJ|D:\USERS\USER-PC\DOCUMENTS\CHESS\CHESS\CHESS\DEBUG\PIECE.OBJ|D:\USERS\USER-PC\DOCUMENTS\CHESS\CHESS\CHESS\DEBUG\QUEEN.OBJ|D:\USERS\USER-PC\DOCUMENTS\CHESS\CHESS\CHESS\DEBUG\ROOK.OBJ
/OUT:"D:\USERS\USER-PC\DOCUMENTS\CHESS\CHESS\DEBUG\CHESS.EXE" /INCREMENTAL /NOLOGO kernel32.lib user32.lib gdi32.lib winspool.lib comdlg32.lib advapi32.lib shell32.lib ole32.lib oleaut32.lib uuid.lib odbc32.lib odbccp32.lib /MANIFEST /MANIFESTUAC:"level='asInvoker' uiAccess='false'" /manifest:embed /DEBUG /PDB:"D:\USERS\USER-PC\DOCUMENTS\CHESS\CHESS\DEBUG\CHESS.PDB" /TLBID:1 /DYNAMICBASE /NXCOMPAT /IMPLIB:"D:\USERS\USER-PC\DOCUMENTS\CHESS\CHESS\DEBUG\CHESS.LIB" /MACHINE:X86 DEBUG\BISHOP.OBJDEBUG\BOARD.OBJDEBUG\CHESS.OBJDEBUG\KING.OBJDEBUG\KNIGHT.OBJDEBUG\MAIN.OBJDEBUG\PAWN.OBJDEBUG\PIECE.OBJDEBUG\QUEEN.OBJDEBUG\ROOK.OBJ
^D:\USERS\USER-PC\DESKTOP\CHESS\CHESS\CHESS\DEBUG\BISHOP.OBJ|D:\USERS\USER-PC\DESKTOP\CHESS\CHESS\CHESS\DEBUG\BOARD.OBJ|D:\USERS\USER-PC\DESKTOP\CHESS\CHESS\CHESS\DEBUG\CHESS.OBJ|D:\USERS\USER-PC\DESKTOP\CHESS\CHESS\CHESS\DEBUG\KING.OBJ|D:\USERS\USER-PC\DESKTOP\CHESS\CHESS\CHESS\DEBUG\KNIGHT.OBJ|D:\USERS\USER-PC\DESKTOP\CHESS\CHESS\CHESS\DEBUG\MAIN.OBJ|D:\USERS\USER-PC\DESKTOP\CHESS\CHESS\CHESS\DEBUG\PAWN.OBJ|D:\USERS\USER-PC\DESKTOP\CHESS\CHESS\CHESS\DEBUG\PIECE.OBJ|D:\USERS\USER-PC\DESKTOP\CHESS\CHESS\CHESS\DEBUG\QUEEN.OBJ|D:\USERS\USER-PC\DESKTOP\CHESS\CHESS\CHESS\DEBUG\ROOK.OBJ
/OUT:"D:\USERS\USER-PC\DESKTOP\CHESS\CHESS\DEBUG\CHESS.EXE" /INCREMENTAL /NOLOGO kernel32.lib user32.lib gdi32.lib winspool.lib comdlg32.lib advapi32.lib shell32.lib ole32.lib oleaut32.lib uuid.lib odbc32.lib odbccp32.lib /MANIFEST /MANIFESTUAC:"level='asInvoker' uiAccess='false'" /manifest:embed /DEBUG /PDB:"D:\USERS\USER-PC\DESKTOP\CHESS\CHESS\DEBUG\CHESS.PDB" /TLBID:1 /DYNAMICBASE /NXCOMPAT /IMPLIB:"D:\USERS\USER-PC\DESKTOP\CHESS\CHESS\DEBUG\CHESS.LIB" /MACHINE:X86 DEBUG\BISHOP.OBJDEBUG\BOARD.OBJDEBUG\CHESS.OBJDEBUG\KING.OBJDEBUG\KNIGHT.OBJDEBUG\MAIN.OBJDEBUG\PAWN.OBJDEBUG\PIECE.OBJDEBUG\QUEEN.OBJDEBUG\ROOK.OBJ
