ru\mirea\weather\TaskExecutor.class
ru\mirea\weather\DataQueue.class
ru\mirea\weather\Task.class
ru\mirea\weather\TaskGenerator.class
ru\mirea\weather\WeatherService.class
ru\mirea\weather\Logger.class
