<?xml version="1.0" ?>
<sdf version="1.4">
  <world name="default">
    <include>
      <uri>model://ground_plane</uri>
    </include>
    <include>
      <uri>model://sun</uri>
    </include>

    <model name='unit_box'>
      <pose frame=''> 0 2 0 0 0 0 </pose>
      <link name='link'>
        <inertial>
          <mass> 10 </mass>
          <inertia>
            <ixx>1</ixx>
            <ixy>1</ixy>
            <ixz>1</ixz>
            <iyy>1</iyy>
            <iyz>1</iyz>
            <izz>1</izz>
          </inertia>
        </inertial>
        <collision name='collision'>
          <geometry>
            <box>
              <size> 5 0.5 1 </size>
            </box>
          </geometry>
        </collision>
        <visual name='visual'>
          <geometry>
            <box>
              <size> 5 0.5 1 </size>
            </box>
          </geometry>
        </visual>
      </link>
    </model>
  </world>
</sdf>