130 = {

    # Misc
    culture = halfling
    religion = small_temple

    # History
}

131 = {

    # Misc
    culture = halfling
    religion = small_temple

    # History
}

132 = {

    # Misc
    culture = halfling
    religion = small_temple

    # History
}

134 = {

    # Misc
    culture = halfling
    religion = small_temple

    # History
}

136 = {

    # Misc
    culture = halfling
    religion = small_temple

    # History
}