###########################################################
# Events for the Tribal Estate
#
# written by Henrik Lohmander
###########################################################

namespace = tribal_estate_events

#Tensions between Nomads and Sedentary Population
country_event = {
	id = tribal_estate_events.1
	title = tribal_estate_events.1.t
	desc = tribal_estate_events.1.d
	picture = NOMAD_ESTATE_eventPicture
	
	trigger = {
		has_estate = estate_nomadic_tribes
		num_of_cities = 5
		any_owned_province = {
			has_estate = estate_nomadic_tribes
			can_spawn_rebels = nationalist_rebels
		}
	}

	is_triggered_only = yes
	
	immediate = {
		hidden_effect = {
			random_owned_province = {
				limit = {
					has_estate = estate_nomadic_tribes
					can_spawn_rebels = nationalist_rebels
				}
				area = {
					limit = {
						can_spawn_rebels = nationalist_rebels
						owned_by = ROOT
					}
					set_province_flag = conflict_regarding_tax_collection
				}
			}
		}
	}
	
	mean_time_to_happen = {
		days = 1
	}
	
	option = {
		name = tribal_estate_events.1.a #	Reprimand the Chiefs.
		ai_chance = {
			factor = 75
			modifier = {
				factor = 0.5
				NOT = {
					estate_loyalty = {
						estate = estate_nomadic_tribes
						loyalty = 40
					}
				}
			}
			modifier = {
				factor = 1.5
				estate_influence = {
					estate = estate_nomadic_tribes
					influence = 65
				}
			}
		}
		add_estate_loyalty = {
			estate = estate_nomadic_tribes
			loyalty = -15
		}
		add_estate_influence_modifier = {
			estate = estate_nomadic_tribes
			desc = EST_VAL_TRIBES_REPRIMANDED
			influence = -10
			duration = 5475
		}
	}
	option = {
		name = tribal_estate_events.1.b #	Let it Slide
		ai_chance = {
			factor = 25
			modifier = {
				factor = 1.5
				NOT = {
					estate_loyalty = {
						estate = estate_nomadic_tribes
						loyalty = 40
					}
				}
			}
			modifier = {
				factor = 0.5
				estate_influence = {
					estate = estate_nomadic_tribes
					influence = 65
				}
			}
		}
		random_owned_province = {
			limit = {
				has_province_flag = conflict_regarding_tax_collection
			}
			spawn_rebels = {
				size = 1
				type = nationalist_rebels
			}
			clr_province_flag = conflict_regarding_tax_collection
		}
		random_owned_province = {
			limit = {
				has_province_flag = conflict_regarding_tax_collection
				owner = { num_of_cities = 10 }
			}
			spawn_rebels = {
				size = 1
				type = nationalist_rebels
			}
			clr_province_flag = conflict_regarding_tax_collection
		}
		random_owned_province = {
			limit = {
				has_province_flag = conflict_regarding_tax_collection
				owner = { num_of_cities = 15 }
			}
			spawn_rebels = {
				size = 1
				type = nationalist_rebels
			}
			clr_province_flag = conflict_regarding_tax_collection
		}
		every_owned_province = {
			clr_province_flag = conflict_regarding_tax_collection
		}
		add_estate_loyalty = {
			estate = estate_nomadic_tribes
			loyalty = 15
		}
		add_estate_influence_modifier = {
			estate = estate_nomadic_tribes
			desc = EST_VAL_TRIBES_ALLOWED_FREE_REIGN
			influence = 10
			duration = 5475
		}
	}
}

#Advancement of the Tribes
#General Event for all estates to keep things harder to predict.
country_event = {
	id = tribal_estate_events.2
	title = tribal_estate_events.2.t
	desc = tribal_estate_events.2.d
	picture = NOMAD_ESTATE_eventPicture
	
	is_triggered_only = yes
	
	trigger = {
		has_estate = estate_nomadic_tribes
		NOT = {
			has_estate_influence_modifier = {
				estate = estate_nomadic_tribes
				modifier = EST_VAL_TRIBES_DECLINES
			}
		}
		NOT = {
			has_estate_influence_modifier = {
				estate = estate_nomadic_tribes
				modifier = EST_VAL_TRIBES_ADVANCES
			}
		}
		NOT = {
			has_estate_influence_modifier = {
				estate = estate_nomadic_tribes
				modifier = EST_VAL_TRIBES_ADVANCES_20
			}
		}
	}

	mean_time_to_happen = {
		days = 1
	}
	

	option = {
		name = tribal_estate_events.2.a #Ok
		add_estate_influence_modifier = {
			estate = estate_nomadic_tribes
			desc = EST_VAL_TRIBES_ADVANCES
			influence = 10
			duration = 5475
		}
	}
}

#Tribal Authority Declines
#General Event for all estates to keep things harder to predict.
country_event = {
	id = tribal_estate_events.3
	title = tribal_estate_events.3.t
	desc = tribal_estate_events.3.d
	picture = NOMAD_ESTATE_eventPicture
	
	trigger = {
		has_estate = estate_nomadic_tribes
		estate_influence = {
			estate = estate_nomadic_tribes
			influence = 15
		}
		NOT = {
			has_estate_influence_modifier = {
				estate = estate_nomadic_tribes
				modifier = EST_VAL_TRIBES_DECLINES
			}
		}
		NOT = {
			has_estate_influence_modifier = {
				estate = estate_nomadic_tribes
				modifier = EST_VAL_TRIBES_ADVANCES
			}
		}
		NOT = {
			has_estate_influence_modifier = {
				estate = estate_nomadic_tribes
				modifier = EST_VAL_TRIBES_ADVANCES_20
			}
		}
	}
	
	is_triggered_only = yes
	
	mean_time_to_happen = {
		days = 1
	}
	
	option = {
		name = tribal_estate_events.3.a #Ok
		add_estate_influence_modifier = {
			estate = estate_nomadic_tribes
			desc = EST_VAL_TRIBES_DECLINES
			influence = -10
			duration = 5475
		}
	}
}



# Local Chiefs Complain
country_event = {
	id = tribal_estate_events.4
	title = tribal_estate_events.4.t
	desc = tribal_estate_events.4.d
	picture = NOMAD_ESTATE_eventPicture
	
	trigger = {
		has_estate = estate_nomadic_tribes
	}
	
	is_triggered_only = yes
	
	mean_time_to_happen = {
		days = 1
	}
	
	option = {
		name = tribal_estate_events.4.a
		ai_chance = {
			factor = 25
			modifier = {
				factor = 2.0
				NOT = {
					estate_loyalty = {
						estate = estate_nomadic_tribes
						loyalty = 40
					}
				}
			}
		}
		add_army_tradition = -10
		add_estate_loyalty = {
			estate = estate_nomadic_tribes
			loyalty = 15
		}

	}
	option = {
		name = tribal_estate_events.4.b
		ai_chance = {
			factor = 75
			modifier = {
				factor = 0.25
				NOT = {
					estate_loyalty = {
						estate = estate_nomadic_tribes
						loyalty = 40
					}
				}
			}
		}
		add_army_tradition = 10
		add_estate_loyalty = {
			estate = estate_nomadic_tribes
			loyalty = -15
		}
	}
}


# Chiefs are withholding Taxes
country_event = {
	id = tribal_estate_events.5
	title = tribal_estate_events.5.t
	desc = tribal_estate_events.5.d
	picture = NOMAD_ESTATE_eventPicture
	
	trigger = {
		has_estate = estate_nomadic_tribes
	}
	
	is_triggered_only = yes
	
	mean_time_to_happen = {
		days = 1
	}
	
	option = {
		name = tribal_estate_events.5.a
		ai_chance = {
			factor = 25
			modifier = {
				factor = 2.0
				NOT = {
					estate_loyalty = {
						estate = estate_nomadic_tribes
						loyalty = 40
					}
				}
			}
		}
		add_prestige = -10
		add_estate_loyalty = {
			estate = estate_nomadic_tribes
			loyalty = 15
		}

	}
	option = {
		name = tribal_estate_events.5.b
		ai_chance = {
			factor = 75
			modifier = {
				factor = 0.25
				NOT = {
					estate_loyalty = {
						estate = estate_nomadic_tribes
						loyalty = 40
					}
				}
			}
		}
		add_years_of_income = 0.25
		add_estate_loyalty = {
			estate = estate_nomadic_tribes
			loyalty = -15
		}		
	}
}



# Our Horde is in disarray!
country_event = {
	id = tribal_estate_events.6
	title = tribal_estate_events.6.t
	desc = tribal_estate_events.6.d
	picture = NOMAD_ESTATE_eventPicture
	
	trigger = {
		has_estate = estate_nomadic_tribes
		NOT = { stability = 0 }
		NOT = {
			has_estate_influence_modifier = {
				estate = estate_nomadic_tribes
				modifier = EST_VAL_TRIBES_STABILIY_BOOSTED
			}
		}
		OR = {
			NOT = { has_country_flag = refused_tribal_stability_aid }
			had_country_flag = { flag = refused_tribal_stability_aid days = 7300 }
		}
	}
	
	is_triggered_only = yes
	
	mean_time_to_happen = {
		days = 1
	}
	
	option = {
		name = tribal_estate_events.6.a
		ai_chance = {
			factor = 75
			modifier = {
				factor = 0.25
				estate_influence = {
					estate = estate_nomadic_tribes
					influence = 60
				}
			}
		}
		add_stability_or_adm_power = yes
		add_estate_influence_modifier = {
			estate = estate_nomadic_tribes
			desc = EST_VAL_TRIBES_STABILIY_BOOSTED
			influence = 10
			duration = 7300
		}		

	}
	option = {
		name = tribal_estate_events.6.b
		ai_chance = {
			factor = 25
			modifier = {
				factor = 2.0
				NOT = {
					estate_loyalty = {
						estate = estate_nomadic_tribes
						loyalty = 35
					}
				}
			}
		}
		set_country_flag = refused_tribal_stability_aid
		add_estate_loyalty = {
			estate = estate_nomadic_tribes
			loyalty = -10
		}		
	}
}


# The Army is too weak.
country_event = {
	id = tribal_estate_events.7
	title = tribal_estate_events.7.t
	desc = tribal_estate_events.7.d
	picture = NOMAD_ESTATE_eventPicture
	
	trigger = {
		has_estate = estate_nomadic_tribes
		NOT = { army_tradition = 30 }
		NOT = {
			has_estate_influence_modifier = {
				estate = estate_nomadic_tribes
				modifier = EST_VAL_TRIBES_ARMY
			}
		}
		OR = {
			NOT = { has_country_flag = refused_tribal_armies }
			had_country_flag = { flag = refused_tribal_armies days = 7300 }
		}
	}
	
	is_triggered_only = yes
	
	mean_time_to_happen = {
		days = 1
	}
	
	option = {
		name = tribal_estate_events.7.a
		ai_chance = {
			factor = 75
			modifier = {
				factor = 0.25
				estate_influence = {
					estate = estate_nomadic_tribes
					influence = 60
				}
			}
		}
		add_army_tradition = 10
		add_estate_influence_modifier = {
			estate = estate_nomadic_tribes
			desc = EST_VAL_TRIBES_ARMY
			influence = 10
			duration = 7300
		}		

	}
	option = {
		name = tribal_estate_events.7.b
		ai_chance = {
			factor = 25
			modifier = {
				factor = 2.0
				NOT = {
					estate_loyalty = {
						estate = estate_nomadic_tribes
						loyalty = 35
					}
				}
			}
		}
		set_country_flag = refused_tribal_armies
		add_estate_loyalty = {
			estate = estate_nomadic_tribes
			loyalty = -10
		}		
	}
}


# The Horde is not unified!
country_event = {
	id = tribal_estate_events.8
	title = tribal_estate_events.8.t
	desc = tribal_estate_events.8.d
	picture = NOMAD_ESTATE_eventPicture
	
	trigger = {
		has_estate = estate_nomadic_tribes
		NOT = { horde_unity = 70 }
		NOT = {
			has_estate_influence_modifier = {
				estate = estate_nomadic_tribes
				modifier = EST_VAL_TRIBES_UNITY
			}
		}
		OR = {
			NOT = { has_country_flag = refused_tribal_unity_aid }
			had_country_flag = { flag = refused_tribal_unity_aid days = 7300 }
		}
	}
	
	is_triggered_only = yes
	
	mean_time_to_happen = {
		days = 1
	}
	
	option = {
		name = tribal_estate_events.8.a
		ai_chance = {
			factor = 75
			modifier = {
				factor = 0.25
				estate_influence = {
					estate = estate_nomadic_tribes
					influence = 60
				}
			}
		}
		add_horde_unity = 20
		add_estate_influence_modifier = {
			estate = estate_nomadic_tribes
			desc = EST_VAL_TRIBES_UNITY
			influence = 10
			duration = 7300
		}
	}
	option = {
		name = tribal_estate_events.8.b
		ai_chance = {
			factor = 25
			modifier = {
				factor = 2.0
				NOT = {
					estate_loyalty = {
						estate = estate_nomadic_tribes
						loyalty = 35
					}
				}
			}
		}
		set_country_flag = refused_tribal_unity_aid
		add_estate_loyalty = {
			estate = estate_nomadic_tribes
			loyalty = -10
		}		
	}
}


# Chiefs want return to old ways.
country_event = {
	id = tribal_estate_events.9
	title = tribal_estate_events.9.t
	desc = tribal_estate_events.9.d
	picture = NOMAD_ESTATE_eventPicture
	
	trigger = {
		has_estate = estate_nomadic_tribes
		estate_influence = {
			estate = estate_nomadic_tribes
			influence = 50
		}
		NOT = { has_country_modifier = the_proper_old_ways }
	}
	
	is_triggered_only = yes
	
	mean_time_to_happen = {
		days = 1
	}
	
	option = {
		name = tribal_estate_events.9.a
		ai_chance = {
			factor = 50
		}
		add_country_modifier = {
			name = the_proper_old_ways
			duration = 3650
		}

	}
	option = {
		name = tribal_estate_events.9.b
		ai_chance = {
			factor = 50
			modifier = {
				factor = 1.5
				NOT = {
					estate_loyalty = {
						estate = estate_nomadic_tribes
						loyalty = 40
					}
				}
			}
		}
		add_estate_loyalty = {
			estate = estate_nomadic_tribes
			loyalty = -15
		}		
	}
}

#Local Revolt
province_event = {
	id = tribal_estate_events.10
	title = tribal_estate_events.10.t
	desc = tribal_estate_events.10.d
	picture = NOMAD_ESTATE_eventPicture
	
	is_triggered_only = yes
	
	option = {
		name = tribal_estate_events.10.a
	}
}

#Nomadic Tribes Demand weak candidate to be next in line to be Khan
#Demands at High Influence
country_event = {
	id = tribal_estate_events.11
	title = tribal_estate_events.11.t
	desc = tribal_estate_events.11.d
	picture = NOMAD_ESTATE_eventPicture
	
	trigger = {
		has_estate = estate_nomadic_tribes
		has_regency = no
		has_government_attribute = heir
		estate_influence = {
			estate = estate_nomadic_tribes
			influence = 70
		}
		NOT = {
			has_estate_influence_modifier = {
				modifier = EST_VAL_KINGMAKERS
				estate = estate_nomadic_tribes
			}
		}
		NOT = {
			has_estate_influence_modifier = {
				modifier = EST_VAL_REFUSED_TO_ALTER_SUCCESSION
				estate = estate_nomadic_tribes
			}
		}
	}
	
	is_triggered_only = yes
	
	mean_time_to_happen = {
		days = 1
	}
	
	option = {
		name = tribal_estate_events.11.a
		ai_chance = {
			factor = 1
		}
		if = {
			limit = { has_heir = yes }
			kill_heir = yes
		}
		define_heir = {
			dynasty = ROOT
			claim = 15
			age = 45
		}
		add_estate_influence_modifier = {
			desc = EST_VAL_KINGMAKERS
			estate = estate_nomadic_tribes
			influence = 10
			duration = 3650
		}
	}
	option = {
		name = tribal_estate_events.11.b
		ai_chance = {
			factor = 99
			modifier = {
				factor = 0.01
				NOT = {
					estate_loyalty = {
						estate = estate_nomadic_tribes
						loyalty = 45
					}
				}
			}
		}
		add_estate_loyalty = {
			estate = estate_nomadic_tribes
			loyalty = -20
		}
		add_estate_influence_modifier = {
			desc = EST_VAL_REFUSED_TO_ALTER_SUCCESSION
			estate = estate_nomadic_tribes
			influence = -10
			duration = 3650
		}
	}
}

#Tribes demand use of your men.
#Demands at High Influence
country_event = {
	id = tribal_estate_events.12
	title = tribal_estate_events.12.t
	desc = tribal_estate_events.12.d
	picture = NOMAD_ESTATE_eventPicture
	
	trigger = {
		has_estate = estate_nomadic_tribes
		estate_influence = {
			estate = estate_nomadic_tribes
			influence = 70
		}
		NOT = {
			has_estate_influence_modifier = {
				modifier = EST_VAL_TRIBES_USING_RULERS_MANPOWER
				estate = estate_nomadic_tribes
			}
		}
		NOT = {
			has_estate_influence_modifier = {
				modifier = EST_VAL_REFUSED_TO_SUPPLY_MEN_TO_TRIBES
				estate = estate_nomadic_tribes
			}
		}
	}
	
	is_triggered_only = yes
	
	mean_time_to_happen = {
		days = 1
	}
	
	option = {
		name = tribal_estate_events.12.a
		ai_chance = {
			factor = 1
		}
		add_yearly_manpower = -1
		add_estate_influence_modifier = {
			desc = EST_VAL_TRIBES_USING_RULERS_MANPOWER
			estate = estate_nomadic_tribes
			influence = 10
			duration = 3650
		}
	}
	option = {
		name = tribal_estate_events.12.b
		ai_chance = {
			factor = 99
			modifier = {
				factor = 0.01
				NOT = {
					estate_loyalty = {
						estate = estate_nomadic_tribes
						loyalty = 45
					}
				}
			}
		}
		add_estate_influence_modifier = {
			desc = EST_VAL_REFUSED_TO_SUPPLY_MEN_TO_TRIBES
			estate = estate_nomadic_tribes
			influence = -10
			duration = 3650
		}
		add_estate_loyalty = {
			estate = estate_nomadic_tribes
			loyalty = -20
		}
	}
}

#Demands at High Influence
#Tribes demand greater Autonomy
country_event = {
	id = tribal_estate_events.13
	title = tribal_estate_events.13.t
	desc = tribal_estate_events.13.d
	picture = NOMAD_ESTATE_eventPicture
	
	trigger = {
		has_estate = estate_nomadic_tribes
		estate_influence = {
			estate = estate_nomadic_tribes
			influence = 70
		}
		NOT = {
			has_estate_influence_modifier = {
				modifier = EST_VAL_TRIBES_AUTONOMY
				estate = estate_nomadic_tribes
			}
		}
		NOT = {
			has_estate_influence_modifier = {
				modifier = EST_VAL_REFUSED_TRIBES_AUTONOMY
				estate = estate_nomadic_tribes
			}
		}
	}
	
	is_triggered_only = yes
	
	mean_time_to_happen = {
		days = 1
	}
	
	option = {
		name = tribal_estate_events.13.a
		ai_chance = {
			factor = 1
		}
		custom_tooltip = tribal_estate_events.13.a.tt
		hidden_effect = {
			every_province = {
				limit = {
					has_estate = estate_nomadic_tribes
				}
				add_local_autonomy = 35
			}
		}
		add_estate_influence_modifier = {
			desc = EST_VAL_TRIBES_AUTONOMY
			estate = estate_nomadic_tribes
			influence = 10
			duration = 3650
		}
	}
	option = {
		name = tribal_estate_events.13.b
		ai_chance = {
			factor = 99
			modifier = {
				factor = 0.01
				NOT = {
					estate_loyalty = {
						estate = estate_nomadic_tribes
						loyalty = 45
					}
				}
			}
		}
		add_estate_influence_modifier = {
			desc = EST_VAL_REFUSED_TRIBES_AUTONOMY
			estate = estate_nomadic_tribes
			influence = -10
			duration = 3650
		}
		add_estate_loyalty = {
			estate = estate_nomadic_tribes
			loyalty = -20
		}
	}
}

#Demands at High Influence
#Tribes demand to general their own troops
country_event = {
	id = tribal_estate_events.14
	title = tribal_estate_events.14.t
	desc = tribal_estate_events.14.d
	picture = NOMAD_ESTATE_eventPicture
	
	trigger = {
		has_estate = estate_nomadic_tribes
		estate_influence = {
			estate = estate_nomadic_tribes
			influence = 70
		}
		NOT = {
			has_estate_influence_modifier = {
				modifier = EST_VAL_TRIBES_DEMANDING
				estate = estate_nomadic_tribes
			}
		}
		NOT = {
			has_estate_influence_modifier = {
				modifier = EST_VAL_TRIBES_REFUSED_DEMANDING
				estate = estate_nomadic_tribes
			}
		}
	}
	
	is_triggered_only = yes
	
	mean_time_to_happen = {
		days = 1
	}
	
	option = {
		name = tribal_estate_events.14.a
		ai_chance = {
			factor = 1
		}
		add_country_modifier = {
			name = "no_tribal_leaders"
			duration = 1825
		}
		add_estate_influence_modifier = {
			desc = EST_VAL_TRIBES_DEMANDING
			estate = estate_nomadic_tribes
			influence = 10
			duration = 1825
		}
	}
	option = {
		name = tribal_estate_events.14.b
		ai_chance = {
			factor = 99
			modifier = {
				factor = 0.01
				NOT = {
					estate_loyalty = {
						estate = estate_nomadic_tribes
						loyalty = 45
					}
				}
			}
		}
		add_estate_influence_modifier = {
			desc = EST_VAL_TRIBES_REFUSED_DEMANDING
			estate = estate_nomadic_tribes
			influence = -10
			duration = 1825
		}
		add_estate_loyalty = {
			estate = estate_nomadic_tribes
			loyalty = -20
		}
	}
}