 _   _______ _       _____ _                _
| | | | ___ \ |     /  ___| |              | |
| | | | |_/ / |     \ `--.| |__   ___  _ __| |_ ___ _ __   ___ _ __
| | | |    /| |      `--. \ '_ \ / _ \| '__| __/ _ \ '_ \ / _ \ '__|
| |_| | |\ \| |____ /\__/ / | | | (_) | |  | ||  __/ | | |  __/ |
 \___/\_| \_\_____/ \____/|_| |_|\___/|_|   \__\___|_| |_|\___|_|

----------------------------------------------------
------------ URL Shortener Application -------------
------------ @author Todd Matthews -----------------
------------ @date 07.09.2017 ----------------------
----------------------------------------------------