<?xml version="1.0" encoding="utf-8"?>
<!-- Generator: Adobe Illustrator 23.0.1, SVG Export Plug-In . SVG Version: 6.00 Build 0)  -->
<svg version="1.1" id="icons" xmlns="http://www.w3.org/2000/svg" xmlns:xlink="http://www.w3.org/1999/xlink" x="0px" y="0px"
	 viewBox="0 0 56 56" style="enable-background:new 0 0 56 56;" xml:space="preserve">
<style type="text/css">
	.st0{fill:#FFFFFF;}
</style>
<title>Artboard 1</title>
<path class="st0" d="M54.6,51.7L39.8,36.9c7.8-9.3,6.5-23.2-2.8-31s-23.2-6.5-31,2.8s-6.5,23.2,2.8,31c8.2,6.8,20,6.8,28.2,0
	l14.8,14.8c0.4,0.4,0.9,0.6,1.4,0.6c1.1,0,2-0.9,2-2C55.2,52.6,54.9,52.1,54.6,51.7z M4.8,22.9c0-9.9,8.1-18,18-18s18,8.1,18,18
	s-8.1,18-18,18l0,0C12.9,40.8,4.9,32.8,4.8,22.9z"/>
</svg>
