N	1.5 (Edges)	1.5 (Degree)	1.5 (Diameter)	1.5 (Eff.Diameter)	2 (Edges)	2 (Degree)	2 (Diameter)	2 (Eff.Diameter)	3 (Edges)	3 (Degree)	3 (Diameter)	3 (Eff.Diameter)
4	7	1.75	1	1.0	5	1.25	2	2.0	4	1.0	2	2.0
1093	122972	112.508691674	2	2.0	35803	32.7566331199	3	2.0	8546	7.81884720952	5	4.0
40	465	11.625	2	2.0	270	6.75	3	2.0	127	3.175	4	3.0
364	19986	54.9065934066	2	2.0	7479	20.5467032967	3	2.0	2296	6.30769230769	4	3.0
13	61	4.69230769231	2	2.0	41	3.15384615385	2	2.0	24	1.84615384615	4	3.0
3280	747413	227.869817073	2	2.0	167397	51.0356707317	3	2.0	30730	9.36890243902	5	4.0
121	3166	26.1652892562	2	2	1514	12.5123966942	3	2	584	4.82644628099	4	3
