N	1.5(Edges)	1.5(Degree)	1.5(Diameter)	1.5(Eff.Diameter)	2(Edges)	2(Degree)	2(Diameter)	2(Eff.Diameter)	3(Edges)	3(Degree)	3(Diameter)	3(Eff.Diameter)
1	0	0.0	0	0	0	0.0	0	0	0	0.0	0	0
3	3	1.0	2	2.0	1	0.333333333333	inf	inf	1	0.333333333333	inf	inf
9	41	4.55555555556	2	2	19	2.11111111111	3	2	14	1.55555555556	3	3
27	249	9.22222222222	2	2.0	128	4.74074074074	3	2.0	49	1.81481481481	inf	4.0
81	1667	20.5802469136	2	2	667	8.23456790123	3	2	251	3.0987654321	5	4
243	9906	40.7654320988	2	2.0	3133	12.8930041152	3	2.0	825	3.3950617284	inf	4.0
729	61227	83.987654321	2	2	15131	20.755829904	3	3	2946	4.04115226337	6	4
2187	369571	168.985368084	2	2.0	70383	32.182441701	3	3.0	10244	4.68404206676	7	5.0
