﻿{
    "connectionString": "mongodb://localhost:27017/userDB",
    "secret": "eyJhbGciOiJIUzI1NiIsInR5cCI6IkpXV",
    "emailConfig": {
        "service": "Godaddy",
        "host": "smtpout.secureserver.net",  
        "secureConnection": true,
        "port": 465,
        "auth": {
          "email": "erik@bemyplan.com",
          "password": "Armenia2018!"
        }
    }
}

