-- Merging decision tree log ---
manifest
ADDED from D:\ASW akcelerometr\accelerometerandroid\app\src\main\AndroidManifest.xml:2:1-32:12
	package
		ADDED from D:\ASW akcelerometr\accelerometerandroid\app\src\main\AndroidManifest.xml:3:5-50
		INJECTED from D:\ASW akcelerometr\accelerometerandroid\app\src\main\AndroidManifest.xml
		INJECTED from D:\ASW akcelerometr\accelerometerandroid\app\src\main\AndroidManifest.xml
	android:versionName
		INJECTED from D:\ASW akcelerometr\accelerometerandroid\app\src\main\AndroidManifest.xml
		INJECTED from D:\ASW akcelerometr\accelerometerandroid\app\src\main\AndroidManifest.xml
	xmlns:android
		ADDED from D:\ASW akcelerometr\accelerometerandroid\app\src\main\AndroidManifest.xml:2:11-69
	android:versionCode
		INJECTED from D:\ASW akcelerometr\accelerometerandroid\app\src\main\AndroidManifest.xml
		INJECTED from D:\ASW akcelerometr\accelerometerandroid\app\src\main\AndroidManifest.xml
uses-permission#android.permission.WRITE_EXTERNAL_STORAGE
ADDED from D:\ASW akcelerometr\accelerometerandroid\app\src\main\AndroidManifest.xml:4:5-81
	android:name
		ADDED from D:\ASW akcelerometr\accelerometerandroid\app\src\main\AndroidManifest.xml:4:22-78
uses-permission#android.permission.INTERNET
ADDED from D:\ASW akcelerometr\accelerometerandroid\app\src\main\AndroidManifest.xml:5:5-67
	android:name
		ADDED from D:\ASW akcelerometr\accelerometerandroid\app\src\main\AndroidManifest.xml:5:22-64
application
ADDED from D:\ASW akcelerometr\accelerometerandroid\app\src\main\AndroidManifest.xml:7:5-30:19
MERGED from [com.jjoe64:graphview:4.2.1] D:\ASW akcelerometr\accelerometerandroid\app\build\intermediates\exploded-aar\com.jjoe64\graphview\4.2.1\AndroidManifest.xml:11:5-12:19
MERGED from [com.android.support:design:25.1.0] D:\ASW akcelerometr\accelerometerandroid\app\build\intermediates\exploded-aar\com.android.support\design\25.1.0\AndroidManifest.xml:25:5-20
MERGED from [com.android.support:appcompat-v7:25.1.0] D:\ASW akcelerometr\accelerometerandroid\app\build\intermediates\exploded-aar\com.android.support\appcompat-v7\25.1.0\AndroidManifest.xml:25:5-20
MERGED from [com.android.support:animated-vector-drawable:25.1.0] D:\ASW akcelerometr\accelerometerandroid\app\build\intermediates\exploded-aar\com.android.support\animated-vector-drawable\25.1.0\AndroidManifest.xml:22:5-20
MERGED from [com.android.support:support-vector-drawable:25.1.0] D:\ASW akcelerometr\accelerometerandroid\app\build\intermediates\exploded-aar\com.android.support\support-vector-drawable\25.1.0\AndroidManifest.xml:23:5-20
MERGED from [com.android.support:transition:25.1.0] D:\ASW akcelerometr\accelerometerandroid\app\build\intermediates\exploded-aar\com.android.support\transition\25.1.0\AndroidManifest.xml:22:5-20
MERGED from [com.android.support:support-v4:25.1.0] D:\ASW akcelerometr\accelerometerandroid\app\build\intermediates\exploded-aar\com.android.support\support-v4\25.1.0\AndroidManifest.xml:25:5-20
MERGED from [com.android.support:support-fragment:25.1.0] D:\ASW akcelerometr\accelerometerandroid\app\build\intermediates\exploded-aar\com.android.support\support-fragment\25.1.0\AndroidManifest.xml:25:5-20
MERGED from [com.android.support:support-media-compat:25.1.0] D:\ASW akcelerometr\accelerometerandroid\app\build\intermediates\exploded-aar\com.android.support\support-media-compat\25.1.0\AndroidManifest.xml:25:5-20
MERGED from [com.android.support:support-core-ui:25.1.0] D:\ASW akcelerometr\accelerometerandroid\app\build\intermediates\exploded-aar\com.android.support\support-core-ui\25.1.0\AndroidManifest.xml:25:5-20
MERGED from [com.android.support:support-core-utils:25.1.0] D:\ASW akcelerometr\accelerometerandroid\app\build\intermediates\exploded-aar\com.android.support\support-core-utils\25.1.0\AndroidManifest.xml:25:5-20
MERGED from [com.android.support:support-compat:25.1.0] D:\ASW akcelerometr\accelerometerandroid\app\build\intermediates\exploded-aar\com.android.support\support-compat\25.1.0\AndroidManifest.xml:25:5-20
	android:label
		ADDED from D:\ASW akcelerometr\accelerometerandroid\app\src\main\AndroidManifest.xml:10:9-41
	android:supportsRtl
		ADDED from D:\ASW akcelerometr\accelerometerandroid\app\src\main\AndroidManifest.xml:11:9-35
	android:allowBackup
		ADDED from D:\ASW akcelerometr\accelerometerandroid\app\src\main\AndroidManifest.xml:8:9-35
	android:icon
		ADDED from D:\ASW akcelerometr\accelerometerandroid\app\src\main\AndroidManifest.xml:9:9-43
	android:theme
		ADDED from D:\ASW akcelerometr\accelerometerandroid\app\src\main\AndroidManifest.xml:12:9-40
activity#eti.asw.accelerometer.accelerometer.MainActivity
ADDED from D:\ASW akcelerometr\accelerometerandroid\app\src\main\AndroidManifest.xml:13:9-19:20
	android:name
		ADDED from D:\ASW akcelerometr\accelerometerandroid\app\src\main\AndroidManifest.xml:13:19-47
intent-filter#android.intent.action.MAIN+android.intent.category.LAUNCHER
ADDED from D:\ASW akcelerometr\accelerometerandroid\app\src\main\AndroidManifest.xml:14:13-18:29
action#android.intent.action.MAIN
ADDED from D:\ASW akcelerometr\accelerometerandroid\app\src\main\AndroidManifest.xml:15:17-69
	android:name
		ADDED from D:\ASW akcelerometr\accelerometerandroid\app\src\main\AndroidManifest.xml:15:25-66
category#android.intent.category.LAUNCHER
ADDED from D:\ASW akcelerometr\accelerometerandroid\app\src\main\AndroidManifest.xml:17:17-77
	android:name
		ADDED from D:\ASW akcelerometr\accelerometerandroid\app\src\main\AndroidManifest.xml:17:27-74
activity#eti.asw.accelerometer.accelerometer.AccelerometerDataActivity
ADDED from D:\ASW akcelerometr\accelerometerandroid\app\src\main\AndroidManifest.xml:20:9-63
	android:name
		ADDED from D:\ASW akcelerometr\accelerometerandroid\app\src\main\AndroidManifest.xml:20:19-60
activity#eti.asw.accelerometer.accelerometer.Graph
ADDED from D:\ASW akcelerometr\accelerometerandroid\app\src\main\AndroidManifest.xml:21:9-24:47
	android:screenOrientation
		ADDED from D:\ASW akcelerometr\accelerometerandroid\app\src\main\AndroidManifest.xml:23:13-49
	android:showOnLockScreen
		ADDED from D:\ASW akcelerometr\accelerometerandroid\app\src\main\AndroidManifest.xml:24:13-44
	android:name
		ADDED from D:\ASW akcelerometr\accelerometerandroid\app\src\main\AndroidManifest.xml:22:13-34
activity#eti.asw.accelerometer.accelerometer.About
ADDED from D:\ASW akcelerometr\accelerometerandroid\app\src\main\AndroidManifest.xml:25:9-43
	android:name
		ADDED from D:\ASW akcelerometr\accelerometerandroid\app\src\main\AndroidManifest.xml:25:19-40
activity#eti.asw.accelerometer.accelerometer.Ball
ADDED from D:\ASW akcelerometr\accelerometerandroid\app\src\main\AndroidManifest.xml:26:9-42
	android:name
		ADDED from D:\ASW akcelerometr\accelerometerandroid\app\src\main\AndroidManifest.xml:26:19-39
activity#eti.asw.accelerometer.accelerometer.VelocityActivity
ADDED from D:\ASW akcelerometr\accelerometerandroid\app\src\main\AndroidManifest.xml:27:9-54
	android:name
		ADDED from D:\ASW akcelerometr\accelerometerandroid\app\src\main\AndroidManifest.xml:27:19-51
activity#eti.asw.accelerometer.accelerometer.DisplacementActivity
ADDED from D:\ASW akcelerometr\accelerometerandroid\app\src\main\AndroidManifest.xml:28:9-58
	android:name
		ADDED from D:\ASW akcelerometr\accelerometerandroid\app\src\main\AndroidManifest.xml:28:19-55
activity#eti.asw.accelerometer.accelerometer.RecordedActivity
ADDED from D:\ASW akcelerometr\accelerometerandroid\app\src\main\AndroidManifest.xml:29:9-63
	android:name
		ADDED from D:\ASW akcelerometr\accelerometerandroid\app\src\main\AndroidManifest.xml:29:19-51
uses-sdk
INJECTED from D:\ASW akcelerometr\accelerometerandroid\app\src\main\AndroidManifest.xml reason: use-sdk injection requested
MERGED from [com.jjoe64:graphview:4.2.1] D:\ASW akcelerometr\accelerometerandroid\app\build\intermediates\exploded-aar\com.jjoe64\graphview\4.2.1\AndroidManifest.xml:7:5-9:41
MERGED from [com.android.support:design:25.1.0] D:\ASW akcelerometr\accelerometerandroid\app\build\intermediates\exploded-aar\com.android.support\design\25.1.0\AndroidManifest.xml:21:5-23:62
MERGED from [com.android.support:appcompat-v7:25.1.0] D:\ASW akcelerometr\accelerometerandroid\app\build\intermediates\exploded-aar\com.android.support\appcompat-v7\25.1.0\AndroidManifest.xml:21:5-23:78
MERGED from [com.android.support:animated-vector-drawable:25.1.0] D:\ASW akcelerometr\accelerometerandroid\app\build\intermediates\exploded-aar\com.android.support\animated-vector-drawable\25.1.0\AndroidManifest.xml:20:5-44
MERGED from [com.android.support:support-vector-drawable:25.1.0] D:\ASW akcelerometr\accelerometerandroid\app\build\intermediates\exploded-aar\com.android.support\support-vector-drawable\25.1.0\AndroidManifest.xml:21:5-43
MERGED from [com.android.support:recyclerview-v7:25.1.0] D:\ASW akcelerometr\accelerometerandroid\app\build\intermediates\exploded-aar\com.android.support\recyclerview-v7\25.1.0\AndroidManifest.xml:20:5-43
MERGED from [com.android.support:transition:25.1.0] D:\ASW akcelerometr\accelerometerandroid\app\build\intermediates\exploded-aar\com.android.support\transition\25.1.0\AndroidManifest.xml:20:5-44
MERGED from [com.android.support:support-v4:25.1.0] D:\ASW akcelerometr\accelerometerandroid\app\build\intermediates\exploded-aar\com.android.support\support-v4\25.1.0\AndroidManifest.xml:21:5-23:54
MERGED from [com.android.support:support-fragment:25.1.0] D:\ASW akcelerometr\accelerometerandroid\app\build\intermediates\exploded-aar\com.android.support\support-fragment\25.1.0\AndroidManifest.xml:21:5-23:60
MERGED from [com.android.support:support-media-compat:25.1.0] D:\ASW akcelerometr\accelerometerandroid\app\build\intermediates\exploded-aar\com.android.support\support-media-compat\25.1.0\AndroidManifest.xml:21:5-23:63
MERGED from [com.android.support:support-core-ui:25.1.0] D:\ASW akcelerometr\accelerometerandroid\app\build\intermediates\exploded-aar\com.android.support\support-core-ui\25.1.0\AndroidManifest.xml:21:5-23:58
MERGED from [com.android.support:support-core-utils:25.1.0] D:\ASW akcelerometr\accelerometerandroid\app\build\intermediates\exploded-aar\com.android.support\support-core-utils\25.1.0\AndroidManifest.xml:21:5-23:61
MERGED from [com.android.support:support-compat:25.1.0] D:\ASW akcelerometr\accelerometerandroid\app\build\intermediates\exploded-aar\com.android.support\support-compat\25.1.0\AndroidManifest.xml:21:5-23:58
	tools:overrideLibrary
		ADDED from [com.android.support:design:25.1.0] D:\ASW akcelerometr\accelerometerandroid\app\build\intermediates\exploded-aar\com.android.support\design\25.1.0\AndroidManifest.xml:23:9-59
	android:targetSdkVersion
		INJECTED from D:\ASW akcelerometr\accelerometerandroid\app\src\main\AndroidManifest.xml
		INJECTED from D:\ASW akcelerometr\accelerometerandroid\app\src\main\AndroidManifest.xml
	android:minSdkVersion
		INJECTED from D:\ASW akcelerometr\accelerometerandroid\app\src\main\AndroidManifest.xml
		INJECTED from D:\ASW akcelerometr\accelerometerandroid\app\src\main\AndroidManifest.xml
