%YAML 1.1
%TAG !u! tag:unity3d.com,2011:
--- !u!114 &11400000
MonoBehaviour:
  m_ObjectHideFlags: 0
  m_PrefabParentObject: {fileID: 0}
  m_PrefabInternal: {fileID: 0}
  m_GameObject: {fileID: 0}
  m_Enabled: 1
  m_EditorHideFlags: 0
  m_Script: {fileID: 2108210716, guid: 89f0137620f6af44b9ba852b4190e64e, type: 3}
  m_Name: Emerald
  m_EditorClassIdentifier: 
  topLeft: {r: 0.60294116, g: 1, b: 0.8544716, a: 1}
  topRight: {r: 0.6039216, g: 1, b: 0.85490197, a: 1}
  bottomLeft: {r: 0.38657004, g: 0.8088235, b: 0.6541366, a: 1}
  bottomRight: {r: 0.3882353, g: 0.80784315, b: 0.654902, a: 1}
