,Playlist_name,Artist,Song,Lyrics   
1,My songs,Ed Sheeran,Perfect,"   I found a love for me Darling, just dive right in and follow my lead Well, I found a girl, beautiful and sweet Oh, I never knew you were the someone waiting for me 'Cause we were just kids when we fell in love Not knowing what it was I will not give you up this time But darling, just kiss me slow, your heart is all I own And in your eyes, you're holding mine   Baby, I'm dancing in the dark with you between my arms Barefoot on the grass, listening to our favourite song When you said you looked a mess, I whispered underneath my breath But you heard it, darling, you look perfect tonight   Well I found a woman, stronger than anyone I know She shares my dreams, I hope that someday I'll share her home I found a love, to carry more than just my secrets To carry love, to carry children of our own We are still kids, but we're so in love Fighting against all odds I know we'll be alright this time Darling, just hold my hand Be my girl, I'll be your man I see my future in your eyes   Baby, I'm dancing in the dark, with you between my arms Barefoot on the grass, listening to our favorite song When I saw you in that dress, looking so beautiful I don't deserve this, darling, you look perfect tonight     Baby, I'm dancing in the dark, with you between my arms Barefoot on the grass, listening to our favorite song I have faith in what I see Now I know I have met an angel in person And she looks perfect I don't deserve this You look perfect tonight  "
2,My songs,Ed Sheeran,Photograph,"   Loving can hurt, loving can hurt sometimes But it's the only thing that I know When it gets hard, you know it can get hard sometimes It's the only thing that makes us feel alive   We keep this love in a photograph We made these memories for ourselves Where our eyes are never closing Our hearts were never broken And time's forever frozen, still   So you can keep me Inside the pocket of your ripped jeans Holding me close until our eyes meet You won't ever be alone, wait for me to come home   Loving can heal, loving can mend your soul And it's the only thing that I know I swear it will get easier, remember that with every piece of ya And it's the only thing to take with us when we die   We keep this love in a photograph We made these memories for ourselves Where our eyes are never closing Our hearts were never broken And time's forever frozen, still   So you can keep me Inside the pocket of your ripped jeans Holding me close until our eyes meet You won't ever be alone And if you hurt me, that's okay baby Only words bleed inside these pages You just hold me And I won’t ever let you go Wait for me to come home Wait for me to come home Wait for me to come home Wait for me to come home   Oh you can fit me Inside the necklace you got when you were sixteen Next to your heartbeat where I should be Keep it deep within your soul And if you hurt me, that's okay baby Only words bleed inside these pages You just hold me And I won’t ever let you go   When I'm away, I will remember how you kissed me Under the lamppost back on Sixth street Hearing you whisper through the phone Wait for me to come home  "
3,My songs,Christina Perri,A Thousand Years,"   Heart beats fast Colors and promises How to be brave? How can I love when I'm afraid to fall But watching you stand alone? All of my doubt suddenly goes away somehow One step closer   I have died everyday waiting for you Darling don't be afraid I have loved you For a thousand years I'll love you for a thousand more   Time stands still Beauty in all she is I will be brave I will not let anything take away What's standing in front of me Every breath Every hour has come to this One step closer   I have died everyday waiting for you Darling don't be afraid I have loved you For a thousand years I'll love you for a thousand more   And all along I believed I would find you Time has brought your heart to me I have loved you for a thousand years I'll love you for a thousand more One step closer One step closer   I have died everyday waiting for you Darling don't be afraid I have loved you For a thousand years I'll love you for a thousand more   And all along I believed I would find you Time has brought your heart to me I have loved you for a thousand years I'll love you for a thousand more"  
4,My songs,Ed Sheeran,Thinking Out Loud,"   When your legs don't work like they used to before And I can't sweep you off of your feet Will your mouth still remember the taste of my love? Will your eyes still smile from your cheeks? And darling I will be loving you till we're seventy And baby, my heart could still fall as hard at twenty-three And I'm thinking about how   People fall in love in mysterious ways Maybe just the touch of a hand Well me, I fall in love with you every single day I just wanna tell you I am   So honey, now, take me into your loving arms Kiss me under the light of a thousand stars Place your head on my beating heart, I'm thinking out loud And maybe we found love right where we are   When my hair's all but gone and my memory fades And the crowds don't remember my name When my hands don't play the strings the same way I know you will still love me the same Cause honey your soul could never grow old, it's evergreen And baby, your smile's forever in my mind and memory And I'm thinking about how   People fall in love in mysterious ways And maybe it's all part of a plan Well I'll just keep on making the same mistakes Hoping that you'll understand   So, baby, now, take me into your loving arms Kiss me under the light of a thousand stars Place your head on my beating heart, I'm thinking out loud And maybe we found love right where we are   So baby, now, take me into your loving arms Kiss me under the light of a thousand stars Oh darling, place your head on my beating heart, I'm thinking out loud That maybe we found love right where we are Oh baby, we found love right where we are And we found love right where we are  "
5,My songs,Bon Jovi,Always,"   This romeo is bleeding But you can't see his blood It's nothing but some feelings That this old dog kicked up It's been raining since you left me Now I'm drowning in the flood You see I've always been a fighter But without you I give up Now I can't sing a love song Like the way it's meant to be Well, I guess I'm not that good anymore But baby, that's just me   And I will love you, baby, always And I'll be there forever and a day, always I'll be there till the stars don't shine Till the heavens burst and The words don't rhyme And I know when I die, you'll be on my mind And I'll love you, always   Now your pictures that you left behind Are just memories of a different life Some that made us laugh, some that made us cry One that made you have to say goodbye What I'd give to run my fingers through your hair To touch your lips, to hold you near When you say your prayers try to understand I've made mistakes, I'm just a man When he holds you close, when he pulls you near When he says the words you've been needing to hear I'll wish I was him cause those words are mine To say to you till the end of time   Yeah, I will love you baby, always And I'll be there forever and a day, always   If you told me to cry for you I could If you told me to die for you I would Take a look at my face There's no price I won't pay To say these words to you  Well, there ain't no luck In these loaded dice But baby if you give me just one more try We can pack up our old dreams And our old lives We'll find a place where the sun still shines   And I will love you, baby, always And I'll be there forever and a day, always I'll be there till the stars don't shine Till the heavens burst and The words don't rhyme And I know when I die, you'll be on my mind And I'll love you, always  "
6,My songs,Ed Sheeran,How Would You Feel (Paean),"   You are the one, girl And you know that it's true I'm feeling younger Every time that I'm alone with you   We were sitting in a parked car Stealing kisses in a front yard We got questions we should not ask, but   How would you feel If I told you I loved you? It's just something that I want to do I'll be taking my time Spending my life Falling deeper in love with you So tell me that you love me too   In the summer As the lilacs bloom Love flows deeper than the river Every moment that I spend with you   We were sat upon our best friend's roof I had both of my arms around you Watching the sunrise replace the moon, but   How would you feel If I told you I loved you? It's just something that I want to do I'll be taking my time Spending my life Falling deeper in love with you So tell me that you love me too     Yeah, we were sitting in a parked car Stealing kisses in a front yard We got questions we should not ask   How would you feel If I told you I loved you? It's just something that I want to do I'll be taking my time Spending my life Falling deeper in love with you Tell me that you love me too Tell me that you love me too Tell me that you love me too  "
7,My songs,"John Travolta,Olivia Newton-John",You're The One That I Want,"   I got chills, they're multiplying And I'm losing control Cause the power you're supplying It's electrifying!   You better shape up, cause I need a man And my heart is set on you You better shape up, you better understand To my heart, I must be true Nothing left, nothing left for me to do   You're the one that I want (you are the one I want) Oo-oo-oo, honey The one that I want (you are the one I want) Oo-oo-oo, honey The one that I want (you are the one I want) Oo-oo-oo, the one I need (one I need) Oh, yes, indeed (yes indeed)   If you're filled with affection You're too shy to convey Meditate in my direction Feel your way   I better shape up, cause you need a man I need a man who can keep me satisfied I better shape up if I'm gonna prove You better prove that my faith is justified Are you sure? Yes, I'm sure down deep inside    You're the one that I want (you are the one I want) Oo-oo-oo, honey The one that I want (you are the one I want) Oo-oo-oo, honey The one that I want (you are the one I want) Oo-oo-oo, the one I need (one I need) Oh, yes, indeed (yes indeed)  You're the one that I want (you are the one I want) Oo-oo-oo, honey The one that I want (you are the one I want) Oo-oo-oo, honey The one that I want (you are the one I want) Oo-oo-oo, the one I need (one I need) Oh, yes, indeed (yes indeed)  You're the one that I want (you are the one I want) Oo-oo-oo, honey The one that I want (you are the one I want) Oo-oo-oo, honey The one that I want (you are the one I want) Oo-oo-oo, the one I need (one I need) Oh, yes, indeed (yes indeed)  "
8,My songs,"John Travolta,Olivia Newton-John",Summer Nights,"   Summer lovin', had me a blast Summer lovin', happened so fast I met a girl crazy for me Met a boy cute as can be   Summer days drifting away To, uh oh, those summer nights    Well-a, well-a, well-a, uh! Tell me more, tell me more  Did you get very far?  Tell me more, tell me more  Like does he have a car?   She swam by me, she got a cramp He ran by me, got my suit damp I saved her life, she nearly drowned He showed off splashing around   Summer sun, something's begun But, uh oh, those summer nights    Well-a, well-a, well-a, uh!  Tell me more, tell me more  Was it love at first sight?  Tell me more, tell me more  Did she put up a fight?   Took her bowling in the arcade We went strolling, drank lemonade We made out under the dock We stayed out till ten o'clock   Summer fling don't mean a thing But, uh oh, those summer nights    Woah, woah, woah  Tell me more, tell me more  But you don't gotta brag  Tell me more, tell me more  Cause he sounds like a drag   Shooda-bop bop Shooda-bop bop Shooda-bop bop Shooda-bop bop Shooda-bop bop Shooda-bop bop Shooda-bop bop Yeah   He got friendly holding my hand Well, she got friendly down in the sand He was sweet, just turned eighteen Well, she was good, you know what I mean   Summer heat, boy and girl meet But, uh oh, those summer nights    Woah, woah, woah  Tell me more, tell me more  How much dough did he spend?  Tell me more, tell me more  Could she get me a friend?   It turned colder, that's where it ends So I told her we'd still be friends Then we made our true love vow Wonder what she's doin' now   Summer dreams ripped at the seams But, oh, those summer nights (Tell me more, tell me more)  "
9,My songs,Sylvan Esso,Coffee,"    True, it's dance, we know the moves The bow, the dip, the woo Though the words are true The state is old news  Wrap me in your arms I can't feel it but Rock me in your arms I can't feel it but  Get up, get down Get up, get down Feel the turn of rotation and stop See the next one waiting Get up, get down Get up, get down Get up Sentiment's the same but the pair of feet change  I know my words will dry upon the skin Just like a name I remember hearing  Wild winters, warm coffee Mom's gone, do you love me? Blazing summer, cold coffee Baby's gone, do you love me?  Wrap me in your arms I can't feel it but Rock me in your arms I can't feel it but  Get up, get down Get up, get down Feel the turn of rotation and stop See the next one waiting Get up, get down Get up, get down Get up Sentiment's the same but the pair of feet change  Get up, get down Get up, get down Feel the general attention And stop, see the mix won't work Get up, get down Get up, get down Get up Sentiment's the same but the pair of feet change  My baby does the hanky-panky, baby My baby does (Rock me) My baby does the hanky-panky, baby (In your arms) My baby does  Get up, get down Get up, get down Feel the general attention And stop, see the mix won't work Get up, get down Get up, get down Get up Sentiment's the same but the pair of feet change  "
10,My songs,Bahamas,All The Time,"   I got all the time in the world Don't you want some of that? I got all the time in the world Don't you want some of that? Don't you want some of that? I would, if I were you   I had All (all) the (the) time (time) in the world You wanted none of that I had All (all) the (the) time (time) in the world You wanted none of that You wanted none of that I would if I were you   Put my Work(work) in (in) front (front) of my girl There's something wrong with that Put my Work(work) in (in) front (front) of my girl There's something wrong with that Something really, really wrong with that I know this to be true    "
11,My songs,Modern English,I Melt with You,"   Moving forward using all my breath Making love to you was never second best I saw the world crashing all around your face Never really knowing it was always Mesh and lace   I'll stop the world and melt with you You've seen the difference And it's getting better all the time There's nothing you and I won't do I'll stop the world and melt with you   (You should know better) Dream of better lives The kind which never hate (You should see why) Dropped in the state of imaginary grace  (You should know better) I made a pilgrimage To save this human race (You should see why) Never comprehending The race was long, long lost   I'll stop the world and melt with you (I'll stop the world) You've seen the difference And it's getting better all the time  (I'll stop the world) There's nothing you and I won't do (Let's stop the world) I'll stop the world and melt with you  The future's open wide   (Let's stop the world) I'll stop the world and melt with you (Let's stop the world) I've seen some changes But it's getting better all the time  (Let's stop the world) There's nothing you and I won't do (Let's stop the world) I'll stop the world and melt with you  The future's open wide Hmm hmm hmm Hmm hmm hmm hmm Hmm hmm hmm Hmm hmm hmm hmm   I'll stop the world and melt with you (Let's stop the world) You've seen the difference And it's getting better all the time (Let's stop the world) There's nothing you and I won't do (Let's stop the world)  I'll stop the world and melt with you (Let's stop the world) I'll stop the world and melt with you (Let's stop the world) I'll stop the world and melt with you (Let's stop the world) I'll stop the world and melt with you  "
12,My songs,Nina Simone,My Baby Just Cares For Me,"  My baby don't care for shows My baby don't care for clothes My baby just cares for me My baby don't care for cars and races My baby don't care for high-tone places  Liz Taylor is not his style And even Lana Turner's smile Is somethin' he can't see My baby don't care who knows My baby just cares for me  Baby, my baby don't care for shows And he don't even care for clothes He cares for me My baby don't care For cars and races Baby don't care for He don't care for high-tone places  Liz Taylor is not his style And even Liberace's smile Is something he can't see Is something he can't see I wonder what's wrong with baby My baby just cares for My baby just cares for My baby just cares for me  "
13,My songs,"DJ Snake,AlunaGeorge",You Know You Like It,"   Some people want me to be heads or tails I say no way, try again another day I should be happy, not tipping the scales I just won't lay, letting my life get away   I'm no fool, no, I'm not a follower I don't take things as they come, if they bring me down Life can be cruel, if you're a dreamer I just wanna have some fun, don't tell me what could be done   You know you like it but it drives you insane You know you like it but it drives you insane You know you like it but you're scared of the shame What you want, what you gonna do? You know you like it but it drives you insane Only because you know that you wanna feel the same You know you like it but it drives you insane What you want, what you gonna do?   If you wanna train me, like an animal Better keep your eye on my every move There's no need to be so damn cruel Baby you got nothing to prove   I'm no fool, no, I'm not a follower I don't take things as they come, if they bring me down Life can be cruel, if you're a dreamer I just wanna have some fun, don't tell me what could be done   You know you like it but it drives you insane You know you like it but it drives you insane You know you like it but you're scared of the shame What you want, what you gonna do? You know you like it but it drives you insane Only because you know that you wanna feel the same You know you like it but it drives you insane What you want, what you gonna do? You know you like it but it drives you insane You know you like it but it drives you insane You know you like it but you're scared of the shame What you want, what you gonna do? You know you like it but it drives you insane Only because you know that you wanna feel the same You know you like it but it drives you insane What you want, what you gonna do?  "
15,My songs,Tom Waits,How's It Gonna End,"  He had 3 whole dollars A worn out car And a wife who was Leaving for good Life's made of trouble Worry pain and struggle She wrote good bye in The dust on the hood They found a map of Missouri Lipstick on the glass They must've left In the middle of the night  And I want to know The same thing Everyone wants to know How's it going to end?  Behind a smoke colored curtain The girl disappeared They found out that the ring was a fake A tree born crooked Will never grow straight She sunk like a hammer into the lake A long lost letter and And old leaky boat Promises are never meant To keep  And I want to know The same thing Everyone wants to know How's it going to end?  The barn leaned over The vultures dried their wings The moon climbed up an empty sky The sun sank down Behind the tree on the hill There's a killer and he's coming Thru the rye But maybe he's the father Of that lost little girl It's hard to tell in this light  And I want to know The same thing Everyone wants to know How's it going to end?  Drag your wagon and your plow Over the bones of the dead Out among the roses and the weeds You can never go back And the answer is no And wishing for it only makes it bleed  Joel Tornabene was broken On the wheel Shane and Bum Mahoney on the lamb The grain was as gold As Sheila's hair All the way from Liverpool With all we could steal He was robbed of twenty dollars His body found stripped Cast into the harbour There and drowned  And I want to know The same thing Everyone wants to know How's it going to end?  The sirens are snaking Their way up the hill It's last call somewhere in the world The reptiles blend in with the Color of the street Life is sweet at the edge of a razor And down in the front row of An old picture show The old man is asleep As the credits start to roll  And I want to know The same thing We all want to know How's it going to end?  I want to know The same thing We all want to know How's it going to end?  And then I just Want to know just the same thing I don't want to know How's it going to end"  
16,My songs, Kraftwerk, "Pocket Calculator",  "I'm the operator With my pocket calculator I'm the operator With my pocket calculator  I am adding And subtracting I'm controlling And composing  I'm the operator With my pocket calculator I'm the operator With my pocket calculator  I am adding And subtracting I'm controlling And composing  By pressing down a special key It plays a little melody By pressing down a special key It plays a little melody  I'm the operator With my pocket calculator I'm the operator With my pocket calculator"  
18,My songs,Wolf Alice,Moaning Lisa Smile,"     She needs a lover to escape her father and mother She hopes for some other way out of the hole She's over achieving, chasing her dreams And coming down slowly, yeah it's out of control   A-ah-ah-ah-ah-ah-ah-ah-ah-ah-ah-ah-ah-ahh Scrap the blues if the blues don't work Flash your teeth though the inside hurts A-ah-ah-ah-ah-ah-ah-ah-ah-ah-ah-ah-ah-ahh Scrap the blues if the blues don't work Doesn't make you feel better, just makes others feel worse   All in the books and all in her blood And nowhere to run, cause it's out of control You wait for something to undo these feelings Waiting and waiting but it's out of control   A-ah-ah-ah-ah-ah-ah-ah-ah-ah-ah-ah-ah-ahh Scrap the blues if the blues don't work Flash your teeth though the inside hurts A-ah-ah-ah-ah-ah-ah-ah-ah-ah-ah-ah-ah-ahh Scrap the blues if the blues don't work Doesn't make you feel better, just makes others feel worse     A-ah-ah-ah-ah-ah-ah-ah-ah-ah-ah-ah-ah-ahh A-ah-ah-ah-ah-ah-ah-ah-ah-ah-ah-ah-ah-ahh It never is enough No, it never is enough It never is enough No, it never is enough  "
20,My songs,Made in Heights,Slow Burn,"   The world's a cheat, the world's a sham It likes to kick and scream, when we dance I listen to it race the tides, race on down the river Your world's alive, It's beating down hard No compromise, you know who's in charge Words that know what to say Emphasizing twisted waves from you   You don't hustle like the rest You don't try hard to impress You got everything I need, need, need, need, need There are things I need to learn I can feel my muscles turn   You give me that burn, burn, burn, burn, burn That slow burn, burn, burn, burn, burn Burn, burn, burn, burn, burn That slow burn, burn, burn, burn, burn   Don't let my heart beat, folding the flash Don't hesitate, hours looking in the past The only love is young, won't stay young, forever   You move my body waits, for energy You move my body always gets the best of me, always (You)   You don't hustle like the rest You don't try hard to impress You got everything I need, need, need, need, need There are things I need to learn I can feel my muscles turn   You give me that burn, burn, burn, burn, burn Burn, burn, burn, burn, burn Burn, burn, burn, burn, burn That slow burn, burn, burn, burn, burn (You)   You don't hustle like the rest You don't try hard to impress You got everything I need, need, need, need, need There are things I need to learn I can feel my muscles turn   You give me that burn, burn, burn, burn, burn Burn, burn, burn, burn, burn Burn, burn, burn, burn, burn That slow burn, burn, burn, burn, burn  "
21,My songs,Radiohead,Creep,"   When you were here before Couldn't look you in the eye You're just like an angel Your skin makes me cry You float like a feather In a beautiful world   I wish I was special You're so fuckin' special   But I'm a creep I'm a weirdo What the hell am I doing here? I don't belong here   I don't care if it hurts I want to have control I want a perfect body I want a perfect soul I want you to notice When I'm not around   You're so fuckin' special I wish I was special   But I'm a creep I'm a weirdo What the hell am I doing here? I don't belong here   She's running out the door She's running out She's run, run, run, run Run   Whatever makes you happy Whatever you want You're so fuckin' special I wish I was special But I'm a creep I'm a weirdo What the hell am I doing here? I don't belong here I don't belong here  "
22,My songs,Cake,Love You Madly,"  I don't want to wonder If this is a blunder I don't want to worry whether We're gonna stay together 'Till we die  I don't want to jump in Unless this music's thumping All the dishes rattle in the cupboards When the elephants arrive  I want to love you madly I want to love you now I want to love you madly, way I want to love you, love you Love you madly  I don't want to fake it I just want to make it The ornaments look pretty But they're pulling down the branches Of the Tree  I don't want to think about it I don't want to talk about it When I kiss your lips I want to sink down to the bottom Of the sea  I want to love you madly I want to love you now, yeah I want to love you madly, way I want to love you, love you Love you madly  I don't want to hold back I don't want to slip down I don't want to think back to the one thing that I know I Should have done  I don't want to doubt you Know everything about you I don't want to sit across the table from you Wishing I could run  I want to love you madly I want to love you now I want to love you madly, way I want to love you, love you Love you madly  "
23,My songs,Sarah McLachlan,Hold On,"  Hold on Hold on to yourself For this is gonna hurt like hell  Hold on Hold on to yourself You know that only time will tell  What is it in me that refuses to believe? This isn't easier than the real thing  My love, you know that you're my best friend You know I'd do anything for you My love, let nothing come between us My love for you is strong and true  Am I in heaven here or am I--? At the crossroads I am standing  So now you're sleeping peaceful I lie awake and pray You'll be strong tomorrow And will see another day And we will praise it And love the light that brings a smile across your face  Oh God, if you're out there, won't you hear me? I know that we've never talked before Oh God, the man I love is leaving Won't you take him when he comes to your door  Am I in heaven here or am I in hell? At the crossroads I am standing  Now you're sleeping peaceful I lie awake and pray That you'll be strong tomorrow And will see another day And we will praise it And love the light that brings a smile  Now you're sleeping peaceful I lie awake and pray That you'll be strong tomorrow And will see another day And we will praise it And love the light that brings a smile across your face  Hold on Hold on to yourself For this is gonna hurt like hell  "
25,My songs,Elbow,Honey Sun,"  I live and die by the hot and cold in strangers’ eyes But danger lies behind the tape across my door I know a place where angels lace the lemonade And I cannot stay where all the broken plans were made  Broken devotion Can I jump in the gun And fly Over the ocean Can I jump in the gun And string up a net across Lafayette And sing of my deeds while I’m gone And I'll spin some lies to tell you upon My return from the ends of the earth  She and I would death defy and promenade She and I were profligate as de rigueur She and I were for a Burton Taylor made She and I won't find another me and her  My sunflower My ringpip Oh love like a sundown harbour Oh love like a falling bomb Oh my love Give her wings and armour Oh my love Gotta be long gone"  
