# compile vhdl design source files
vhdl xil_defaultlib  \
"../../../../../project_1.srcs/sources_1/imports/src/common.vhd" \
"../../../../../project_1.srcs/sources_1/imports/Timer/BCDCNTR.vhd" \
"../../../../../project_1.srcs/sources_1/imports/VHDL/button_treatment/EDGEDTCTR.vhd" \
"../../../../../project_1.srcs/sources_1/imports/VHDL/Visualizer/src/Flash_Visualizer.vhd" \
"../../../../../project_1.srcs/sources_1/imports/VHDL/Visualizer/src/NormalVisualizer.vhd" \
"../../../../../project_1.srcs/sources_1/imports/VHDL/Visualizer/src/OnOff.vhd" \
"../../../../../project_1.srcs/sources_1/imports/VHDL/Visualizer/src/OutputTreatmentFSMVisualizer.vhd" \
"../../../../../project_1.srcs/sources_1/imports/PassStorage/PASS_STORAGE.vhd" \
"../../../../../project_1.srcs/sources_1/imports/Timer/STROBE.vhd" \
"../../../../../project_1.srcs/sources_1/imports/VHDL/button_treatment/SYNCHRNZR.vhd" \
"../../../../../project_1.srcs/sources_1/imports/TOP/TOP.vhd" \
"../../../../../project_1.srcs/sources_1/imports/VHDL/Visualizer/src/TimePassVisualizer.vhd" \
"../../../../../project_1.srcs/sources_1/imports/VHDL/Visualizer/src/Visualizer.vhd" \
"../../../../../project_1.srcs/sources_1/imports/VHDL/Visualizer/src/bin2seg.vhd" \
"../../../../../project_1.srcs/sources_1/imports/VHDL/button_treatment/button_treatment.vhd" \
"../../../../../project_1.srcs/sources_1/imports/VHDL/Comparator/comparador_completo.vhd" \
"../../../../../project_1.srcs/sources_1/imports/button_treatment/debounce.vhd" \
"../../../../../project_1.srcs/sources_1/imports/VHDL/FSMprincipal/fsm.vhd" \
"../../../../../project_1.srcs/sources_1/imports/VHDL/Visualizer/src/fsm_visualizer.vhd" \
"../../../../../project_1.srcs/sources_1/imports/VHDL/Visualizer/src/muxerBCD.vhd" \
"../../../../../project_1.srcs/sources_1/imports/VHDL/Visualizer/src/scanner.vhd" \
"../../../../../project_1.srcs/sources_1/imports/VHDL/Visualizer/src/selected.vhd" \
"../../../../../project_1.srcs/sources_1/imports/VHDL/Visualizer/src/timer.vhd" \
"../../../../../project_1.srcs/sources_1/imports/Timer/top_countdown.vhd" \
"../../../../../project_1.srcs/sources_1/imports/Timer/top_countdown_time.vhd" \
"../../../../../project_1.srcs/sim_1/new/TOP_tb.vhd" \

# Do not sort compile order
nosort
