{
  "project_info": {
    "project_number": "793510794623",
    "firebase_url": "https://smart-i-d5f5f.firebaseio.com",
    "project_id": "smart-i-d5f5f",
    "storage_bucket": "smart-i-d5f5f.appspot.com"
  },
  "client": [
    {
      "client_info": {
        "mobilesdk_app_id": "1:793510794623:android:ed07435df1a69f7e",
        "android_client_info": {
          "package_name": "com.musahah.smart_iandroid"
        }
      },
      "oauth_client": [
        {
          "client_id": "793510794623-bqihj3po44jjfiji8843n0vtm2rngn5v.apps.googleusercontent.com",
          "client_type": 3
        }
      ],
      "api_key": [
        {
          "current_key": "AIzaSyCwINVXmoxabpeP7Jv0p-Iho_iRC4hlp68"
        }
      ],
      "services": {
        "appinvite_service": {
          "other_platform_oauth_client": [
            {
              "client_id": "793510794623-bqihj3po44jjfiji8843n0vtm2rngn5v.apps.googleusercontent.com",
              "client_type": 3
            }
          ]
        }
      }
    }
  ],
  "configuration_version": "1"
}