%YAML 1.1
%TAG !u! tag:unity3d.com,2011:
--- !u!114 &11400000
MonoBehaviour:
  m_ObjectHideFlags: 0
  m_CorrespondingSourceObject: {fileID: 0}
  m_PrefabInstance: {fileID: 0}
  m_PrefabAsset: {fileID: 0}
  m_GameObject: {fileID: 0}
  m_Enabled: 1
  m_EditorHideFlags: 0
  m_Script: {fileID: 11500000, guid: 59575cc96a9a4f8f8f473d80f521a5a2, type: 3}
  m_Name: Level_5_SpawnConfig_1
  m_EditorClassIdentifier: 
  _waves:
  - _waveEnemies:
    - _enemy: {fileID: 3826783336169742046, guid: 60c522d2232836344a13c0f46a1654f2, type: 3}
      _count: 10
    - _enemy: {fileID: 2859891066250858679, guid: 29afac9a320c133459feae906e953c5c, type: 3}
      _count: 5
    - _enemy: {fileID: 3826783336169742046, guid: 60c522d2232836344a13c0f46a1654f2, type: 3}
      _count: 10
  - _waveEnemies:
    - _enemy: {fileID: 3826783336169742046, guid: 60c522d2232836344a13c0f46a1654f2, type: 3}
      _count: 10
    - _enemy: {fileID: 3826783336169742046, guid: 60c522d2232836344a13c0f46a1654f2, type: 3}
      _count: 10
    - _enemy: {fileID: 3826783336169742046, guid: 60c522d2232836344a13c0f46a1654f2, type: 3}
      _count: 10
    - _enemy: {fileID: 3826783336169742046, guid: 60c522d2232836344a13c0f46a1654f2, type: 3}
      _count: 10
  - _waveEnemies:
    - _enemy: {fileID: 2859891066250858679, guid: 29afac9a320c133459feae906e953c5c, type: 3}
      _count: 7
    - _enemy: {fileID: 2859891066250858679, guid: 29afac9a320c133459feae906e953c5c, type: 3}
      _count: 7
    - _enemy: {fileID: 2859891066250858679, guid: 29afac9a320c133459feae906e953c5c, type: 3}
      _count: 7
    - _enemy: {fileID: 2859891066250858679, guid: 29afac9a320c133459feae906e953c5c, type: 3}
      _count: 7
  - _waveEnemies:
    - _enemy: {fileID: 2859891066250858679, guid: 29afac9a320c133459feae906e953c5c, type: 3}
      _count: 10
    - _enemy: {fileID: 3826783336169742046, guid: 60c522d2232836344a13c0f46a1654f2, type: 3}
      _count: 20
    - _enemy: {fileID: 2859891066250858679, guid: 29afac9a320c133459feae906e953c5c, type: 3}
      _count: 10
    - _enemy: {fileID: 3826783336169742046, guid: 60c522d2232836344a13c0f46a1654f2, type: 3}
      _count: 20
    - _enemy: {fileID: 2859891066250858679, guid: 29afac9a320c133459feae906e953c5c, type: 3}
      _count: 10
    - _enemy: {fileID: 3826783336169742046, guid: 60c522d2232836344a13c0f46a1654f2, type: 3}
      _count: 20
