%YAML 1.1
%TAG !u! tag:unity3d.com,2011:
--- !u!1 &3952939593797322747
GameObject:
  m_ObjectHideFlags: 0
  m_CorrespondingSourceObject: {fileID: 0}
  m_PrefabInstance: {fileID: 0}
  m_PrefabAsset: {fileID: 0}
  serializedVersion: 6
  m_Component:
  - component: {fileID: 3952939593797322744}
  - component: {fileID: 3952939593797322750}
  - component: {fileID: 3952939593797322745}
  m_Layer: 0
  m_Name: CameraOrigin
  m_TagString: Untagged
  m_Icon: {fileID: 0}
  m_NavMeshLayer: 0
  m_StaticEditorFlags: 0
  m_IsActive: 1
--- !u!4 &3952939593797322744
Transform:
  m_ObjectHideFlags: 0
  m_CorrespondingSourceObject: {fileID: 0}
  m_PrefabInstance: {fileID: 0}
  m_PrefabAsset: {fileID: 0}
  m_GameObject: {fileID: 3952939593797322747}
  m_LocalRotation: {x: -0, y: -0.6454573, z: -0, w: 0.7637963}
  m_LocalPosition: {x: -0.56, y: 0, z: -7.02}
  m_LocalScale: {x: 1, y: 1, z: 1}
  m_Children: []
  m_Father: {fileID: 0}
  m_RootOrder: 0
  m_LocalEulerAnglesHint: {x: 0, y: -80.4, z: 0}
--- !u!114 &3952939593797322750
MonoBehaviour:
  m_ObjectHideFlags: 0
  m_CorrespondingSourceObject: {fileID: 0}
  m_PrefabInstance: {fileID: 0}
  m_PrefabAsset: {fileID: 0}
  m_GameObject: {fileID: 3952939593797322747}
  m_Enabled: 1
  m_EditorHideFlags: 0
  m_Script: {fileID: 11500000, guid: 267a892959954e01898f85ffec816d92, type: 3}
  m_Name: 
  m_EditorClassIdentifier: 
  _playerInput: {fileID: 3952939593797322745}
  _speed: 20
  _activeZonePercent: 10
  _center: {x: 0.8, y: 14.27}
  _size: {x: 37.2, y: 41.99}
--- !u!114 &3952939593797322745
MonoBehaviour:
  m_ObjectHideFlags: 0
  m_CorrespondingSourceObject: {fileID: 0}
  m_PrefabInstance: {fileID: 0}
  m_PrefabAsset: {fileID: 0}
  m_GameObject: {fileID: 3952939593797322747}
  m_Enabled: 1
  m_EditorHideFlags: 0
  m_Script: {fileID: 11500000, guid: 62899f850307741f2a39c98a8b639597, type: 3}
  m_Name: 
  m_EditorClassIdentifier: 
  m_Actions: {fileID: -944628639613478452, guid: 7aab17ce1466a324cab6c07c64c26d1e, type: 3}
  m_NotificationBehavior: 3
  m_UIInputModule: {fileID: 0}
  m_DeviceLostEvent:
    m_PersistentCalls:
      m_Calls: []
  m_DeviceRegainedEvent:
    m_PersistentCalls:
      m_Calls: []
  m_ControlsChangedEvent:
    m_PersistentCalls:
      m_Calls: []
  m_ActionEvents:
  - m_PersistentCalls:
      m_Calls: []
    m_ActionId: fd172956-ad32-4811-937a-11ec78204234
    m_ActionName: Camera/Camera[/Keyboard/w,/Keyboard/s,/Keyboard/a,/Keyboard/d]
  m_NeverAutoSwitchControlSchemes: 0
  m_DefaultControlScheme: 
  m_DefaultActionMap: Camera
  m_SplitScreenIndex: -1
  m_Camera: {fileID: 0}
