%YAML 1.1
%TAG !u! tag:unity3d.com,2011:
--- !u!114 &11400000
MonoBehaviour:
  m_ObjectHideFlags: 0
  m_CorrespondingSourceObject: {fileID: 0}
  m_PrefabInstance: {fileID: 0}
  m_PrefabAsset: {fileID: 0}
  m_GameObject: {fileID: 0}
  m_Enabled: 1
  m_EditorHideFlags: 0
  m_Script: {fileID: 11500000, guid: 4484169c02c235a468594d9b1efc78a6, type: 3}
  m_Name: Level_3_GameConfig
  m_EditorClassIdentifier: 
  _prepareTime: 10
  _maxHealth: 6
  _coins: 50
