%YAML 1.1
%TAG !u! tag:unity3d.com,2011:
--- !u!114 &11400000
MonoBehaviour:
  m_ObjectHideFlags: 0
  m_CorrespondingSourceObject: {fileID: 0}
  m_PrefabInstance: {fileID: 0}
  m_PrefabAsset: {fileID: 0}
  m_GameObject: {fileID: 0}
  m_Enabled: 1
  m_EditorHideFlags: 0
  m_Script: {fileID: 11500000, guid: ce7a49d2f7c3a5949b7ce96296289c6e, type: 3}
  m_Name: BigRat
  m_EditorClassIdentifier: 
  _maxHealth: 40
  _maxSpeed: 1
  _damage: 1
  _deathReward: 4
