%YAML 1.1
%TAG !u! tag:unity3d.com,2011:
--- !u!114 &11400000
MonoBehaviour:
  m_ObjectHideFlags: 0
  m_CorrespondingSourceObject: {fileID: 0}
  m_PrefabInstance: {fileID: 0}
  m_PrefabAsset: {fileID: 0}
  m_GameObject: {fileID: 0}
  m_Enabled: 1
  m_EditorHideFlags: 0
  m_Script: {fileID: 11500000, guid: 0fc7733a250e5294fa476de9a91fe378, type: 3}
  m_Name: MainConfig
  m_EditorClassIdentifier: 
  peopleCount: 10
  foodCount: 5
  woodCount: 5
  stoneCount: 0
  goldCount: 0
  humanProdLvl: 50
  foodProdLvl: 0
  woodProdLvl: 0
  stoneProdLvl: 0
  goldProdLvl: 0
