Inst  op      funct   ALU   Shift  RegWrite  Branch  Jump
add   000000  100000  0010  00     1         0       0
addi  001000  XXXXXX  0010  00     1         0       0
and   000000  100100  0000  00     1         0       0
andi  001100  XXXXXX  0000  00     1         0       0
sub   000000  100010  0110  00     1         0       0
or    000000  100101  0001  00     1         0       0
ori   001101  XXXXXX  0001  00     1         0       0
nor   000000  100111  1100  00     1         0       0
slt   000000  101010  0111  00     1         0       0
slti  001010  XXXXXX  0111  00     1         0       0
sll   000000  000000  XXXX  10     1         0       0
srl   000000  000010  XXXX  11     1         0       0
beq   000100  XXXXXX  0110  XX     0         1       0
bne   000101  XXXXXX  0110  XX     0         1       0
j     000010  XXXXXX  XXXX  XX     0         0       1
