[
{
	class: com.podravka.cokolino.screens.QuizGame$Quiz,
	question: "Testno pitanje 1",
	answers: {
		Prvi: true,
		Drugi: false,
		Treći: true
	}
},
{
	class: com.podravka.cokolino.screens.QuizGame$Quiz,
	question: "Testno pitanje 2",
	answers: {
		Prvi: true,
		Drugi: false
	}
},
{
	class: com.podravka.cokolino.screens.QuizGame$Quiz,
	question: "Testno pitanje 3",
	answers: {
		Prvi: true,
		Drugi: false
	}
},
{
	class: com.podravka.cokolino.screens.QuizGame$Quiz,
	question: "Testno pitanje 4",
	answers: {
		Prvi: true,
		Drugi: false,
		Treci: true,
		Cetvrti: false
	}
},
{
	class: com.podravka.cokolino.screens.QuizGame$Quiz,
	question: "Zbijeni bojni redovi u koje su Spartanci postrojili vojsku nazivaju se:",
	answers: {
		Kornjača: false,
		Felga: false,
		Korpus: false,
		Falange: true
	}
},
{
	class: com.podravka.cokolino.screens.QuizGame$Quiz,
	question: "Primarni i glavni cilj Križara bio je oslobođenje:",
	answers: {
		Dubrovnika: false,
		Berlina: false,
		Jeruzalema: true,
		Rima: false
	}
},
{
	class: com.podravka.cokolino.screens.QuizGame$Quiz,
	question: "Tko je prvi okrunjeni hrvatski kralj:",
	answers: {
		Krešimir: false,
		Držislav: true,
		Tomislav: false,
		Zvonimir: false
	}
},
{
	class: com.podravka.cokolino.screens.QuizGame$Quiz,
	question: "Tri broda Kristofera Kolumba:",
	answers: {
		"Mina, Nina, Aria": false,
		"Mila, Ria, Santa": false,
		"Nina, Kinta, Kore Linta": false,
		"Pinta, Nina, Santa Maria": true
	}
},
{
	class: com.podravka.cokolino.screens.QuizGame$Quiz,
	question: "Koje godine je Josip Jelačić proglašen banom:",
	answers: {
		1901: false,
		1876: false,
		1848: true,
		1798: false
	}
},
{
	class: com.podravka.cokolino.screens.QuizGame$Quiz,
	question: "Bh je oznaka za koji element:",
	answers: {
		Kisik: false,
		Bohrij: true,
		Berilij: false,
		Barij: false
	}
},
{
	class: com.podravka.cokolino.screens.QuizGame$Quiz,
	question: "Paladij je koji po redu element u PSE:",
	answers: {
		9: false,
		22: false,
		34: false,
		46: true
	}
},
{
	class: com.podravka.cokolino.screens.QuizGame$Quiz,
	question: "Ako je pH manji od 7 tada je tvar:",
	answers: {
		slatka: false,
		ljuta: false,
		kisela: true,
		slana: false
	}
},
{
	class: com.podravka.cokolino.screens.QuizGame$Quiz,
	question: "Dijamant je sastavljen od:",
	answers: {
		zlata: false,
		olova: false,
		ugljika: true,
		dijamanta: false
	}
},
{
	class: com.podravka.cokolino.screens.QuizGame$Quiz,
	question: "Aminokiseline u bjelančevinama su povezane:",
	answers: {
		"peptidnim vezama": true,
		"ionskim vezama": false,
		"metalnim vezama": false,
		"oksidnim vezama": false
	}
}
]