# 3ds Max Wavefront OBJ Exporter v0.97b - (c)2007 guruware
# File Created: 16.06.2018 19:48:45

#
# object Box005
#

v  0.0354 2.5522 0.0000
v  0.0354 3.6977 0.0000
v  1.4974 3.6977 0.0000
v  1.4974 2.5522 0.0000
v  2.5716 2.5522 7.7216
v  2.5716 3.6977 7.7216
v  2.4572 3.6977 7.7316
v  2.4572 2.5522 7.7316
v  0.6375 1.8489 2.1572
v  0.8954 1.8489 2.1572
v  0.8954 1.8489 2.5824
v  0.6375 1.8489 2.5824
v  1.1306 2.5522 2.1572
v  1.1306 3.6977 2.1572
v  1.1306 3.6977 2.5824
v  1.1306 2.5522 2.5824
v  0.8954 1.8489 2.5922
v  0.8954 1.8489 3.0105
v  0.5254 1.8489 3.2381
v  0.6375 1.8489 2.5922
v  -2.5670 2.7156 2.7858
v  -2.5670 3.6977 2.7858
v  -2.4883 3.6977 2.6743
v  -2.4883 2.7156 2.6743
v  1.7357 1.9715 5.9333
v  1.3587 1.9715 5.9558
v  1.6556 3.6977 5.8202
v  1.6556 2.5522 5.8202
v  -2.0501 1.9662 3.3446
v  -2.0501 1.9662 2.9357
v  0.7805 2.5522 2.7038
v  0.7805 3.6977 2.7038
v  -2.0210 3.6977 2.9183
v  -2.0210 2.6249 2.9183
v  0.8954 2.2424 2.1572
v  0.6375 2.2424 2.1572
v  2.3418 2.3651 7.6226
v  2.4617 2.3651 7.6121
v  0.8954 2.2424 2.5922
v  0.8954 2.2424 2.5824
v  0.6375 2.2424 2.5824
v  0.8954 2.2424 3.0105
v  -2.4446 2.4501 2.7494
v  -2.5716 2.4501 2.8940
v  1.8422 2.2424 5.9240
v  0.6629 2.2424 2.8991
v  1.4980 2.2424 5.8695
v  0.6375 2.2424 2.5922
v  -2.0501 2.3348 2.6576
v  -2.0355 2.3348 3.1997
v  0.6375 2.5522 2.5922
v  0.6375 3.6977 2.5922
v  0.6375 3.6977 2.5824
v  0.6375 2.5522 2.5824
v  1.1306 1.8489 2.5824
v  1.1306 1.8489 2.1572
v  1.1306 2.2424 2.1572
v  1.1306 2.2424 2.5824
v  0.8954 2.5522 2.1572
v  0.6375 2.5522 2.1572
v  -2.2057 2.6249 2.5153
v  -2.2057 2.3348 2.5153
v  -2.2057 2.3348 2.6543
v  -2.2057 2.6249 2.6543
v  0.8954 2.5522 3.0105
v  0.8954 2.5522 2.5922
v  1.9630 2.5522 5.9134
v  -2.0501 2.6249 2.6576
v  0.8954 2.5522 2.5824
v  -2.0501 3.6977 2.6576
v  0.8954 3.6977 3.0105
v  1.9630 3.6977 5.9134
v  0.6375 3.6977 2.1572
v  0.0354 3.6977 0.1953
v  0.0354 2.5522 0.1953
v  1.4974 2.5522 0.1953
v  1.4974 3.6977 0.1953
v  0.0354 2.1660 0.1953
v  0.0354 2.1660 0.0000
v  1.4974 2.1660 0.0000
v  1.4974 2.1660 0.1953
v  2.1545 2.5522 6.4377
v  2.1545 2.2424 6.4377
v  2.2306 2.2424 6.4377
v  2.2306 2.5522 6.4377
v  0.8954 3.6977 2.1572
v  0.8954 3.6977 2.5922
v  0.8954 3.6977 2.5824
v  0.0354 4.8433 0.0000
v  1.4974 4.8433 0.0000
v  2.5716 4.8433 7.7216
v  2.4572 4.8433 7.7316
v  0.6375 5.5466 2.1572
v  0.6375 5.5466 2.5824
v  0.8954 5.5466 2.5824
v  0.8954 5.5466 2.1572
v  1.1306 4.8433 2.1572
v  1.1306 4.8433 2.5824
v  0.8954 5.5466 2.5922
v  0.6375 5.5466 2.5922
v  0.5254 5.5466 3.2381
v  0.8954 5.5466 3.0105
v  -2.5670 4.6798 2.7858
v  -2.4883 4.6798 2.6743
v  1.3587 5.4239 5.9558
v  1.7357 5.4239 5.9333
v  1.6556 4.8433 5.8202
v  -2.0501 5.4292 2.9357
v  -2.0501 5.4292 3.3446
v  0.7805 4.8433 2.7038
v  -2.0210 4.7706 2.9183
v  0.8954 5.1531 2.1572
v  0.6375 5.1531 2.1572
v  2.3418 5.0304 7.6226
v  2.4617 5.0304 7.6121
v  0.8954 5.1531 2.5922
v  0.8954 5.1531 2.5824
v  0.6375 5.1531 2.5824
v  0.8954 5.1531 3.0105
v  -2.4446 4.9454 2.7494
v  -2.5716 4.9454 2.8940
v  1.8422 5.1531 5.9240
v  0.6629 5.1531 2.8991
v  1.4980 5.1531 5.8695
v  0.6375 5.1531 2.5922
v  -2.0501 5.0607 2.6576
v  -2.0355 5.0607 3.1997
v  0.6375 4.8433 2.5922
v  0.6375 4.8433 2.5824
v  1.1306 5.5466 2.5824
v  1.1306 5.1531 2.5824
v  1.1306 5.1531 2.1572
v  1.1306 5.5466 2.1572
v  0.8954 4.8433 2.1572
v  0.6375 4.8433 2.1572
v  -2.2057 4.7706 2.5153
v  -2.2057 4.7706 2.6543
v  -2.2057 5.0607 2.6543
v  -2.2057 5.0607 2.5153
v  0.8954 4.8433 3.0105
v  0.8954 4.8433 2.5922
v  1.9630 4.8433 5.9134
v  -2.0501 4.7706 2.6576
v  0.8954 4.8433 2.5824
v  0.0354 4.8433 0.1953
v  1.4974 4.8433 0.1953
v  0.0354 5.2295 0.1953
v  1.4974 5.2295 0.1953
v  1.4974 5.2295 0.0000
v  0.0354 5.2295 0.0000
v  2.1545 4.8433 6.4377
v  2.2306 4.8433 6.4377
v  2.2306 5.1531 6.4377
v  2.1545 5.1531 6.4377
v  0.0354 -1.1456 0.0000
v  0.0354 0.0000 0.0000
v  1.4974 0.0000 0.0000
v  1.4974 -1.1456 0.0000
v  2.5716 -1.1456 7.7216
v  2.5716 0.0000 7.7216
v  2.4572 0.0000 7.7316
v  2.4572 -1.1456 7.7316
v  0.6375 -1.8489 2.1572
v  0.8954 -1.8489 2.1572
v  0.8954 -1.8489 2.5824
v  0.6375 -1.8489 2.5824
v  1.1306 -1.1456 2.1572
v  1.1306 0.0000 2.1572
v  1.1306 0.0000 2.5824
v  1.1306 -1.1456 2.5824
v  0.8954 -1.8489 2.5922
v  0.8954 -1.8489 3.0105
v  0.5254 -1.8489 3.2381
v  0.6375 -1.8489 2.5922
v  -2.5670 -0.9821 2.7858
v  -2.5670 0.0000 2.7858
v  -2.4883 0.0000 2.6743
v  -2.4883 -0.9821 2.6743
v  1.7357 -1.7262 5.9333
v  1.3587 -1.7262 5.9558
v  1.6556 0.0000 5.8202
v  1.6556 -1.1456 5.8202
v  -2.0501 -1.7315 3.3446
v  -2.0501 -1.7315 2.9357
v  0.7805 -1.1456 2.7038
v  0.7805 0.0000 2.7038
v  -2.0210 0.0000 2.9183
v  -2.0210 -1.0728 2.9183
v  0.8954 -1.4553 2.1572
v  0.6375 -1.4553 2.1572
v  2.3418 -1.3327 7.6226
v  2.4617 -1.3327 7.6121
v  0.8954 -1.4553 2.5922
v  0.8954 -1.4553 2.5824
v  0.6375 -1.4553 2.5824
v  0.8954 -1.4553 3.0105
v  -2.4446 -1.2476 2.7494
v  -2.5716 -1.2476 2.8940
v  1.8422 -1.4553 5.9240
v  0.6629 -1.4553 2.8991
v  1.4980 -1.4553 5.8695
v  0.6375 -1.4553 2.5922
v  -2.0501 -1.3629 2.6576
v  -2.0355 -1.3629 3.1997
v  0.6375 -1.1456 2.5922
v  0.6375 0.0000 2.5922
v  0.6375 0.0000 2.5824
v  0.6375 -1.1456 2.5824
v  1.1306 -1.8489 2.5824
v  1.1306 -1.8489 2.1572
v  1.1306 -1.4553 2.1572
v  1.1306 -1.4553 2.5824
v  0.8954 -1.1456 2.1572
v  0.6375 -1.1456 2.1572
v  -2.2057 -1.0728 2.5153
v  -2.2057 -1.3629 2.5153
v  -2.2057 -1.3629 2.6543
v  -2.2057 -1.0728 2.6543
v  0.8954 -1.1456 3.0105
v  0.8954 -1.1456 2.5922
v  1.9630 -1.1456 5.9134
v  -2.0501 -1.0728 2.6576
v  0.8954 -1.1456 2.5824
v  -2.0501 0.0000 2.6576
v  0.8954 0.0000 3.0105
v  1.9630 0.0000 5.9134
v  0.6375 0.0000 2.1572
v  0.0354 0.0000 0.1953
v  0.0354 -1.1456 0.1953
v  1.4974 -1.1456 0.1953
v  1.4974 0.0000 0.1953
v  0.0354 -1.5317 0.1953
v  0.0354 -1.5317 0.0000
v  1.4974 -1.5317 0.0000
v  1.4974 -1.5317 0.1953
v  2.1545 -1.1456 6.4377
v  2.1545 -1.4553 6.4377
v  2.2306 -1.4553 6.4377
v  2.2306 -1.1456 6.4377
v  0.8954 0.0000 2.1572
v  0.8954 0.0000 2.5922
v  0.8954 0.0000 2.5824
v  0.0354 1.1456 0.0000
v  1.4974 1.1456 0.0000
v  2.5716 1.1456 7.7216
v  2.4572 1.1456 7.7316
v  1.1306 1.1456 2.1572
v  1.1306 1.1456 2.5824
v  -2.5670 0.9821 2.7858
v  -2.4883 0.9821 2.6743
v  1.3587 1.7262 5.9558
v  1.7357 1.7262 5.9333
v  1.6556 1.1456 5.8202
v  -2.0501 1.7315 2.9357
v  -2.0501 1.7315 3.3446
v  0.7805 1.1456 2.7038
v  -2.0210 1.0728 2.9183
v  0.8954 1.4553 2.1572
v  0.6375 1.4553 2.1572
v  2.3418 1.3327 7.6226
v  2.4617 1.3327 7.6121
v  0.8954 1.4553 2.5922
v  0.8954 1.4553 2.5824
v  0.6375 1.4553 2.5824
v  0.8954 1.4553 3.0105
v  -2.4446 1.2476 2.7494
v  -2.5716 1.2476 2.8940
v  1.8422 1.4553 5.9240
v  0.6629 1.4553 2.8991
v  1.4980 1.4553 5.8695
v  0.6375 1.4553 2.5922
v  -2.0501 1.3629 2.6576
v  -2.0355 1.3629 3.1997
v  0.6375 1.1456 2.5922
v  0.6375 1.1456 2.5824
v  1.1306 1.4553 2.5824
v  1.1306 1.4553 2.1572
v  0.8954 1.1456 2.1572
v  0.6375 1.1456 2.1572
v  -2.2057 1.0728 2.5153
v  -2.2057 1.0728 2.6543
v  -2.2057 1.3629 2.6543
v  -2.2057 1.3629 2.5153
v  0.8954 1.1456 3.0105
v  0.8954 1.1456 2.5922
v  1.9630 1.1456 5.9134
v  -2.0501 1.0728 2.6576
v  0.8954 1.1456 2.5824
v  0.0354 1.1456 0.1953
v  1.4974 1.1456 0.1953
v  0.0354 1.5317 0.1953
v  1.4974 1.5317 0.1953
v  1.4974 1.5317 0.0000
v  0.0354 1.5317 0.0000
v  2.1545 1.1456 6.4377
v  2.2306 1.1456 6.4377
v  2.2306 1.4553 6.4377
v  2.1545 1.4553 6.4377
v  0.0354 -4.8433 0.0000
v  0.0354 -3.6977 0.0000
v  1.4974 -3.6977 0.0000
v  1.4974 -4.8433 0.0000
v  2.5716 -4.8433 7.7216
v  2.5716 -3.6977 7.7216
v  2.4572 -3.6977 7.7316
v  2.4572 -4.8433 7.7316
v  0.6375 -5.5466 2.1572
v  0.8954 -5.5466 2.1572
v  0.8954 -5.5466 2.5824
v  0.6375 -5.5466 2.5824
v  1.1306 -4.8433 2.1572
v  1.1306 -3.6977 2.1572
v  1.1306 -3.6977 2.5824
v  1.1306 -4.8433 2.5824
v  0.8954 -5.5466 2.5922
v  0.8954 -5.5466 3.0105
v  0.5254 -5.5466 3.2381
v  0.6375 -5.5466 2.5922
v  -2.5670 -4.6798 2.7858
v  -2.5670 -3.6977 2.7858
v  -2.4883 -3.6977 2.6743
v  -2.4883 -4.6798 2.6743
v  1.7357 -5.4239 5.9333
v  1.3587 -5.4239 5.9558
v  1.6556 -3.6977 5.8202
v  1.6556 -4.8433 5.8202
v  -2.0501 -5.4292 3.3446
v  -2.0501 -5.4292 2.9357
v  0.7805 -4.8433 2.7038
v  0.7805 -3.6977 2.7038
v  -2.0210 -3.6977 2.9183
v  -2.0210 -4.7706 2.9183
v  0.8954 -5.1531 2.1572
v  0.6375 -5.1531 2.1572
v  2.3418 -5.0304 7.6226
v  2.4617 -5.0304 7.6121
v  0.8954 -5.1531 2.5922
v  0.8954 -5.1531 2.5824
v  0.6375 -5.1531 2.5824
v  0.8954 -5.1531 3.0105
v  -2.4446 -4.9454 2.7494
v  -2.5716 -4.9454 2.8940
v  1.8422 -5.1531 5.9240
v  0.6629 -5.1531 2.8991
v  1.4980 -5.1531 5.8695
v  0.6375 -5.1531 2.5922
v  -2.0501 -5.0607 2.6576
v  -2.0355 -5.0607 3.1997
v  0.6375 -4.8433 2.5922
v  0.6375 -3.6977 2.5922
v  0.6375 -3.6977 2.5824
v  0.6375 -4.8433 2.5824
v  1.1306 -5.5466 2.5824
v  1.1306 -5.5466 2.1572
v  1.1306 -5.1531 2.1572
v  1.1306 -5.1531 2.5824
v  0.8954 -4.8433 2.1572
v  0.6375 -4.8433 2.1572
v  -2.2057 -4.7706 2.5153
v  -2.2057 -5.0607 2.5153
v  -2.2057 -5.0607 2.6543
v  -2.2057 -4.7706 2.6543
v  0.8954 -4.8433 3.0105
v  0.8954 -4.8433 2.5922
v  1.9630 -4.8433 5.9134
v  -2.0501 -4.7706 2.6576
v  0.8954 -4.8433 2.5824
v  -2.0501 -3.6977 2.6576
v  0.8954 -3.6977 3.0105
v  1.9630 -3.6977 5.9134
v  0.6375 -3.6977 2.1572
v  0.0354 -3.6977 0.1953
v  0.0354 -4.8433 0.1953
v  1.4974 -4.8433 0.1953
v  1.4974 -3.6977 0.1953
v  0.0354 -5.2295 0.1953
v  0.0354 -5.2295 0.0000
v  1.4974 -5.2295 0.0000
v  1.4974 -5.2295 0.1953
v  2.1545 -4.8433 6.4377
v  2.1545 -5.1531 6.4377
v  2.2306 -5.1531 6.4377
v  2.2306 -4.8433 6.4377
v  0.8954 -3.6977 2.1572
v  0.8954 -3.6977 2.5922
v  0.8954 -3.6977 2.5824
v  0.0354 -2.5522 0.0000
v  1.4974 -2.5522 0.0000
v  2.5716 -2.5522 7.7216
v  2.4572 -2.5522 7.7316
v  1.1306 -2.5522 2.1572
v  1.1306 -2.5522 2.5824
v  -2.5670 -2.7156 2.7858
v  -2.4883 -2.7156 2.6743
v  1.3587 -1.9715 5.9558
v  1.7357 -1.9715 5.9333
v  1.6556 -2.5522 5.8202
v  -2.0501 -1.9662 2.9357
v  -2.0501 -1.9662 3.3446
v  0.7805 -2.5522 2.7038
v  -2.0210 -2.6249 2.9183
v  0.8954 -2.2424 2.1572
v  0.6375 -2.2424 2.1572
v  2.3418 -2.3651 7.6226
v  2.4617 -2.3651 7.6121
v  0.8954 -2.2424 2.5922
v  0.8954 -2.2424 2.5824
v  0.6375 -2.2424 2.5824
v  0.8954 -2.2424 3.0105
v  -2.4446 -2.4501 2.7494
v  -2.5716 -2.4501 2.8940
v  1.8422 -2.2424 5.9240
v  0.6629 -2.2424 2.8991
v  1.4980 -2.2424 5.8695
v  0.6375 -2.2424 2.5922
v  -2.0501 -2.3348 2.6576
v  -2.0355 -2.3348 3.1997
v  0.6375 -2.5522 2.5922
v  0.6375 -2.5522 2.5824
v  1.1306 -2.2424 2.5824
v  1.1306 -2.2424 2.1572
v  0.8954 -2.5522 2.1572
v  0.6375 -2.5522 2.1572
v  -2.2057 -2.6249 2.5153
v  -2.2057 -2.6249 2.6543
v  -2.2057 -2.3348 2.6543
v  -2.2057 -2.3348 2.5153
v  0.8954 -2.5522 3.0105
v  0.8954 -2.5522 2.5922
v  1.9630 -2.5522 5.9134
v  -2.0501 -2.6249 2.6576
v  0.8954 -2.5522 2.5824
v  0.0354 -2.5522 0.1953
v  1.4974 -2.5522 0.1953
v  0.0354 -2.1660 0.1953
v  1.4974 -2.1660 0.1953
v  1.4974 -2.1660 0.0000
v  0.0354 -2.1660 0.0000
v  2.1545 -2.5522 6.4377
v  2.2306 -2.5522 6.4377
v  2.2306 -2.2424 6.4377
v  2.1545 -2.2424 6.4377
# 442 vertices

o Box005
g Box005
f 1 2 3 4 
f 5 6 7 8 
f 9 10 11 12 
f 13 14 15 16 
f 17 18 19 20 
f 21 22 23 24 
f 18 25 26 19 
f 8 7 27 28 
f 20 19 29 30 
f 31 32 33 34 
f 35 10 9 36 
f 37 26 25 38 
f 39 17 11 40 
f 36 9 12 41 
f 42 18 17 39 
f 43 30 29 44 
f 38 25 45 
f 46 19 26 47 
f 48 20 30 49 
f 44 29 50 
f 11 17 20 12 
f 51 52 53 54 
f 55 56 57 58 
f 12 20 48 41 
f 59 35 36 60 
f 8 37 38 5 
f 16 58 57 13 
f 61 62 63 64 
f 65 42 39 66 
f 24 43 44 21 
f 5 38 45 67 
f 31 46 47 28 
f 51 48 49 68 
f 21 44 50 34 
f 66 39 40 69 
f 54 41 48 51 
f 60 36 62 61 
f 36 41 63 62 
f 41 54 64 63 
f 54 60 61 64 
f 68 24 23 70 
f 30 43 49 
f 29 19 46 50 
f 49 43 24 68 
f 50 46 31 34 
f 67 65 71 72 
f 25 18 42 45 
f 26 37 47 
f 45 42 65 67 
f 47 37 8 28 
f 60 73 74 75 
f 59 60 75 76 
f 76 4 3 77 
f 78 79 80 81 
f 1 4 80 79 
f 4 76 81 80 
f 76 75 78 81 
f 75 1 79 78 
f 82 83 84 85 
f 40 11 55 58 
f 11 10 56 55 
f 10 35 57 56 
f 35 59 13 57 
f 59 86 14 13 
f 69 40 83 82 
f 40 58 84 83 
f 58 16 85 84 
f 16 69 82 85 
f 73 60 54 53 
f 71 65 66 87 
f 6 5 67 72 
f 52 51 68 70 
f 87 66 69 88 
f 22 21 34 33 
f 32 31 28 27 
f 86 59 76 77 
f 2 1 75 74 
f 88 69 16 15 
f 89 90 3 2 
f 91 92 7 6 
f 93 94 95 96 
f 97 98 15 14 
f 99 100 101 102 
f 103 104 23 22 
f 102 101 105 106 
f 92 107 27 7 
f 100 108 109 101 
f 110 111 33 32 
f 112 113 93 96 
f 114 115 106 105 
f 116 117 95 99 
f 113 118 94 93 
f 119 116 99 102 
f 120 121 109 108 
f 115 122 106 
f 123 124 105 101 
f 125 126 108 100 
f 121 127 109 
f 95 94 100 99 
f 128 129 53 52 
f 130 131 132 133 
f 94 118 125 100 
f 134 135 113 112 
f 92 91 115 114 
f 98 97 132 131 
f 136 137 138 139 
f 140 141 116 119 
f 104 103 121 120 
f 91 142 122 115 
f 110 107 124 123 
f 128 143 126 125 
f 103 111 127 121 
f 141 144 117 116 
f 129 128 125 118 
f 135 136 139 113 
f 113 139 138 118 
f 118 138 137 129 
f 129 137 136 135 
f 143 70 23 104 
f 108 126 120 
f 109 127 123 101 
f 126 143 104 120 
f 127 111 110 123 
f 142 72 71 140 
f 106 122 119 102 
f 105 124 114 
f 122 142 140 119 
f 124 107 92 114 
f 135 145 74 73 
f 134 146 145 135 
f 146 77 3 90 
f 147 148 149 150 
f 89 150 149 90 
f 90 149 148 146 
f 146 148 147 145 
f 145 147 150 89 
f 151 152 153 154 
f 117 131 130 95 
f 95 130 133 96 
f 96 133 132 112 
f 112 132 97 134 
f 134 97 14 86 
f 144 151 154 117 
f 117 154 153 131 
f 131 153 152 98 
f 98 152 151 144 
f 73 53 129 135 
f 71 87 141 140 
f 6 72 142 91 
f 52 70 143 128 
f 87 88 144 141 
f 22 33 111 103 
f 32 27 107 110 
f 86 77 146 134 
f 2 74 145 89 
f 88 15 98 144 
f 155 156 157 158 
f 159 160 161 162 
f 163 164 165 166 
f 167 168 169 170 
f 171 172 173 174 
f 175 176 177 178 
f 172 179 180 173 
f 162 161 181 182 
f 174 173 183 184 
f 185 186 187 188 
f 189 164 163 190 
f 191 180 179 192 
f 193 171 165 194 
f 190 163 166 195 
f 196 172 171 193 
f 197 184 183 198 
f 192 179 199 
f 200 173 180 201 
f 202 174 184 203 
f 198 183 204 
f 165 171 174 166 
f 205 206 207 208 
f 209 210 211 212 
f 166 174 202 195 
f 213 189 190 214 
f 162 191 192 159 
f 170 212 211 167 
f 215 216 217 218 
f 219 196 193 220 
f 178 197 198 175 
f 159 192 199 221 
f 185 200 201 182 
f 205 202 203 222 
f 175 198 204 188 
f 220 193 194 223 
f 208 195 202 205 
f 214 190 216 215 
f 190 195 217 216 
f 195 208 218 217 
f 208 214 215 218 
f 222 178 177 224 
f 184 197 203 
f 183 173 200 204 
f 203 197 178 222 
f 204 200 185 188 
f 221 219 225 226 
f 179 172 196 199 
f 180 191 201 
f 199 196 219 221 
f 201 191 162 182 
f 214 227 228 229 
f 213 214 229 230 
f 230 158 157 231 
f 232 233 234 235 
f 155 158 234 233 
f 158 230 235 234 
f 230 229 232 235 
f 229 155 233 232 
f 236 237 238 239 
f 194 165 209 212 
f 165 164 210 209 
f 164 189 211 210 
f 189 213 167 211 
f 213 240 168 167 
f 223 194 237 236 
f 194 212 238 237 
f 212 170 239 238 
f 170 223 236 239 
f 227 214 208 207 
f 225 219 220 241 
f 160 159 221 226 
f 206 205 222 224 
f 241 220 223 242 
f 176 175 188 187 
f 186 185 182 181 
f 240 213 230 231 
f 156 155 229 228 
f 242 223 170 169 
f 243 244 157 156 
f 245 246 161 160 
f 9 12 11 10 
f 247 248 169 168 
f 17 20 19 18 
f 249 250 177 176 
f 18 19 251 252 
f 246 253 181 161 
f 20 254 255 19 
f 256 257 187 186 
f 258 259 9 10 
f 260 261 252 251 
f 262 263 11 17 
f 259 264 12 9 
f 265 262 17 18 
f 266 267 255 254 
f 261 268 252 
f 269 270 251 19 
f 271 272 254 20 
f 267 273 255 
f 11 12 20 17 
f 274 275 207 206 
f 55 276 277 56 
f 12 264 271 20 
f 278 279 259 258 
f 246 245 261 260 
f 248 247 277 276 
f 280 281 282 283 
f 284 285 262 265 
f 250 249 267 266 
f 245 286 268 261 
f 256 253 270 269 
f 274 287 272 271 
f 249 257 273 267 
f 285 288 263 262 
f 275 274 271 264 
f 279 280 283 259 
f 259 283 282 264 
f 264 282 281 275 
f 275 281 280 279 
f 287 224 177 250 
f 254 272 266 
f 255 273 269 19 
f 272 287 250 266 
f 273 257 256 269 
f 286 226 225 284 
f 252 268 265 18 
f 251 270 260 
f 268 286 284 265 
f 270 253 246 260 
f 279 289 228 227 
f 278 290 289 279 
f 290 231 157 244 
f 291 292 293 294 
f 243 294 293 244 
f 244 293 292 290 
f 290 292 291 289 
f 289 291 294 243 
f 295 296 297 298 
f 263 276 55 11 
f 11 55 56 10 
f 10 56 277 258 
f 258 277 247 278 
f 278 247 168 240 
f 288 295 298 263 
f 263 298 297 276 
f 276 297 296 248 
f 248 296 295 288 
f 227 207 275 279 
f 225 241 285 284 
f 160 226 286 245 
f 206 224 287 274 
f 241 242 288 285 
f 176 187 257 249 
f 186 181 253 256 
f 240 231 290 278 
f 156 228 289 243 
f 242 169 248 288 
f 299 300 301 302 
f 303 304 305 306 
f 307 308 309 310 
f 311 312 313 314 
f 315 316 317 318 
f 319 320 321 322 
f 316 323 324 317 
f 306 305 325 326 
f 318 317 327 328 
f 329 330 331 332 
f 333 308 307 334 
f 335 324 323 336 
f 337 315 309 338 
f 334 307 310 339 
f 340 316 315 337 
f 341 328 327 342 
f 336 323 343 
f 344 317 324 345 
f 346 318 328 347 
f 342 327 348 
f 309 315 318 310 
f 349 350 351 352 
f 353 354 355 356 
f 310 318 346 339 
f 357 333 334 358 
f 306 335 336 303 
f 314 356 355 311 
f 359 360 361 362 
f 363 340 337 364 
f 322 341 342 319 
f 303 336 343 365 
f 329 344 345 326 
f 349 346 347 366 
f 319 342 348 332 
f 364 337 338 367 
f 352 339 346 349 
f 358 334 360 359 
f 334 339 361 360 
f 339 352 362 361 
f 352 358 359 362 
f 366 322 321 368 
f 328 341 347 
f 327 317 344 348 
f 347 341 322 366 
f 348 344 329 332 
f 365 363 369 370 
f 323 316 340 343 
f 324 335 345 
f 343 340 363 365 
f 345 335 306 326 
f 358 371 372 373 
f 357 358 373 374 
f 374 302 301 375 
f 376 377 378 379 
f 299 302 378 377 
f 302 374 379 378 
f 374 373 376 379 
f 373 299 377 376 
f 380 381 382 383 
f 338 309 353 356 
f 309 308 354 353 
f 308 333 355 354 
f 333 357 311 355 
f 357 384 312 311 
f 367 338 381 380 
f 338 356 382 381 
f 356 314 383 382 
f 314 367 380 383 
f 371 358 352 351 
f 369 363 364 385 
f 304 303 365 370 
f 350 349 366 368 
f 385 364 367 386 
f 320 319 332 331 
f 330 329 326 325 
f 384 357 374 375 
f 300 299 373 372 
f 386 367 314 313 
f 387 388 301 300 
f 389 390 305 304 
f 163 166 165 164 
f 391 392 313 312 
f 171 174 173 172 
f 393 394 321 320 
f 172 173 395 396 
f 390 397 325 305 
f 174 398 399 173 
f 400 401 331 330 
f 402 403 163 164 
f 404 405 396 395 
f 406 407 165 171 
f 403 408 166 163 
f 409 406 171 172 
f 410 411 399 398 
f 405 412 396 
f 413 414 395 173 
f 415 416 398 174 
f 411 417 399 
f 165 166 174 171 
f 418 419 351 350 
f 209 420 421 210 
f 166 408 415 174 
f 422 423 403 402 
f 390 389 405 404 
f 392 391 421 420 
f 424 425 426 427 
f 428 429 406 409 
f 394 393 411 410 
f 389 430 412 405 
f 400 397 414 413 
f 418 431 416 415 
f 393 401 417 411 
f 429 432 407 406 
f 419 418 415 408 
f 423 424 427 403 
f 403 427 426 408 
f 408 426 425 419 
f 419 425 424 423 
f 431 368 321 394 
f 398 416 410 
f 399 417 413 173 
f 416 431 394 410 
f 417 401 400 413 
f 430 370 369 428 
f 396 412 409 172 
f 395 414 404 
f 412 430 428 409 
f 414 397 390 404 
f 423 433 372 371 
f 422 434 433 423 
f 434 375 301 388 
f 435 436 437 438 
f 387 438 437 388 
f 388 437 436 434 
f 434 436 435 433 
f 433 435 438 387 
f 439 440 441 442 
f 407 420 209 165 
f 165 209 210 164 
f 164 210 421 402 
f 402 421 391 422 
f 422 391 312 384 
f 432 439 442 407 
f 407 442 441 420 
f 420 441 440 392 
f 392 440 439 432 
f 371 351 419 423 
f 369 385 429 428 
f 304 370 430 389 
f 350 368 431 418 
f 385 386 432 429 
f 320 331 401 393 
f 330 325 397 400 
f 384 375 434 422 
f 300 372 433 387 
f 386 313 392 432 
# 444 polygons - 24 triangles

