%YAML 1.1
%TAG !u! tag:unity3d.com,2011:
--- !u!1045 &1
EditorBuildSettings:
  m_ObjectHideFlags: 0
  serializedVersion: 2
  m_Scenes:
  - enabled: 1
    path: Assets/Menu.unity
    guid: 099a7c14d08bc9c4a9c3d8be6afe55ce
  - enabled: 1
    path: Assets/controls.unity
    guid: 4408228a8a548834faf38f78cbf88ca2
  - enabled: 1
    path: Assets/Level01.unity
    guid: 9fc0d4010bbf28b4594072e72b8655ab
  - enabled: 1
    path: Assets/Level02.unity
    guid: b7b44a32f6bc4cd4d90c5bab89edd87e
  - enabled: 1
    path: Assets/Level03.unity
    guid: 67e68d63d21b3de46b3d2e11891abc16
  - enabled: 1
    path: Assets/Credits.unity
    guid: d488401d4933c7141af2012e33651e12
  m_configObjects: {}
