   2.5795821e-01
   2.7351950e-01
   2.6530843e-01
   2.7652476e-01
   2.5562187e-01
   3.0780814e-01
   2.6332752e-01
   2.8755577e-01
   2.8755577e-01
   2.8551733e-01
   2.6082510e-01
   2.5757397e-01
   2.8269998e-01
   3.0616762e-01
   2.5370250e-01
   2.9955986e-01
   2.8197214e-01
   2.6050684e-01
   2.5590260e-01
   2.6126746e-01
   2.8714026e-01
   3.0421306e-01
   2.8386237e-01
   2.7303430e-01
   2.7322431e-01
   2.6655365e-01
   2.6088871e-01
   2.9413808e-01
   2.7460139e-01
   2.8561111e-01
   2.5259998e-01
   3.0429781e-01
   3.0468251e-01
   2.9322002e-01
   2.8448715e-01
   2.6404601e-01
   2.9620237e-01
   2.6207369e-01
   2.6288905e-01
   2.8662122e-01
   2.8833840e-01
   2.8441620e-01
   2.6046161e-01
   2.7984772e-01
   2.8692387e-01
   2.7381170e-01
   2.8879638e-01
   2.6438983e-01
   2.8406001e-01
   2.9575778e-01
   2.5290290e-01
   3.3027504e-01
   3.0585468e-01
   3.0875977e-01
   2.8556335e-01
   3.2906966e-01
   3.0143561e-01
   2.5935689e-01
   3.0966654e-01
   2.7433413e-01
   2.7735661e-01
   2.4301695e-01
   2.8011039e-01
   2.9755466e-01
   2.9727105e-01
   2.5339195e-01
   2.7677220e-01
   2.7453946e-01
   2.5965384e-01
   2.8167602e-01
   2.7695178e-01
   2.5472860e-01
   2.5629504e-01
   2.9075676e-01
   2.8460697e-01
   3.0627778e-01
   2.8573839e-01
   2.5342731e-01
   2.7979131e-01
   2.7274535e-01
   2.8571634e-01
   2.6132231e-01
   3.0263763e-01
   2.6091638e-01
   2.7459936e-01
   2.9906955e-01
   2.5549285e-01
   2.8933526e-01
   3.0426454e-01
   3.0331334e-01
   3.0472014e-01
   2.8026847e-01
   2.7328159e-01
   3.0271957e-01
   2.7495698e-01
   2.7112068e-01
   2.6115774e-01
   2.7855707e-01
   2.7749882e-01
   2.6962365e-01
