   4.6872618e-05   2.3895216e-05   6.0823947e-05   2.9626788e-05   9.7138206e-06
   4.4096096e-05   2.5403451e-05   0.0000000e+00   1.6635201e-05   0.0000000e+00
   4.4853826e-05   3.2915359e-05   6.3205403e-05   1.9671681e-05   0.0000000e+00
   4.6717833e-05   3.1230800e-05   6.3436099e-05   2.3999200e-05   0.0000000e+00
   4.4167377e-05   2.4205221e-05   0.0000000e+00   0.0000000e+00   0.0000000e+00
   4.5082987e-05   0.0000000e+00   3.8027270e-05   4.9585598e-05   0.0000000e+00
   4.6257040e-05   3.1324775e-05   5.5677463e-05   2.3929443e-05   0.0000000e+00
   4.3335159e-05   3.0215472e-05   0.0000000e+00   1.5976636e-05   0.0000000e+00
   4.3335159e-05   3.0215472e-05   0.0000000e+00   1.5976636e-05   0.0000000e+00
   4.5732041e-05   3.1608749e-05   4.2125048e-05   2.2534163e-05   0.0000000e+00
   4.3307468e-05   4.0080255e-05   8.9893067e-05   1.3195948e-05   0.0000000e+00
   4.5251166e-05   2.4400665e-05   4.2400423e-05   3.8881150e-05   0.0000000e+00
   4.3070366e-05   2.9214127e-05   0.0000000e+00   0.0000000e+00   0.0000000e+00
   4.6523041e-05   2.6044499e-05   5.5806873e-05   2.3724273e-05   0.0000000e+00
   4.3460356e-05   3.0235146e-05   0.0000000e+00   1.5689831e-05   0.0000000e+00
   4.3650393e-05   2.9532589e-05   0.0000000e+00   0.0000000e+00   0.0000000e+00
   4.6934414e-05   3.3797850e-05   6.4263171e-05   3.5666221e-05   0.0000000e+00
   4.6575152e-05   2.6770883e-05   5.0243270e-05   2.6557072e-05   0.0000000e+00
   4.4023592e-05   3.4132202e-05   0.0000000e+00   1.6866260e-05   0.0000000e+00
   4.6440822e-05   2.9189263e-05   5.1298518e-05   1.9461725e-05   0.0000000e+00
   4.5668511e-05   3.3253760e-05   4.8450880e-05   2.4448746e-05   0.0000000e+00
   4.4704985e-05   3.5826360e-05   6.5301501e-05   2.0261307e-05   0.0000000e+00
   4.6287484e-05   2.8806944e-05   4.5788982e-05   2.3471724e-05   0.0000000e+00
   4.3857462e-05   3.4890005e-05   0.0000000e+00   1.7101820e-05   0.0000000e+00
   4.7005491e-05   3.4565222e-05   6.3980741e-05   2.6519900e-05   0.0000000e+00
   4.4671179e-05   2.2146410e-05   3.9062795e-05   2.7103410e-05   0.0000000e+00
   4.4133644e-05   2.5379480e-05   0.0000000e+00   0.0000000e+00   0.0000000e+00
   4.3670565e-05   2.6962738e-05   0.0000000e+00   0.0000000e+00   0.0000000e+00
   4.7202157e-05   3.2458924e-05   6.4130529e-05   3.1227714e-05   0.0000000e+00
   4.6475458e-05   0.0000000e+00   5.2605898e-05   1.8432907e-05   0.0000000e+00
   4.3832126e-05   2.9051922e-05   0.0000000e+00   1.7238592e-05   0.0000000e+00
   4.5815030e-05   3.1478856e-05   4.5715368e-05   2.3701918e-05   0.0000000e+00
   4.6652272e-05   3.3029656e-05   5.6792553e-05   0.0000000e+00   0.0000000e+00
   4.3244495e-05   3.6221953e-05   1.2375776e-04   1.6136051e-05   0.0000000e+00
   4.6767917e-05   3.2334945e-05   5.9002923e-05   2.5996125e-05   0.0000000e+00
   4.4177557e-05   2.1154472e-05   4.6311287e-05   1.9963713e-05   0.0000000e+00
   4.3324784e-05   2.9878116e-05   0.0000000e+00   0.0000000e+00   0.0000000e+00
   4.6976264e-05   3.5653523e-05   6.3953748e-05   2.4574526e-05   0.0000000e+00
   4.3674912e-05   3.0902641e-05   0.0000000e+00   1.5686026e-05   0.0000000e+00
   4.4336163e-05   2.4969623e-05   0.0000000e+00   0.0000000e+00   0.0000000e+00
   4.4782658e-05   3.4209725e-05   5.6062260e-05   1.8599491e-05   0.0000000e+00
   4.5362189e-05   2.8009890e-05   6.7561235e-05   2.3104192e-05   0.0000000e+00
   4.6219312e-05   2.8368932e-05   4.7601200e-05   1.8164537e-05   0.0000000e+00
   4.3359487e-05   2.8765380e-05   0.0000000e+00   1.6868551e-05   0.0000000e+00
   4.4070913e-05   5.4220402e-05   4.2159676e-05   1.9428997e-05   8.9024970e-06
   4.6882512e-05   3.1316516e-05   5.5758368e-05   2.7197471e-05   0.0000000e+00
   4.5748605e-05   2.6298330e-05   4.5276728e-05   1.7216160e-05   2.9064607e-05
   4.6698057e-05   3.6728636e-05   6.6937346e-05   2.5079176e-05   0.0000000e+00
   4.6260504e-05   0.0000000e+00   4.8052272e-05   1.5760430e-05   0.0000000e+00
   4.4213224e-05   2.5283061e-05   0.0000000e+00   0.0000000e+00   0.0000000e+00
   4.6418478e-05   2.9341094e-05   4.6007948e-05   2.9550245e-05   0.0000000e+00
   4.4304944e-05   3.2583192e-05   9.3704981e-05   1.6474957e-05   0.0000000e+00
   4.6636200e-05   2.6046913e-05   5.6131428e-05   2.1760147e-05   0.0000000e+00
   4.3552158e-05   2.8942888e-05   0.0000000e+00   1.8072258e-05   3.7001999e-05
   4.6440525e-05   2.9283796e-05   5.4559056e-05   2.1452987e-05   0.0000000e+00
   4.4247874e-05   2.1487558e-05   5.2600748e-05   1.8309384e-05   0.0000000e+00
   4.6287692e-05   0.0000000e+00   5.2230802e-05   1.6174951e-05   0.0000000e+00
   4.6794861e-05   3.1729772e-05   5.5647231e-05   2.2535058e-05   0.0000000e+00
   4.6969625e-05   2.4740708e-05   5.5055686e-05   0.0000000e+00   1.0343276e-05
   4.4086337e-05   2.6810998e-05   0.0000000e+00   0.0000000e+00   0.0000000e+00
   4.6055694e-05   0.0000000e+00   4.4759186e-05   0.0000000e+00   0.0000000e+00
   4.6297641e-05   3.0465392e-05   5.4315085e-05   2.5519786e-05   0.0000000e+00
   4.3654254e-05   2.5790413e-05   0.0000000e+00   0.0000000e+00   0.0000000e+00
   4.5001597e-05   3.2763651e-05   5.5935116e-05   2.3655966e-05   0.0000000e+00
   4.4107387e-05   4.9052747e-05   4.6085255e-05   1.6954971e-05   8.4184835e-06
   4.6575069e-05   0.0000000e+00   4.8839219e-05   1.9440799e-05   0.0000000e+00
   4.6802760e-05   0.0000000e+00   5.9545447e-05   2.3663852e-05   0.0000000e+00
   4.6639867e-05   2.6697549e-05   4.8019004e-05   2.6671117e-05   0.0000000e+00
   4.4171139e-05   2.5927686e-05   0.0000000e+00   0.0000000e+00   0.0000000e+00
   4.6104727e-05   0.0000000e+00   4.8044036e-05   0.0000000e+00   0.0000000e+00
   4.5452309e-05   3.4763497e-05   4.5205542e-05   2.3906216e-05   0.0000000e+00
   4.3372337e-05   2.3117141e-05   0.0000000e+00   6.9951532e-05   0.0000000e+00
   4.6689046e-05   3.3066287e-05   6.0387486e-05   0.0000000e+00   0.0000000e+00
   4.3555416e-05   2.5389381e-05   0.0000000e+00   0.0000000e+00   0.0000000e+00
   4.5944711e-05   2.7461616e-05   4.3805593e-05   1.6010867e-05   0.0000000e+00
   4.7008405e-05   3.2979294e-05   6.3619800e-05   2.7172615e-05   0.0000000e+00
   4.3593917e-05   2.9800156e-05   0.0000000e+00   1.6908603e-05   0.0000000e+00
   4.5743785e-05   3.1679142e-05   4.6068231e-05   2.8353129e-05   0.0000000e+00
   4.6795559e-05   2.4464190e-05   5.5753758e-05   0.0000000e+00   1.2020483e-05
   4.6441506e-05   3.2209836e-05   5.7162407e-05   2.8203892e-05   0.0000000e+00
   4.7141471e-05   3.7968714e-05   6.3194189e-05   2.6976757e-05   0.0000000e+00
   4.4659434e-05   3.4748867e-05   5.4011936e-05   2.0190673e-05   0.0000000e+00
   4.3397869e-05   2.3591526e-05   0.0000000e+00   4.3209083e-05   0.0000000e+00
   4.5391844e-05   2.5173010e-05   4.1584901e-05   0.0000000e+00   0.0000000e+00
   4.3354095e-05   4.0692197e-05   1.0146681e-04   1.5227155e-05   0.0000000e+00
   4.4555914e-05   5.9032067e-05   3.9690476e-05   2.5129285e-05   0.0000000e+00
   4.3989043e-05   4.8820456e-05   4.9048341e-05   1.6352860e-05   8.9129459e-06
   4.7289872e-05   3.6297149e-05   6.3489295e-05   2.8907216e-05   0.0000000e+00
   4.3155889e-05   2.3041721e-05   0.0000000e+00   4.3128211e-05   0.0000000e+00
   4.4671805e-05   3.4434442e-05   7.0219744e-05   1.8532700e-05   0.0000000e+00
   4.5350623e-05   2.7017451e-05   6.4740230e-05   2.3178668e-05   1.5310259e-05
   4.4734160e-05   2.6583964e-05   0.0000000e+00   2.1800630e-05   0.0000000e+00
   4.3480592e-05   4.0381038e-05   8.8592111e-05   1.4158739e-05   0.0000000e+00
   4.5241120e-05   2.4722526e-05   3.9835784e-05   3.0478843e-05   0.0000000e+00
   4.3274936e-05   2.8584208e-05   0.0000000e+00   0.0000000e+00   0.0000000e+00
   4.4309976e-05   5.5897853e-05   4.4665220e-05   2.0993187e-05   0.0000000e+00
   4.6147254e-05   2.9351520e-05   4.7213174e-05   2.4026815e-05   0.0000000e+00
   4.3307454e-05   3.9765958e-05   8.7534856e-05   1.4553531e-05   0.0000000e+00
   4.3274462e-05   2.6828674e-05   0.0000000e+00   3.2329333e-05   0.0000000e+00
   4.6723404e-05   3.4171744e-05   6.5575070e-05   3.1096757e-05   0.0000000e+00
