   4.6593666e-05   3.4907973e-05   5.1168253e-05   0.0000000e+00   0.0000000e+00
   4.7486136e-05   3.7375540e-05   7.5606638e-05   3.7235597e-05   0.0000000e+00
   4.3627629e-05   2.7594285e-05   0.0000000e+00   6.4682354e-05   0.0000000e+00
   4.4202316e-05   4.3912535e-05   0.0000000e+00   1.8258100e-05   0.0000000e+00
   4.4688836e-05   2.9142819e-05   0.0000000e+00   0.0000000e+00   0.0000000e+00
   4.6929344e-05   3.6009347e-05   5.1721907e-05   0.0000000e+00   0.0000000e+00
   4.5532639e-05   4.2846134e-05   6.1057195e-05   3.0073472e-05   0.0000000e+00
   4.6988779e-05   0.0000000e+00   5.5285818e-05   0.0000000e+00   0.0000000e+00
   4.5258472e-05   2.5994149e-05   4.0070706e-05   4.4543437e-05   0.0000000e+00
   4.3713504e-05   3.4403096e-05   0.0000000e+00   2.6340221e-05   0.0000000e+00
   4.7369184e-05   2.7182096e-05   6.4150387e-05   3.4691390e-05   0.0000000e+00
   4.4831772e-05   2.8349443e-05   0.0000000e+00   0.0000000e+00   0.0000000e+00
   4.5942002e-05   3.8535469e-05   5.9287890e-05   3.6911143e-05   0.0000000e+00
   4.7508995e-05   3.6742540e-05   6.4929187e-05   3.0928301e-05   0.0000000e+00
   4.3668405e-05   3.0961261e-05   0.0000000e+00   0.0000000e+00   0.0000000e+00
   4.4188660e-05   2.4224185e-05   4.9048602e-05   0.0000000e+00   0.0000000e+00
   4.3801792e-05   3.0954514e-05   0.0000000e+00   0.0000000e+00   0.0000000e+00
   4.3932616e-05   2.6058747e-05   0.0000000e+00   0.0000000e+00   0.0000000e+00
   4.3912546e-05   3.0377107e-05   0.0000000e+00   0.0000000e+00   0.0000000e+00
   4.4303946e-05   2.4599536e-05   4.8216081e-05   0.0000000e+00   0.0000000e+00
   4.4453887e-05   3.7805267e-05   0.0000000e+00   2.1673569e-05   0.0000000e+00
   4.5900411e-05   4.2026844e-05   4.6569071e-05   2.9436884e-05   0.0000000e+00
   4.3120375e-05   3.1970705e-05   0.0000000e+00   2.7011787e-05   1.8384601e-05
   4.5847267e-05   5.9566657e-05   4.2543552e-05   8.5993708e-05   0.0000000e+00
   4.7242614e-05   3.4856390e-05   5.9584906e-05   4.1142656e-05   0.0000000e+00
   4.7381152e-05   2.8380198e-05   6.9186464e-05   4.0647820e-05   0.0000000e+00
   4.6762808e-05   0.0000000e+00   6.0394647e-05   0.0000000e+00   0.0000000e+00
   4.3765736e-05   2.6158718e-05   0.0000000e+00   0.0000000e+00   0.0000000e+00
   4.5675253e-05   6.1807606e-05   3.7373839e-05   3.9515059e-05   0.0000000e+00
   4.6480658e-05   3.7091649e-05   4.6159304e-05   3.5531497e-05   0.0000000e+00
   4.5486863e-05   4.3135663e-05   4.9752767e-05   2.7410148e-05   0.0000000e+00
   4.5594007e-05   2.7129078e-05   4.0825626e-05   0.0000000e+00   1.6358766e-05
   4.3627886e-05   3.5931684e-05   0.0000000e+00   2.3693832e-05   0.0000000e+00
   4.5065511e-05   3.9679092e-05   6.7494141e-05   2.5307901e-05   0.0000000e+00
   4.7983934e-05   3.1610979e-05   7.6257613e-05   5.0549564e-05   0.0000000e+00
   4.5138871e-05   4.0651847e-05   0.0000000e+00   2.2855824e-05   0.0000000e+00
   4.4396611e-05   5.9455238e-05   3.9184172e-05   2.9030710e-05   0.0000000e+00
   4.3729084e-05   2.6987460e-05   0.0000000e+00   9.1570545e-05   0.0000000e+00
   4.7809155e-05   0.0000000e+00   6.4720850e-05   4.5253107e-05   0.0000000e+00
   4.7389720e-05   0.0000000e+00   7.4190935e-05   3.0144001e-05   0.0000000e+00
   4.4400535e-05   4.0335990e-05   0.0000000e+00   1.9499959e-05   0.0000000e+00
   4.7660355e-05   3.7566453e-05   7.6480616e-05   4.3067550e-05   0.0000000e+00
   4.7558583e-05   3.1497373e-05   6.6073456e-05   3.3836046e-05   0.0000000e+00
   4.7063041e-05   3.4599763e-05   5.8046010e-05   2.8155335e-05   0.0000000e+00
   4.5685957e-05   2.7363021e-05   3.9193647e-05   1.6522673e-05   0.0000000e+00
   4.6072023e-05   5.6279303e-05   4.3868988e-05   5.2788914e-05   0.0000000e+00
   4.7449825e-05   0.0000000e+00   6.3290554e-05   2.6733064e-05   0.0000000e+00
   4.4525622e-05   5.2662687e-05   4.6480166e-05   2.0496813e-05   5.7403867e-06
   4.5994414e-05   5.9322676e-05   5.1199907e-05   9.5170668e-05   0.0000000e+00
   4.6912899e-05   3.3203101e-05   5.3582246e-05   2.9940637e-05   1.2637458e-05
   4.7080245e-05   3.5137946e-05   5.2493385e-05   2.9449511e-05   0.0000000e+00
   4.7330731e-05   3.3313368e-05   5.7089794e-05   2.7906751e-05   3.7414437e-06
   4.5934749e-05   3.8596299e-05   4.9838744e-05   2.7159153e-05   0.0000000e+00
   4.5970525e-05   3.2833587e-05   7.9847808e-05   2.7666554e-05   1.4676995e-05
   4.7821436e-05   2.9829697e-05   5.5271538e-05   3.6860397e-05   0.0000000e+00
   4.7473204e-05   3.6506927e-05   8.3917578e-05   4.1781879e-05   0.0000000e+00
   4.4398612e-05   4.1888751e-05   0.0000000e+00   1.9945183e-05   0.0000000e+00
   4.6855174e-05   3.3174260e-05   6.3003643e-05   2.3092188e-05   0.0000000e+00
   4.3904525e-05   4.4511151e-05   1.3693433e-04   1.6756295e-05   0.0000000e+00
   4.4154293e-05   2.5550109e-05   0.0000000e+00   0.0000000e+00   0.0000000e+00
   4.4556349e-05   2.8579385e-05   0.0000000e+00   1.0979887e-04   0.0000000e+00
   4.5352486e-05   2.6299530e-05   3.9080624e-05   0.0000000e+00   8.0935128e-05
   4.3628903e-05   3.9484633e-05   0.0000000e+00   1.7900042e-05   0.0000000e+00
   4.3728859e-05   3.9682063e-05   0.0000000e+00   2.0164522e-05   0.0000000e+00
   4.5167317e-05   5.9557302e-05   4.0729222e-05   5.7763884e-05   0.0000000e+00
   4.7727222e-05   3.6953082e-05   7.1386676e-05   4.3929903e-05   0.0000000e+00
   4.5999469e-05   3.3325113e-05   6.7178013e-05   0.0000000e+00   1.4560025e-05
   4.3901469e-05   3.2810903e-05   0.0000000e+00   2.6545612e-05   1.9447924e-05
   4.6218110e-05   3.0220495e-05   4.6122579e-05   2.0187390e-05   0.0000000e+00
   4.4499344e-05   3.8287624e-05   0.0000000e+00   2.0015179e-05   0.0000000e+00
   4.5042215e-05   4.2678273e-05   6.7207035e-05   2.4321519e-05   0.0000000e+00
   4.6549152e-05   5.8305255e-05   4.4457613e-05   0.0000000e+00   0.0000000e+00
   4.6951467e-05   3.1930806e-05   5.5753325e-05   2.6340964e-05   0.0000000e+00
   4.4026730e-05   6.8328872e-05   3.7690447e-05   2.3673527e-05   0.0000000e+00
   4.4684987e-05   2.5195486e-05   4.0390767e-05   0.0000000e+00   0.0000000e+00
   4.7033583e-05   3.4193602e-05   6.5856515e-05   2.7986816e-05   0.0000000e+00
   4.3487911e-05   2.5719994e-05   0.0000000e+00   0.0000000e+00   0.0000000e+00
   4.7044690e-05   3.4803739e-05   5.8148482e-05   4.3696072e-05   0.0000000e+00
   4.4022734e-05   3.3265016e-05   0.0000000e+00   2.7229744e-05   0.0000000e+00
   4.7415791e-05   3.3674262e-05   5.4263396e-05   3.1319957e-05   4.1797327e-06
   4.8021825e-05   3.6124812e-05   6.5516348e-05   3.9326547e-05   0.0000000e+00
   4.6165383e-05   2.8972213e-05   4.8216921e-05   2.0080238e-05   0.0000000e+00
   4.6250876e-05   5.6422232e-05   4.3379823e-05   0.0000000e+00   0.0000000e+00
   4.5358340e-05   3.0029713e-05   6.9872331e-05   0.0000000e+00   0.0000000e+00
   4.7481074e-05   3.4789805e-05   5.8482938e-05   3.0455296e-05   0.0000000e+00
   4.7276248e-05   3.1353995e-05   6.5781282e-05   2.4092493e-05   4.3900075e-06
   4.7739599e-05   2.7085067e-05   6.4026197e-05   4.6602746e-05   0.0000000e+00
   4.7437289e-05   3.4266605e-05   7.0296404e-05   2.8374690e-05   0.0000000e+00
   4.3664671e-05   2.6290079e-05   0.0000000e+00   0.0000000e+00   0.0000000e+00
   4.7506388e-05   3.7839125e-05   6.3663543e-05   4.2038691e-05   0.0000000e+00
   4.7499258e-05   3.5672090e-05   7.4251003e-05   3.8037015e-05   0.0000000e+00
   4.3852811e-05   3.1605570e-05   0.0000000e+00   3.4251467e-05   0.0000000e+00
   4.4462758e-05   3.9635394e-05   0.0000000e+00   2.1182361e-05   0.0000000e+00
   4.5365709e-05   7.0834827e-05   3.8910125e-05   6.9923805e-05   0.0000000e+00
   4.4591828e-05   2.8573143e-05   0.0000000e+00   4.5014963e-05   0.0000000e+00
   4.6550454e-05   3.3942501e-05   6.3183290e-05   3.0938703e-05   0.0000000e+00
   4.7546617e-05   0.0000000e+00   6.9732915e-05   2.9069833e-05   0.0000000e+00
   4.6374170e-05   0.0000000e+00   4.8857608e-05   0.0000000e+00   0.0000000e+00
   4.5217648e-05   4.0482170e-05   0.0000000e+00   2.1944397e-05   0.0000000e+00
   4.7157562e-05   0.0000000e+00   5.8659559e-05   2.3772000e-05   0.0000000e+00
