# MagicaVoxel @ ephtracy

# material
mtllib torch.mtl
usemtl palette

# normals
vn -1 0 0
vn 1 0 0
vn 0 0 1
vn 0 0 -1
vn 0 -1 0
vn 0 1 0

# texcoords
vt 0.00585938 0.5
vt 0.00976563 0.5
vt 0.0214844 0.5
vt 0.0449219 0.5
vt 0.0683594 0.5
vt 0.0917969 0.5
vt 0.138672 0.5
vt 0.537109 0.5

# verts
v -2 9 1
v -2 9 -1
v -2 10 1
v -2 10 -1
v -2 11 1
v -2 11 -1
v -2 12 1
v -2 12 -1
v -2 13 1
v -2 13 -1
v -1 0 1
v -1 0 -1
v -1 7 1
v -1 7 -1
v -1 8 1
v -1 8 -1
v -1 9 1
v -1 9 -1
v -1 13 1
v -1 13 -1
v -1 14 1
v -1 14 -1
v -1 15 1
v -1 15 -1
v -1 16 1
v -1 16 -1
v 0 15 1
v 0 15 -1
v 0 16 1
v 0 16 -1
v 1 0 1
v 1 0 -1
v 1 7 1
v 1 7 -1
v 1 8 1
v 1 8 -1
v 1 9 1
v 1 9 -1
v 1 12 1
v 1 12 -1
v 1 13 1
v 1 13 -1
v 1 14 1
v 1 14 -1
v 1 15 1
v 1 15 -1
v 2 9 1
v 2 9 -1
v 2 10 1
v 2 10 -1
v 2 11 1
v 2 11 -1
v 2 12 1
v 2 12 -1
v -2 9 1
v -2 10 1
v -2 11 1
v -2 12 1
v -2 13 1
v -1 0 1
v -1 7 1
v -1 8 1
v -1 9 1
v -1 10 1
v -1 11 1
v -1 12 1
v -1 13 1
v -1 14 1
v -1 15 1
v -1 16 1
v 0 7 1
v 0 8 1
v 0 9 1
v 0 11 1
v 0 12 1
v 0 13 1
v 0 14 1
v 0 15 1
v 0 16 1
v 1 0 1
v 1 7 1
v 1 8 1
v 1 9 1
v 1 10 1
v 1 11 1
v 1 12 1
v 1 13 1
v 1 14 1
v 1 15 1
v 2 9 1
v 2 10 1
v 2 11 1
v 2 12 1
v -2 9 -1
v -2 10 -1
v -2 11 -1
v -2 12 -1
v -2 13 -1
v -1 0 -1
v -1 7 -1
v -1 8 -1
v -1 9 -1
v -1 10 -1
v -1 11 -1
v -1 12 -1
v -1 13 -1
v -1 14 -1
v -1 15 -1
v -1 16 -1
v 0 7 -1
v 0 8 -1
v 0 9 -1
v 0 11 -1
v 0 12 -1
v 0 13 -1
v 0 14 -1
v 0 15 -1
v 0 16 -1
v 1 0 -1
v 1 7 -1
v 1 8 -1
v 1 9 -1
v 1 10 -1
v 1 11 -1
v 1 12 -1
v 1 13 -1
v 1 14 -1
v 1 15 -1
v 2 9 -1
v 2 10 -1
v 2 11 -1
v 2 12 -1
v -1 0 1
v 1 0 1
v -1 0 -1
v 1 0 -1
v -2 9 1
v -1 9 1
v 1 9 1
v 2 9 1
v -2 9 -1
v -1 9 -1
v 1 9 -1
v 2 9 -1
v 1 12 1
v 2 12 1
v 1 12 -1
v 2 12 -1
v -2 13 1
v -1 13 1
v -2 13 -1
v -1 13 -1
v 0 15 1
v 1 15 1
v 0 15 -1
v 1 15 -1
v -1 16 1
v 0 16 1
v -1 16 -1
v 0 16 -1

# faces
f 3/6/1 2/6/1 1/6/1
f 4/6/1 2/6/1 3/6/1
f 5/3/1 4/3/1 3/3/1
f 6/3/1 4/3/1 5/3/1
f 7/4/1 6/4/1 5/4/1
f 8/4/1 6/4/1 7/4/1
f 9/6/1 8/6/1 7/6/1
f 10/6/1 8/6/1 9/6/1
f 13/8/1 12/8/1 11/8/1
f 14/8/1 12/8/1 13/8/1
f 15/4/1 14/4/1 13/4/1
f 16/4/1 14/4/1 15/4/1
f 17/5/1 16/5/1 15/5/1
f 18/5/1 16/5/1 17/5/1
f 21/4/1 20/4/1 19/4/1
f 22/4/1 20/4/1 21/4/1
f 23/6/1 22/6/1 21/6/1
f 24/6/1 22/6/1 23/6/1
f 25/7/1 24/7/1 23/7/1
f 26/7/1 24/7/1 25/7/1
f 27/7/2 28/7/2 29/7/2
f 29/7/2 28/7/2 30/7/2
f 31/8/2 32/8/2 33/8/2
f 33/8/2 32/8/2 34/8/2
f 33/2/2 34/2/2 35/2/2
f 35/2/2 34/2/2 36/2/2
f 35/3/2 36/3/2 37/3/2
f 37/3/2 36/3/2 38/3/2
f 39/4/2 40/4/2 41/4/2
f 41/4/2 40/4/2 42/4/2
f 41/6/2 42/6/2 43/6/2
f 43/6/2 42/6/2 44/6/2
f 43/7/2 44/7/2 45/7/2
f 45/7/2 44/7/2 46/7/2
f 47/6/2 48/6/2 49/6/2
f 49/6/2 48/6/2 50/6/2
f 49/4/2 50/4/2 51/4/2
f 51/4/2 50/4/2 52/4/2
f 51/6/2 52/6/2 53/6/2
f 53/6/2 52/6/2 54/6/2
f 63/6/3 56/6/3 55/6/3
f 64/3/3 57/3/3 56/3/3
f 64/6/3 56/6/3 63/6/3
f 65/4/3 58/4/3 57/4/3
f 65/3/3 57/3/3 64/3/3
f 66/6/3 59/6/3 58/6/3
f 66/4/3 58/4/3 65/4/3
f 67/6/3 59/6/3 66/6/3
f 71/4/3 62/4/3 61/4/3
f 71/8/3 61/8/3 60/8/3
f 72/5/3 63/5/3 62/5/3
f 72/4/3 62/4/3 71/4/3
f 73/4/3 64/4/3 63/4/3
f 73/5/3 63/5/3 72/5/3
f 74/1/3 65/1/3 64/1/3
f 74/1/3 66/1/3 65/1/3
f 75/3/3 67/3/3 66/3/3
f 75/1/3 66/1/3 74/1/3
f 76/4/3 68/4/3 67/4/3
f 76/3/3 67/3/3 75/3/3
f 77/6/3 69/6/3 68/6/3
f 77/4/3 68/4/3 76/4/3
f 78/7/3 70/7/3 69/7/3
f 78/6/3 69/6/3 77/6/3
f 79/7/3 70/7/3 78/7/3
f 80/8/3 71/8/3 60/8/3
f 81/2/3 72/2/3 71/2/3
f 81/8/3 71/8/3 80/8/3
f 82/3/3 73/3/3 72/3/3
f 82/2/3 72/2/3 81/2/3
f 83/4/3 64/4/3 73/4/3
f 83/3/3 73/3/3 82/3/3
f 84/1/3 74/1/3 64/1/3
f 84/4/3 64/4/3 83/4/3
f 85/3/3 75/3/3 74/3/3
f 85/1/3 74/1/3 84/1/3
f 86/4/3 76/4/3 75/4/3
f 86/3/3 75/3/3 85/3/3
f 87/6/3 77/6/3 76/6/3
f 87/4/3 76/4/3 86/4/3
f 88/7/3 78/7/3 77/7/3
f 88/6/3 77/6/3 87/6/3
f 89/7/3 78/7/3 88/7/3
f 90/6/3 84/6/3 83/6/3
f 91/4/3 85/4/3 84/4/3
f 91/6/3 84/6/3 90/6/3
f 92/6/3 86/6/3 85/6/3
f 92/4/3 85/4/3 91/4/3
f 93/6/3 86/6/3 92/6/3
f 94/6/4 95/6/4 102/6/4
f 95/3/4 96/3/4 103/3/4
f 102/6/4 95/6/4 103/6/4
f 96/4/4 97/4/4 104/4/4
f 103/3/4 96/3/4 104/3/4
f 97/6/4 98/6/4 105/6/4
f 104/4/4 97/4/4 105/4/4
f 105/6/4 98/6/4 106/6/4
f 100/4/4 101/4/4 110/4/4
f 99/8/4 100/8/4 110/8/4
f 101/5/4 102/5/4 111/5/4
f 110/4/4 101/4/4 111/4/4
f 102/4/4 103/4/4 112/4/4
f 111/5/4 102/5/4 112/5/4
f 103/1/4 104/1/4 113/1/4
f 104/1/4 105/1/4 113/1/4
f 105/3/4 106/3/4 114/3/4
f 113/1/4 105/1/4 114/1/4
f 106/4/4 107/4/4 115/4/4
f 114/3/4 106/3/4 115/3/4
f 107/6/4 108/6/4 116/6/4
f 115/4/4 107/4/4 116/4/4
f 108/7/4 109/7/4 117/7/4
f 116/6/4 108/6/4 117/6/4
f 117/7/4 109/7/4 118/7/4
f 99/8/4 110/8/4 119/8/4
f 110/2/4 111/2/4 120/2/4
f 119/8/4 110/8/4 120/8/4
f 111/3/4 112/3/4 121/3/4
f 120/2/4 111/2/4 121/2/4
f 112/4/4 103/4/4 122/4/4
f 121/3/4 112/3/4 122/3/4
f 103/1/4 113/1/4 123/1/4
f 122/4/4 103/4/4 123/4/4
f 113/3/4 114/3/4 124/3/4
f 123/1/4 113/1/4 124/1/4
f 114/4/4 115/4/4 125/4/4
f 124/3/4 114/3/4 125/3/4
f 115/6/4 116/6/4 126/6/4
f 125/4/4 115/4/4 126/4/4
f 116/7/4 117/7/4 127/7/4
f 126/6/4 116/6/4 127/6/4
f 127/7/4 117/7/4 128/7/4
f 122/6/4 123/6/4 129/6/4
f 123/4/4 124/4/4 130/4/4
f 129/6/4 123/6/4 130/6/4
f 124/6/4 125/6/4 131/6/4
f 130/4/4 124/4/4 131/4/4
f 131/6/4 125/6/4 132/6/4
f 135/8/5 134/8/5 133/8/5
f 136/8/5 134/8/5 135/8/5
f 141/6/5 138/6/5 137/6/5
f 142/6/5 138/6/5 141/6/5
f 143/6/5 140/6/5 139/6/5
f 144/6/5 140/6/5 143/6/5
f 145/6/6 146/6/6 147/6/6
f 147/6/6 146/6/6 148/6/6
f 149/6/6 150/6/6 151/6/6
f 151/6/6 150/6/6 152/6/6
f 153/7/6 154/7/6 155/7/6
f 155/7/6 154/7/6 156/7/6
f 157/7/6 158/7/6 159/7/6
f 159/7/6 158/7/6 160/7/6
