# MagicaVoxel @ ephtracy

# material
mtllib tree1.mtl
usemtl palette

# normals
vn -1 0 0
vn 1 0 0
vn 0 0 1
vn 0 0 -1
vn 0 -1 0
vn 0 1 0

# texcoords
vt 0.537109 0.5
vt 0.900391 0.5
vt 0.904297 0.5

# verts
v -15 25 15
v -15 25 -12
v -15 25 -13
v -15 25 -14
v -15 25 -15
v -15 26 -12
v -15 26 -13
v -15 26 -14
v -15 26 -15
v -15 27 15
v -15 27 -15
v -14 27 14
v -14 27 -14
v -14 29 9
v -14 29 8
v -14 29 -2
v -14 29 -3
v -14 30 14
v -14 30 9
v -14 30 8
v -14 30 -2
v -14 30 -3
v -14 30 -14
v -13 30 13
v -13 30 9
v -13 30 8
v -13 30 -2
v -13 30 -3
v -13 30 -13
v -13 33 13
v -13 33 -13
v -12 33 12
v -12 33 -12
v -12 35 4
v -12 35 3
v -12 36 4
v -12 36 3
v -12 36 2
v -12 37 12
v -12 37 3
v -12 37 2
v -12 37 -12
v -11 37 11
v -11 37 3
v -11 37 2
v -11 37 -0
v -11 37 -11
v -11 38 2
v -11 38 -0
v -11 38 -9
v -11 38 -10
v -11 39 -7
v -11 39 -9
v -11 39 -10
v -11 40 11
v -11 40 -7
v -11 40 -9
v -11 40 -11
v -10 40 10
v -10 40 -7
v -10 40 -8
v -10 40 -9
v -10 40 -10
v -10 41 -7
v -10 41 -8
v -10 43 10
v -10 43 -10
v -9 43 9
v -9 43 -9
v -9 44 9
v -9 44 8
v -9 47 9
v -9 47 8
v -9 47 -9
v -8 47 8
v -8 47 -8
v -8 50 8
v -8 50 -8
v -7 50 7
v -7 50 3
v -7 50 2
v -7 50 -7
v -7 51 3
v -7 51 2
v -7 52 -2
v -7 52 -3
v -7 53 7
v -7 53 -2
v -7 53 -3
v -7 53 -7
v -6 53 6
v -6 53 -2
v -6 53 -3
v -6 53 -6
v -6 54 -5
v -6 54 -6
v -6 55 -2
v -6 55 -3
v -6 55 -5
v -6 55 -6
v -6 57 6
v -6 57 -6
v -5 57 5
v -5 57 -5
v -5 60 5
v -5 60 -5
v -4 0 4
v -4 0 -4
v -4 25 4
v -4 25 -4
v -4 60 4
v -4 60 3
v -4 60 -4
v -4 61 4
v -4 61 3
v -4 63 4
v -4 63 -4
v -3 63 3
v -3 63 -3
v -3 67 3
v -3 67 -3
v -2 67 2
v -2 67 -2
v -2 69 -0
v -2 69 -1
v -2 70 2
v -2 70 -0
v -2 70 -1
v -2 70 -2
v -1 70 1
v -1 70 -0
v -1 70 -1
v -1 71 1
v -1 71 -0
v -1 71 -1
v -1 72 1
v -1 72 -0
v -1 72 -1
v 1 70 1
v 1 70 -1
v 1 72 1
v 1 72 -1
v 2 67 2
v 2 67 -2
v 2 70 2
v 2 70 -2
v 3 63 3
v 3 63 1
v 3 63 -1
v 3 63 -3
v 3 65 3
v 3 65 2
v 3 67 3
v 3 67 2
v 3 67 -3
v 4 0 4
v 4 0 -4
v 4 25 4
v 4 25 -4
v 4 60 4
v 4 60 -4
v 4 62 1
v 4 62 -1
v 4 63 4
v 4 63 1
v 4 63 -1
v 4 63 -4
v 5 57 5
v 5 57 -5
v 5 60 5
v 5 60 -5
v 6 53 6
v 6 53 1
v 6 53 -1
v 6 53 -6
v 6 54 -3
v 6 54 -4
v 6 55 -3
v 6 55 -4
v 6 57 6
v 6 57 -6
v 7 50 7
v 7 50 -7
v 7 51 -0
v 7 51 -1
v 7 52 1
v 7 52 -0
v 7 53 7
v 7 53 1
v 7 53 -1
v 7 53 -7
v 8 47 8
v 8 47 -8
v 8 50 8
v 8 50 -8
v 9 43 9
v 9 43 -7
v 9 43 -8
v 9 43 -9
v 9 44 1
v 9 44 -0
v 9 45 1
v 9 45 -0
v 9 47 9
v 9 47 -9
v 10 40 10
v 10 40 -8
v 10 40 -9
v 10 40 -10
v 10 42 -7
v 10 42 -8
v 10 42 -9
v 10 43 10
v 10 43 -7
v 10 43 -8
v 10 43 -10
v 11 37 11
v 11 37 8
v 11 37 7
v 11 37 -11
v 11 40 11
v 11 40 -11
v 12 33 12
v 12 33 -12
v 12 34 8
v 12 34 7
v 12 34 -7
v 12 34 -8
v 12 35 -7
v 12 35 -8
v 12 37 12
v 12 37 8
v 12 37 7
v 12 37 -12
v 13 30 13
v 13 30 -11
v 13 30 -12
v 13 30 -13
v 13 31 1
v 13 31 -0
v 13 31 -11
v 13 31 -12
v 13 32 1
v 13 32 -0
v 13 33 13
v 13 33 -13
v 14 27 14
v 14 27 -14
v 14 30 14
v 14 30 -14
v 15 25 15
v 15 25 -15
v 15 27 15
v 15 27 -15
v -15 25 15
v -15 27 15
v 10 25 15
v 10 26 15
v 11 25 15
v 11 26 15
v 15 25 15
v 15 27 15
v -14 27 14
v -14 30 14
v -7 28 14
v -7 30 14
v -5 28 14
v -5 30 14
v 14 27 14
v 14 30 14
v -13 30 13
v -13 33 13
v -7 30 13
v -5 30 13
v 6 32 13
v 6 33 13
v 7 32 13
v 7 33 13
v 13 30 13
v 13 33 13
v -12 33 12
v -12 37 12
v -10 35 12
v -10 37 12
v -9 35 12
v -9 37 12
v -2 34 12
v -2 36 12
v -1 34 12
v -1 36 12
v 6 33 12
v 7 33 12
v 9 36 12
v 9 37 12
v 10 34 12
v 10 36 12
v 10 37 12
v 11 34 12
v 11 36 12
v 12 33 12
v 12 37 12
v -11 37 11
v -11 40 11
v -10 37 11
v -10 38 11
v -9 37 11
v -9 38 11
v 9 37 11
v 10 37 11
v 11 37 11
v 11 40 11
v -10 40 10
v -10 43 10
v 10 40 10
v 10 43 10
v -9 43 9
v -9 44 9
v -9 47 9
v -8 44 9
v -8 47 9
v -6 43 9
v -6 44 9
v -5 43 9
v -5 44 9
v 2 44 9
v 2 45 9
v 4 44 9
v 4 45 9
v 9 43 9
v 9 47 9
v -8 47 8
v -8 50 8
v -3 48 8
v -3 50 8
v -2 48 8
v -2 50 8
v 8 47 8
v 8 50 8
v -7 50 7
v -7 53 7
v -3 50 7
v -2 50 7
v -2 51 7
v -1 50 7
v -1 51 7
v -1 52 7
v 0 50 7
v 0 51 7
v 1 50 7
v 1 52 7
v 7 50 7
v 7 53 7
v -6 53 6
v -6 57 6
v 3 55 6
v 3 56 6
v 4 55 6
v 4 56 6
v 6 53 6
v 6 57 6
v -5 57 5
v -5 60 5
v 5 57 5
v 5 60 5
v -4 0 4
v -4 25 4
v -4 60 4
v -4 61 4
v -4 63 4
v -3 60 4
v -3 61 4
v 4 0 4
v 4 25 4
v 4 60 4
v 4 63 4
v -3 63 3
v -3 67 3
v 2 65 3
v 2 67 3
v 3 63 3
v 3 65 3
v 3 67 3
v -2 67 2
v -2 70 2
v 2 67 2
v 2 70 2
v -1 70 1
v -1 71 1
v -1 72 1
v 0 70 1
v 0 71 1
v 1 70 1
v 1 72 1
v -1 70 -1
v -1 71 -1
v -1 72 -1
v 0 71 -1
v 0 72 -1
v 1 70 -1
v 1 72 -1
v -2 67 -2
v -2 70 -2
v 2 67 -2
v 2 70 -2
v -3 63 -3
v -3 67 -3
v 3 63 -3
v 3 67 -3
v -4 0 -4
v -4 25 -4
v -4 60 -4
v -4 63 -4
v 4 0 -4
v 4 25 -4
v 4 60 -4
v 4 63 -4
v -5 57 -5
v -5 60 -5
v 3 58 -5
v 3 59 -5
v 4 58 -5
v 4 59 -5
v 5 57 -5
v 5 60 -5
v -6 53 -6
v -6 54 -6
v -6 55 -6
v -6 57 -6
v -5 53 -6
v -5 54 -6
v -5 55 -6
v -4 53 -6
v -4 54 -6
v -3 53 -6
v 6 53 -6
v 6 57 -6
v -7 50 -7
v -7 53 -7
v -4 52 -7
v -4 53 -7
v -3 52 -7
v -3 53 -7
v 7 50 -7
v 7 53 -7
v -8 47 -8
v -8 50 -8
v 8 47 -8
v 8 50 -8
v -9 43 -9
v -9 47 -9
v 0 43 -9
v 0 44 -9
v 1 43 -9
v 1 44 -9
v 6 44 -9
v 6 46 -9
v 7 44 -9
v 7 45 -9
v 8 45 -9
v 8 46 -9
v 9 43 -9
v 9 47 -9
v -10 40 -10
v -10 43 -10
v 10 40 -10
v 10 43 -10
v -11 37 -11
v -11 40 -11
v -8 38 -11
v -8 39 -11
v -5 38 -11
v -5 39 -11
v 7 37 -11
v 7 38 -11
v 8 37 -11
v 8 38 -11
v 11 37 -11
v 11 40 -11
v -12 33 -12
v -12 37 -12
v 12 33 -12
v 12 37 -12
v -13 30 -13
v -13 33 -13
v -10 30 -13
v -9 30 -13
v 2 30 -13
v 2 31 -13
v 4 30 -13
v 4 31 -13
v 13 30 -13
v 13 33 -13
v -14 27 -14
v -14 30 -14
v -11 27 -14
v -11 29 -14
v -10 27 -14
v -10 29 -14
v -10 30 -14
v -9 29 -14
v -9 30 -14
v 2 29 -14
v 2 30 -14
v 4 29 -14
v 4 30 -14
v 14 27 -14
v 14 30 -14
v -15 25 -15
v -15 26 -15
v -15 27 -15
v -14 25 -15
v -14 26 -15
v 15 25 -15
v 15 27 -15
v -4 0 4
v 4 0 4
v -4 0 -4
v 4 0 -4
v -15 25 15
v 10 25 15
v 11 25 15
v 15 25 15
v 10 25 14
v 11 25 14
v -9 25 12
v -8 25 12
v -9 25 11
v -8 25 11
v -9 25 10
v -8 25 10
v -12 25 9
v -9 25 9
v -8 25 9
v 7 25 9
v 9 25 9
v -12 25 8
v -9 25 8
v 7 25 8
v 9 25 8
v -4 25 4
v 4 25 4
v 7 25 -3
v 8 25 -3
v -4 25 -4
v 4 25 -4
v 7 25 -4
v 8 25 -4
v -13 25 -5
v -11 25 -5
v -13 25 -7
v -11 25 -7
v 4 25 -8
v 6 25 -8
v 4 25 -9
v 6 25 -9
v 13 25 -9
v 14 25 -9
v 12 25 -10
v 13 25 -10
v -14 25 -11
v -13 25 -11
v 12 25 -11
v 14 25 -11
v -15 25 -12
v -14 25 -12
v -13 25 -12
v -15 25 -13
v -14 25 -13
v -15 25 -14
v -14 25 -14
v -15 25 -15
v -14 25 -15
v 15 25 -15
v -15 27 15
v 15 27 15
v -14 27 14
v 14 27 14
v -14 27 -14
v -11 27 -14
v -10 27 -14
v 14 27 -14
v -15 27 -15
v 15 27 -15
v -14 30 14
v -7 30 14
v -5 30 14
v 14 30 14
v -13 30 13
v -7 30 13
v -5 30 13
v 13 30 13
v -14 30 9
v -13 30 9
v -14 30 8
v -13 30 8
v -14 30 -2
v -13 30 -2
v -14 30 -3
v -13 30 -3
v 13 30 -11
v 13 30 -12
v -13 30 -13
v -10 30 -13
v -9 30 -13
v 2 30 -13
v 4 30 -13
v 13 30 -13
v -14 30 -14
v -10 30 -14
v -9 30 -14
v 2 30 -14
v 4 30 -14
v 14 30 -14
v -13 33 13
v 6 33 13
v 7 33 13
v 13 33 13
v -12 33 12
v 6 33 12
v 7 33 12
v 12 33 12
v -12 33 -12
v 12 33 -12
v -13 33 -13
v 13 33 -13
v -12 37 12
v -10 37 12
v -9 37 12
v 9 37 12
v 10 37 12
v 12 37 12
v -11 37 11
v -10 37 11
v -9 37 11
v 9 37 11
v 10 37 11
v 11 37 11
v 11 37 8
v 12 37 8
v 11 37 7
v 12 37 7
v -12 37 3
v -11 37 3
v -12 37 2
v -11 37 2
v -11 37 -0
v -11 37 -11
v 7 37 -11
v 8 37 -11
v 11 37 -11
v -12 37 -12
v 12 37 -12
v -11 40 11
v 11 40 11
v -10 40 10
v 10 40 10
v -11 40 -7
v -10 40 -7
v -10 40 -8
v 10 40 -8
v -11 40 -9
v -10 40 -9
v 10 40 -9
v -10 40 -10
v 10 40 -10
v -11 40 -11
v 11 40 -11
v -10 43 10
v 10 43 10
v -9 43 9
v -6 43 9
v -5 43 9
v 9 43 9
v 9 43 -7
v 10 43 -7
v 9 43 -8
v 10 43 -8
v -9 43 -9
v 0 43 -9
v 1 43 -9
v 9 43 -9
v -10 43 -10
v 10 43 -10
v -9 47 9
v -8 47 9
v 9 47 9
v -9 47 8
v -8 47 8
v 8 47 8
v -8 47 -8
v 8 47 -8
v -9 47 -9
v 9 47 -9
v -8 50 8
v -3 50 8
v -2 50 8
v 8 50 8
v -7 50 7
v -3 50 7
v -2 50 7
v -1 50 7
v 0 50 7
v 1 50 7
v 7 50 7
v -7 50 3
v -7 50 2
v -7 50 -7
v 7 50 -7
v -8 50 -8
v 8 50 -8
v -7 53 7
v 7 53 7
v -6 53 6
v 6 53 6
v 6 53 1
v 7 53 1
v 6 53 -1
v 7 53 -1
v -7 53 -2
v -6 53 -2
v -7 53 -3
v -6 53 -3
v -6 53 -6
v -5 53 -6
v -4 53 -6
v -3 53 -6
v 6 53 -6
v -7 53 -7
v -4 53 -7
v -3 53 -7
v 7 53 -7
v -6 57 6
v 6 57 6
v -5 57 5
v 5 57 5
v -5 57 -5
v 5 57 -5
v -6 57 -6
v 6 57 -6
v -5 60 5
v 5 60 5
v -4 60 4
v -3 60 4
v 4 60 4
v -4 60 3
v -4 60 -4
v 4 60 -4
v -5 60 -5
v 5 60 -5
v -4 63 4
v 4 63 4
v -3 63 3
v 3 63 3
v 3 63 1
v 4 63 1
v 3 63 -1
v 4 63 -1
v -3 63 -3
v 3 63 -3
v -4 63 -4
v 4 63 -4
v -3 67 3
v 2 67 3
v 3 67 3
v -2 67 2
v 2 67 2
v 3 67 2
v -2 67 -2
v 2 67 -2
v -3 67 -3
v 3 67 -3
v -2 70 2
v 2 70 2
v -1 70 1
v 0 70 1
v 1 70 1
v -2 70 -0
v -1 70 -0
v -2 70 -1
v -1 70 -1
v 1 70 -1
v -2 70 -2
v 2 70 -2
v -1 72 1
v 1 72 1
v -1 72 -0
v 0 72 -0
v -1 72 -1
v 0 72 -1
v 1 72 -1

# faces
f 6/2/1 2/2/1 1/2/1
f 6/3/1 3/3/1 2/3/1
f 7/2/1 4/2/1 3/2/1
f 7/3/1 3/3/1 6/3/1
f 8/3/1 5/3/1 4/3/1
f 8/2/1 4/2/1 7/2/1
f 9/3/1 5/3/1 8/3/1
f 10/2/1 7/2/1 6/2/1
f 10/2/1 6/2/1 1/2/1
f 10/2/1 9/2/1 8/2/1
f 10/2/1 8/2/1 7/2/1
f 11/2/1 9/2/1 10/2/1
f 14/2/1 13/2/1 12/2/1
f 15/2/1 13/2/1 14/2/1
f 16/2/1 13/2/1 15/2/1
f 17/2/1 13/2/1 16/2/1
f 18/2/1 14/2/1 12/2/1
f 19/3/1 15/3/1 14/3/1
f 19/2/1 14/2/1 18/2/1
f 20/2/1 16/2/1 15/2/1
f 20/3/1 15/3/1 19/3/1
f 21/3/1 17/3/1 16/3/1
f 21/2/1 16/2/1 20/2/1
f 22/2/1 13/2/1 17/2/1
f 22/3/1 17/3/1 21/3/1
f 23/2/1 13/2/1 22/2/1
f 30/2/1 25/2/1 24/2/1
f 30/2/1 29/2/1 28/2/1
f 30/2/1 28/2/1 27/2/1
f 30/2/1 27/2/1 26/2/1
f 30/2/1 26/2/1 25/2/1
f 31/2/1 29/2/1 30/2/1
f 34/2/1 33/2/1 32/2/1
f 35/2/1 33/2/1 34/2/1
f 36/2/1 34/2/1 32/2/1
f 36/3/1 35/3/1 34/3/1
f 37/2/1 33/2/1 35/2/1
f 37/3/1 35/3/1 36/3/1
f 38/2/1 33/2/1 37/2/1
f 39/2/1 36/2/1 32/2/1
f 39/2/1 37/2/1 36/2/1
f 40/3/1 38/3/1 37/3/1
f 40/2/1 37/2/1 39/2/1
f 41/2/1 33/2/1 38/2/1
f 41/3/1 38/3/1 40/3/1
f 42/2/1 33/2/1 41/2/1
f 48/2/1 44/2/1 43/2/1
f 48/2/1 45/2/1 44/2/1
f 48/3/1 46/3/1 45/3/1
f 49/2/1 47/2/1 46/2/1
f 49/3/1 46/3/1 48/3/1
f 50/2/1 47/2/1 49/2/1
f 51/2/1 47/2/1 50/2/1
f 52/2/1 49/2/1 48/2/1
f 52/2/1 50/2/1 49/2/1
f 53/3/1 51/3/1 50/3/1
f 53/2/1 50/2/1 52/2/1
f 54/2/1 47/2/1 51/2/1
f 54/3/1 51/3/1 53/3/1
f 55/2/1 48/2/1 43/2/1
f 55/2/1 52/2/1 48/2/1
f 56/3/1 53/3/1 52/3/1
f 56/2/1 52/2/1 55/2/1
f 57/2/1 54/2/1 53/2/1
f 57/3/1 53/3/1 56/3/1
f 58/2/1 47/2/1 54/2/1
f 58/2/1 54/2/1 57/2/1
f 64/2/1 60/2/1 59/2/1
f 64/3/1 61/3/1 60/3/1
f 65/2/1 63/2/1 62/2/1
f 65/3/1 61/3/1 64/3/1
f 65/2/1 62/2/1 61/2/1
f 66/2/1 64/2/1 59/2/1
f 66/2/1 65/2/1 64/2/1
f 67/2/1 63/2/1 65/2/1
f 67/2/1 65/2/1 66/2/1
f 70/2/1 69/2/1 68/2/1
f 71/2/1 69/2/1 70/2/1
f 72/3/1 71/3/1 70/3/1
f 73/2/1 69/2/1 71/2/1
f 73/3/1 71/3/1 72/3/1
f 74/2/1 69/2/1 73/2/1
f 77/2/1 76/2/1 75/2/1
f 78/2/1 76/2/1 77/2/1
f 83/2/1 80/2/1 79/2/1
f 83/3/1 81/3/1 80/3/1
f 84/2/1 82/2/1 81/2/1
f 84/3/1 81/3/1 83/3/1
f 85/2/1 84/2/1 83/2/1
f 85/2/1 82/2/1 84/2/1
f 86/2/1 82/2/1 85/2/1
f 87/2/1 83/2/1 79/2/1
f 87/2/1 85/2/1 83/2/1
f 88/3/1 86/3/1 85/3/1
f 88/2/1 85/2/1 87/2/1
f 89/2/1 82/2/1 86/2/1
f 89/3/1 86/3/1 88/3/1
f 90/2/1 82/2/1 89/2/1
f 95/2/1 94/2/1 93/2/1
f 96/2/1 94/2/1 95/2/1
f 97/2/1 92/2/1 91/2/1
f 97/3/1 93/3/1 92/3/1
f 98/2/1 95/2/1 93/2/1
f 98/3/1 93/3/1 97/3/1
f 99/3/1 96/3/1 95/3/1
f 99/2/1 95/2/1 98/2/1
f 100/3/1 96/3/1 99/3/1
f 101/2/1 98/2/1 97/2/1
f 101/2/1 97/2/1 91/2/1
f 101/2/1 100/2/1 99/2/1
f 101/2/1 99/2/1 98/2/1
f 102/2/1 100/2/1 101/2/1
f 105/2/1 104/2/1 103/2/1
f 106/2/1 104/2/1 105/2/1
f 109/1/1 108/1/1 107/1/1
f 110/1/1 108/1/1 109/1/1
f 114/3/1 112/3/1 111/3/1
f 115/2/1 113/2/1 112/2/1
f 115/3/1 112/3/1 114/3/1
f 116/2/1 115/2/1 114/2/1
f 117/2/1 113/2/1 115/2/1
f 117/2/1 115/2/1 116/2/1
f 120/2/1 119/2/1 118/2/1
f 121/2/1 119/2/1 120/2/1
f 124/2/1 123/2/1 122/2/1
f 125/2/1 123/2/1 124/2/1
f 126/2/1 124/2/1 122/2/1
f 127/3/1 125/3/1 124/3/1
f 127/2/1 124/2/1 126/2/1
f 128/2/1 123/2/1 125/2/1
f 128/3/1 125/3/1 127/3/1
f 129/2/1 123/2/1 128/2/1
f 133/3/1 131/3/1 130/3/1
f 134/2/1 132/2/1 131/2/1
f 134/3/1 131/3/1 133/3/1
f 135/2/1 132/2/1 134/2/1
f 136/2/1 134/2/1 133/2/1
f 137/3/1 135/3/1 134/3/1
f 137/2/1 134/2/1 136/2/1
f 138/3/1 135/3/1 137/3/1
f 139/2/2 140/2/2 141/2/2
f 141/2/2 140/2/2 142/2/2
f 143/2/2 144/2/2 145/2/2
f 145/2/2 144/2/2 146/2/2
f 147/2/2 148/2/2 151/2/2
f 149/2/2 150/2/2 151/2/2
f 148/2/2 149/2/2 151/2/2
f 151/2/2 150/2/2 152/2/2
f 151/3/2 152/3/2 153/3/2
f 152/2/2 150/2/2 154/2/2
f 153/3/2 152/3/2 154/3/2
f 154/2/2 150/2/2 155/2/2
f 156/1/2 157/1/2 158/1/2
f 158/1/2 157/1/2 159/1/2
f 160/2/2 161/2/2 162/2/2
f 162/2/2 161/2/2 163/2/2
f 160/2/2 162/2/2 164/2/2
f 162/3/2 163/3/2 165/3/2
f 164/2/2 162/2/2 165/2/2
f 163/2/2 161/2/2 166/2/2
f 165/3/2 163/3/2 166/3/2
f 166/2/2 161/2/2 167/2/2
f 168/2/2 169/2/2 170/2/2
f 170/2/2 169/2/2 171/2/2
f 172/2/2 173/2/2 176/2/2
f 174/2/2 175/2/2 176/2/2
f 173/2/2 174/2/2 176/2/2
f 176/2/2 175/2/2 177/2/2
f 172/2/2 176/2/2 178/2/2
f 176/3/2 177/3/2 178/3/2
f 177/2/2 175/2/2 179/2/2
f 178/3/2 177/3/2 179/3/2
f 172/2/2 178/2/2 180/2/2
f 178/2/2 179/2/2 180/2/2
f 179/2/2 175/2/2 181/2/2
f 180/2/2 179/2/2 181/2/2
f 182/2/2 183/2/2 184/2/2
f 184/2/2 183/2/2 185/2/2
f 182/2/2 184/2/2 186/2/2
f 184/3/2 185/3/2 187/3/2
f 186/2/2 184/2/2 187/2/2
f 182/2/2 186/2/2 188/2/2
f 186/3/2 187/3/2 189/3/2
f 188/2/2 186/2/2 189/2/2
f 185/2/2 183/2/2 190/2/2
f 189/3/2 187/3/2 190/3/2
f 187/3/2 185/3/2 190/3/2
f 190/2/2 183/2/2 191/2/2
f 192/2/2 193/2/2 194/2/2
f 194/2/2 193/2/2 195/2/2
f 196/2/2 197/2/2 200/2/2
f 198/2/2 199/2/2 200/2/2
f 197/2/2 198/2/2 200/2/2
f 200/2/2 199/2/2 201/2/2
f 196/2/2 200/2/2 202/2/2
f 200/3/2 201/3/2 202/3/2
f 201/2/2 199/2/2 203/2/2
f 202/3/2 201/3/2 203/3/2
f 196/2/2 202/2/2 204/2/2
f 202/2/2 203/2/2 204/2/2
f 203/2/2 199/2/2 205/2/2
f 204/2/2 203/2/2 205/2/2
f 206/2/2 207/2/2 210/2/2
f 207/3/2 208/3/2 211/3/2
f 210/2/2 207/2/2 211/2/2
f 208/2/2 209/2/2 212/2/2
f 211/3/2 208/3/2 212/3/2
f 206/2/2 210/2/2 213/2/2
f 210/3/2 211/3/2 214/3/2
f 213/2/2 210/2/2 214/2/2
f 211/2/2 212/2/2 215/2/2
f 214/3/2 211/3/2 215/3/2
f 212/2/2 209/2/2 216/2/2
f 215/2/2 212/2/2 216/2/2
f 217/2/2 218/2/2 221/2/2
f 219/2/2 220/2/2 221/2/2
f 218/2/2 219/2/2 221/2/2
f 221/2/2 220/2/2 222/2/2
f 223/2/2 224/2/2 225/2/2
f 225/2/2 224/2/2 226/2/2
f 226/2/2 224/2/2 227/2/2
f 227/2/2 224/2/2 228/2/2
f 226/2/2 227/2/2 229/2/2
f 227/3/2 228/3/2 229/3/2
f 228/2/2 224/2/2 230/2/2
f 229/3/2 228/3/2 230/3/2
f 223/2/2 225/2/2 231/2/2
f 225/3/2 226/3/2 232/3/2
f 231/2/2 225/2/2 232/2/2
f 226/2/2 229/2/2 233/2/2
f 232/3/2 226/3/2 233/3/2
f 229/2/2 230/2/2 233/2/2
f 230/2/2 224/2/2 234/2/2
f 233/2/2 230/2/2 234/2/2
f 235/2/2 236/2/2 239/2/2
f 239/2/2 236/2/2 240/2/2
f 236/3/2 237/3/2 241/3/2
f 240/2/2 236/2/2 241/2/2
f 237/2/2 238/2/2 242/2/2
f 241/3/2 237/3/2 242/3/2
f 239/3/2 240/3/2 243/3/2
f 235/2/2 239/2/2 243/2/2
f 240/2/2 241/2/2 244/2/2
f 243/3/2 240/3/2 244/3/2
f 241/2/2 242/2/2 244/2/2
f 235/2/2 243/2/2 245/2/2
f 243/2/2 244/2/2 245/2/2
f 244/2/2 242/2/2 246/2/2
f 245/2/2 244/2/2 246/2/2
f 242/2/2 238/2/2 246/2/2
f 247/2/2 248/2/2 249/2/2
f 249/2/2 248/2/2 250/2/2
f 251/2/2 252/2/2 253/2/2
f 253/2/2 252/2/2 254/2/2
f 257/2/3 256/2/3 255/2/3
f 258/2/3 256/2/3 257/2/3
f 259/3/3 258/3/3 257/3/3
f 260/2/3 256/2/3 258/2/3
f 260/3/3 258/3/3 259/3/3
f 261/2/3 260/2/3 259/2/3
f 262/2/3 256/2/3 260/2/3
f 262/2/3 260/2/3 261/2/3
f 265/2/3 264/2/3 263/2/3
f 266/2/3 264/2/3 265/2/3
f 267/2/3 265/2/3 263/2/3
f 267/3/3 266/3/3 265/3/3
f 268/3/3 266/3/3 267/3/3
f 269/2/3 267/2/3 263/2/3
f 269/2/3 268/2/3 267/2/3
f 270/2/3 268/2/3 269/2/3
f 273/2/3 272/2/3 271/2/3
f 274/2/3 272/2/3 273/2/3
f 275/2/3 272/2/3 274/2/3
f 276/2/3 272/2/3 275/2/3
f 277/2/3 275/2/3 274/2/3
f 277/3/3 276/3/3 275/3/3
f 278/3/3 276/3/3 277/3/3
f 279/2/3 277/2/3 274/2/3
f 279/2/3 278/2/3 277/2/3
f 280/2/3 278/2/3 279/2/3
f 283/2/3 282/2/3 281/2/3
f 284/2/3 282/2/3 283/2/3
f 285/2/3 283/2/3 281/2/3
f 285/3/3 284/3/3 283/3/3
f 286/3/3 284/3/3 285/3/3
f 287/2/3 285/2/3 281/2/3
f 287/2/3 286/2/3 285/2/3
f 288/2/3 286/2/3 287/2/3
f 289/2/3 287/2/3 281/2/3
f 289/3/3 288/3/3 287/3/3
f 290/2/3 286/2/3 288/2/3
f 290/3/3 288/3/3 289/3/3
f 291/2/3 289/2/3 281/2/3
f 291/2/3 290/2/3 289/2/3
f 292/2/3 290/2/3 291/2/3
f 293/2/3 286/2/3 290/2/3
f 293/2/3 290/2/3 292/2/3
f 294/2/3 286/2/3 293/2/3
f 295/2/3 293/2/3 292/2/3
f 296/3/3 294/3/3 293/3/3
f 296/2/3 293/2/3 295/2/3
f 297/3/3 294/3/3 296/3/3
f 298/2/3 295/2/3 292/2/3
f 298/3/3 296/3/3 295/3/3
f 299/2/3 297/2/3 296/2/3
f 299/3/3 296/3/3 298/3/3
f 300/2/3 298/2/3 292/2/3
f 300/2/3 299/2/3 298/2/3
f 301/2/3 297/2/3 299/2/3
f 301/2/3 299/2/3 300/2/3
f 304/2/3 303/2/3 302/2/3
f 305/2/3 303/2/3 304/2/3
f 306/3/3 305/3/3 304/3/3
f 307/2/3 303/2/3 305/2/3
f 307/3/3 305/3/3 306/3/3
f 308/2/3 307/2/3 306/2/3
f 309/2/3 307/2/3 308/2/3
f 310/2/3 307/2/3 309/2/3
f 311/2/3 303/2/3 307/2/3
f 311/2/3 307/2/3 310/2/3
f 314/2/3 313/2/3 312/2/3
f 315/2/3 313/2/3 314/2/3
f 319/2/3 317/2/3 316/2/3
f 319/3/3 318/3/3 317/3/3
f 320/3/3 318/3/3 319/3/3
f 321/2/3 319/2/3 316/2/3
f 321/2/3 320/2/3 319/2/3
f 322/2/3 320/2/3 321/2/3
f 323/3/3 322/3/3 321/3/3
f 324/2/3 320/2/3 322/2/3
f 324/3/3 322/3/3 323/3/3
f 325/2/3 324/2/3 323/2/3
f 325/2/3 320/2/3 324/2/3
f 326/2/3 320/2/3 325/2/3
f 327/2/3 325/2/3 323/2/3
f 327/3/3 326/3/3 325/3/3
f 328/2/3 320/2/3 326/2/3
f 328/3/3 326/3/3 327/3/3
f 329/2/3 327/2/3 323/2/3
f 329/2/3 328/2/3 327/2/3
f 330/2/3 320/2/3 328/2/3
f 330/2/3 328/2/3 329/2/3
f 333/2/3 332/2/3 331/2/3
f 334/2/3 332/2/3 333/2/3
f 335/2/3 333/2/3 331/2/3
f 335/3/3 334/3/3 333/3/3
f 336/3/3 334/3/3 335/3/3
f 337/2/3 335/2/3 331/2/3
f 337/2/3 336/2/3 335/2/3
f 338/2/3 336/2/3 337/2/3
f 341/2/3 340/2/3 339/2/3
f 342/2/3 340/2/3 341/2/3
f 343/2/3 340/2/3 342/2/3
f 344/3/3 343/3/3 342/3/3
f 345/2/3 340/2/3 343/2/3
f 345/3/3 343/3/3 344/3/3
f 346/2/3 340/2/3 345/2/3
f 347/2/3 345/2/3 344/2/3
f 348/3/3 346/3/3 345/3/3
f 348/2/3 345/2/3 347/2/3
f 349/3/3 348/3/3 347/3/3
f 350/2/3 340/2/3 346/2/3
f 350/3/3 348/3/3 349/3/3
f 350/3/3 346/3/3 348/3/3
f 351/2/3 350/2/3 349/2/3
f 352/2/3 340/2/3 350/2/3
f 352/2/3 350/2/3 351/2/3
f 355/2/3 354/2/3 353/2/3
f 356/2/3 354/2/3 355/2/3
f 357/2/3 355/2/3 353/2/3
f 357/3/3 356/3/3 355/3/3
f 358/2/3 354/2/3 356/2/3
f 358/3/3 356/3/3 357/3/3
f 359/2/3 357/2/3 353/2/3
f 359/2/3 358/2/3 357/2/3
f 360/2/3 354/2/3 358/2/3
f 360/2/3 358/2/3 359/2/3
f 363/2/3 362/2/3 361/2/3
f 364/2/3 362/2/3 363/2/3
f 370/3/3 368/3/3 367/3/3
f 371/2/3 369/2/3 368/2/3
f 371/3/3 368/3/3 370/3/3
f 372/1/3 366/1/3 365/1/3
f 373/1/3 366/1/3 372/1/3
f 374/2/3 371/2/3 370/2/3
f 375/2/3 369/2/3 371/2/3
f 375/2/3 371/2/3 374/2/3
f 378/2/3 377/2/3 376/2/3
f 379/2/3 377/2/3 378/2/3
f 380/2/3 378/2/3 376/2/3
f 381/3/3 379/3/3 378/3/3
f 381/2/3 378/2/3 380/2/3
f 382/3/3 379/3/3 381/3/3
f 385/2/3 384/2/3 383/2/3
f 386/2/3 384/2/3 385/2/3
f 390/3/3 388/3/3 387/3/3
f 391/2/3 389/2/3 388/2/3
f 391/3/3 388/3/3 390/3/3
f 392/2/3 391/2/3 390/2/3
f 393/2/3 389/2/3 391/2/3
f 393/2/3 391/2/3 392/2/3
f 394/2/4 395/2/4 397/2/4
f 395/3/4 396/3/4 397/3/4
f 397/3/4 396/3/4 398/3/4
f 394/2/4 397/2/4 399/2/4
f 397/2/4 398/2/4 399/2/4
f 399/2/4 398/2/4 400/2/4
f 401/2/4 402/2/4 403/2/4
f 403/2/4 402/2/4 404/2/4
f 405/2/4 406/2/4 407/2/4
f 407/2/4 406/2/4 408/2/4
f 409/1/4 410/1/4 413/1/4
f 413/1/4 410/1/4 414/1/4
f 411/2/4 412/2/4 415/2/4
f 415/2/4 412/2/4 416/2/4
f 417/2/4 418/2/4 419/2/4
f 419/2/4 418/2/4 420/2/4
f 417/2/4 419/2/4 421/2/4
f 419/3/4 420/3/4 421/3/4
f 420/2/4 418/2/4 422/2/4
f 421/3/4 420/3/4 422/3/4
f 417/2/4 421/2/4 423/2/4
f 421/2/4 422/2/4 423/2/4
f 422/2/4 418/2/4 424/2/4
f 423/2/4 422/2/4 424/2/4
f 425/2/4 426/2/4 429/2/4
f 426/3/4 427/3/4 430/3/4
f 429/2/4 426/2/4 430/2/4
f 427/2/4 428/2/4 431/2/4
f 430/3/4 427/3/4 431/3/4
f 429/3/4 430/3/4 432/3/4
f 430/2/4 431/2/4 433/2/4
f 432/3/4 430/3/4 433/3/4
f 432/2/4 433/2/4 434/2/4
f 434/2/4 433/2/4 435/2/4
f 431/2/4 428/2/4 436/2/4
f 435/2/4 433/2/4 436/2/4
f 433/2/4 431/2/4 436/2/4
f 437/2/4 438/2/4 439/2/4
f 439/2/4 438/2/4 440/2/4
f 437/2/4 439/2/4 441/2/4
f 439/3/4 440/3/4 441/3/4
f 441/3/4 440/3/4 442/3/4
f 437/2/4 441/2/4 443/2/4
f 441/2/4 442/2/4 443/2/4
f 443/2/4 442/2/4 444/2/4
f 445/2/4 446/2/4 447/2/4
f 447/2/4 446/2/4 448/2/4
f 449/2/4 450/2/4 451/2/4
f 451/2/4 450/2/4 452/2/4
f 451/3/4 452/3/4 453/3/4
f 452/2/4 450/2/4 454/2/4
f 453/3/4 452/3/4 454/3/4
f 453/2/4 454/2/4 455/2/4
f 454/2/4 450/2/4 455/2/4
f 455/2/4 450/2/4 456/2/4
f 453/2/4 455/2/4 457/2/4
f 455/3/4 456/3/4 457/3/4
f 457/3/4 456/3/4 458/3/4
f 457/2/4 458/2/4 459/2/4
f 458/3/4 456/3/4 459/3/4
f 456/2/4 450/2/4 460/2/4
f 459/3/4 456/3/4 460/3/4
f 457/2/4 459/2/4 461/2/4
f 453/2/4 457/2/4 461/2/4
f 459/2/4 460/2/4 461/2/4
f 460/2/4 450/2/4 462/2/4
f 461/2/4 460/2/4 462/2/4
f 463/2/4 464/2/4 465/2/4
f 465/2/4 464/2/4 466/2/4
f 467/2/4 468/2/4 469/2/4
f 469/2/4 468/2/4 470/2/4
f 467/2/4 469/2/4 471/2/4
f 469/3/4 470/3/4 471/3/4
f 470/2/4 468/2/4 472/2/4
f 471/3/4 470/3/4 472/3/4
f 467/2/4 471/2/4 473/2/4
f 471/2/4 472/2/4 473/2/4
f 473/2/4 472/2/4 474/2/4
f 473/3/4 474/3/4 475/3/4
f 474/2/4 472/2/4 476/2/4
f 475/3/4 474/3/4 476/3/4
f 475/2/4 476/2/4 477/2/4
f 472/2/4 468/2/4 478/2/4
f 477/2/4 476/2/4 478/2/4
f 476/2/4 472/2/4 478/2/4
f 479/2/4 480/2/4 481/2/4
f 481/2/4 480/2/4 482/2/4
f 483/2/4 484/2/4 485/2/4
f 485/2/4 484/2/4 486/2/4
f 486/2/4 484/2/4 487/2/4
f 487/2/4 484/2/4 488/2/4
f 487/3/4 488/3/4 489/3/4
f 488/2/4 484/2/4 490/2/4
f 489/3/4 488/3/4 490/3/4
f 489/2/4 490/2/4 491/2/4
f 490/2/4 484/2/4 492/2/4
f 491/2/4 490/2/4 492/2/4
f 493/2/4 494/2/4 495/2/4
f 495/2/4 494/2/4 496/2/4
f 495/3/4 496/3/4 497/3/4
f 496/2/4 494/2/4 498/2/4
f 497/3/4 496/3/4 498/3/4
f 498/2/4 494/2/4 499/2/4
f 497/2/4 498/2/4 500/2/4
f 498/3/4 499/3/4 500/3/4
f 500/3/4 499/3/4 501/3/4
f 497/2/4 500/2/4 502/2/4
f 500/2/4 501/2/4 502/2/4
f 502/2/4 501/2/4 503/2/4
f 497/2/4 502/2/4 504/2/4
f 502/3/4 503/3/4 504/3/4
f 504/3/4 503/3/4 505/3/4
f 497/2/4 504/2/4 506/2/4
f 504/2/4 505/2/4 506/2/4
f 506/2/4 505/2/4 507/2/4
f 508/3/4 509/3/4 511/3/4
f 509/2/4 510/2/4 512/2/4
f 511/3/4 509/3/4 512/3/4
f 511/2/4 512/2/4 513/2/4
f 512/2/4 510/2/4 514/2/4
f 513/2/4 512/2/4 514/2/4
f 517/1/5 516/1/5 515/1/5
f 518/1/5 516/1/5 517/1/5
f 523/2/5 520/2/5 519/2/5
f 523/3/5 521/3/5 520/3/5
f 524/2/5 522/2/5 521/2/5
f 524/3/5 521/3/5 523/3/5
f 525/2/5 523/2/5 519/2/5
f 525/2/5 524/2/5 523/2/5
f 526/2/5 524/2/5 525/2/5
f 527/2/5 525/2/5 519/2/5
f 527/3/5 526/3/5 525/3/5
f 528/2/5 524/2/5 526/2/5
f 528/3/5 526/3/5 527/3/5
f 529/2/5 527/2/5 519/2/5
f 529/2/5 528/2/5 527/2/5
f 530/2/5 524/2/5 528/2/5
f 530/2/5 528/2/5 529/2/5
f 531/2/5 529/2/5 519/2/5
f 532/3/5 530/3/5 529/3/5
f 532/2/5 529/2/5 531/2/5
f 533/2/5 524/2/5 530/2/5
f 533/3/5 530/3/5 532/3/5
f 534/2/5 524/2/5 533/2/5
f 535/2/5 524/2/5 534/2/5
f 536/3/5 532/3/5 531/3/5
f 536/2/5 531/2/5 519/2/5
f 537/2/5 533/2/5 532/2/5
f 537/3/5 532/3/5 536/3/5
f 537/2/5 534/2/5 533/2/5
f 538/3/5 535/3/5 534/3/5
f 538/2/5 534/2/5 537/2/5
f 539/2/5 524/2/5 535/2/5
f 539/3/5 535/3/5 538/3/5
f 540/2/5 538/2/5 537/2/5
f 540/2/5 537/2/5 536/2/5
f 540/2/5 539/2/5 538/2/5
f 541/2/5 539/2/5 540/2/5
f 542/2/5 539/2/5 541/2/5
f 543/2/5 539/2/5 542/2/5
f 544/2/5 540/2/5 536/2/5
f 545/2/5 542/2/5 541/2/5
f 546/3/5 543/3/5 542/3/5
f 546/2/5 542/2/5 545/2/5
f 547/2/5 539/2/5 543/2/5
f 547/3/5 543/3/5 546/3/5
f 548/2/5 536/2/5 519/2/5
f 548/2/5 546/2/5 545/2/5
f 548/2/5 547/2/5 546/2/5
f 548/2/5 544/2/5 536/2/5
f 548/2/5 545/2/5 544/2/5
f 549/2/5 547/2/5 548/2/5
f 550/2/5 548/2/5 519/2/5
f 550/3/5 549/3/5 548/3/5
f 551/2/5 547/2/5 549/2/5
f 551/3/5 549/3/5 550/3/5
f 552/2/5 551/2/5 550/2/5
f 552/2/5 547/2/5 551/2/5
f 553/2/5 547/2/5 552/2/5
f 554/2/5 552/2/5 550/2/5
f 554/3/5 553/3/5 552/3/5
f 555/2/5 547/2/5 553/2/5
f 555/3/5 553/3/5 554/3/5
f 556/2/5 522/2/5 524/2/5
f 556/2/5 547/2/5 555/2/5
f 556/2/5 524/2/5 539/2/5
f 556/2/5 539/2/5 547/2/5
f 557/2/5 522/2/5 556/2/5
f 558/2/5 555/2/5 554/2/5
f 558/2/5 556/2/5 555/2/5
f 559/3/5 557/3/5 556/3/5
f 559/2/5 556/2/5 558/2/5
f 560/2/5 554/2/5 550/2/5
f 560/2/5 550/2/5 519/2/5
f 560/2/5 558/2/5 554/2/5
f 561/2/5 558/2/5 560/2/5
f 562/3/5 559/3/5 558/3/5
f 562/2/5 558/2/5 561/2/5
f 563/2/5 522/2/5 557/2/5
f 563/3/5 559/3/5 562/3/5
f 563/3/5 557/3/5 559/3/5
f 564/2/5 560/2/5 519/2/5
f 565/3/5 561/3/5 560/3/5
f 565/2/5 560/2/5 564/2/5
f 566/2/5 562/2/5 561/2/5
f 566/3/5 561/3/5 565/3/5
f 566/2/5 563/2/5 562/2/5
f 567/3/5 565/3/5 564/3/5
f 568/2/5 566/2/5 565/2/5
f 568/3/5 565/3/5 567/3/5
f 569/2/5 568/2/5 567/2/5
f 570/2/5 566/2/5 568/2/5
f 570/2/5 568/2/5 569/2/5
f 571/3/5 570/3/5 569/3/5
f 572/2/5 566/2/5 570/2/5
f 572/3/5 570/3/5 571/3/5
f 573/2/5 563/2/5 566/2/5
f 573/2/5 566/2/5 572/2/5
f 573/2/5 522/2/5 563/2/5
f 574/2/6 575/2/6 576/2/6
f 576/2/6 575/2/6 577/2/6
f 574/2/6 576/2/6 578/2/6
f 577/2/6 575/2/6 581/2/6
f 579/2/6 580/2/6 582/2/6
f 580/2/6 581/2/6 582/2/6
f 574/2/6 578/2/6 582/2/6
f 578/2/6 579/2/6 582/2/6
f 581/2/6 575/2/6 583/2/6
f 582/2/6 581/2/6 583/2/6
f 584/2/6 585/2/6 588/2/6
f 585/3/6 586/3/6 589/3/6
f 588/2/6 585/2/6 589/2/6
f 586/2/6 587/2/6 590/2/6
f 589/3/6 586/3/6 590/3/6
f 590/2/6 587/2/6 591/2/6
f 584/2/6 588/2/6 592/2/6
f 592/2/6 588/2/6 593/2/6
f 592/3/6 593/3/6 594/3/6
f 594/3/6 593/3/6 595/3/6
f 594/2/6 595/2/6 596/2/6
f 596/2/6 595/2/6 597/2/6
f 596/3/6 597/3/6 598/3/6
f 598/3/6 597/3/6 599/3/6
f 591/2/6 587/2/6 600/2/6
f 600/2/6 587/2/6 601/2/6
f 598/2/6 599/2/6 602/2/6
f 601/2/6 587/2/6 607/2/6
f 598/2/6 602/2/6 608/2/6
f 602/2/6 603/2/6 608/2/6
f 603/3/6 604/3/6 609/3/6
f 608/2/6 603/2/6 609/2/6
f 604/2/6 605/2/6 610/2/6
f 609/3/6 604/3/6 610/3/6
f 605/3/6 606/3/6 611/3/6
f 610/2/6 605/2/6 611/2/6
f 606/2/6 607/2/6 612/2/6
f 611/3/6 606/3/6 612/3/6
f 607/2/6 587/2/6 613/2/6
f 612/2/6 607/2/6 613/2/6
f 614/2/6 615/2/6 618/2/6
f 615/3/6 616/3/6 619/3/6
f 618/2/6 615/2/6 619/2/6
f 616/2/6 617/2/6 620/2/6
f 619/3/6 616/3/6 620/3/6
f 620/2/6 617/2/6 621/2/6
f 614/2/6 618/2/6 622/2/6
f 621/2/6 617/2/6 623/2/6
f 614/2/6 622/2/6 624/2/6
f 622/2/6 623/2/6 624/2/6
f 623/2/6 617/2/6 625/2/6
f 624/2/6 623/2/6 625/2/6
f 626/2/6 627/2/6 632/2/6
f 627/3/6 628/3/6 633/3/6
f 632/2/6 627/2/6 633/2/6
f 628/2/6 629/2/6 634/2/6
f 633/3/6 628/3/6 634/3/6
f 629/3/6 630/3/6 635/3/6
f 634/2/6 629/2/6 635/2/6
f 630/2/6 631/2/6 636/2/6
f 635/3/6 630/3/6 636/3/6
f 636/2/6 631/2/6 637/2/6
f 637/2/6 631/2/6 638/2/6
f 638/2/6 631/2/6 639/2/6
f 638/3/6 639/3/6 640/3/6
f 640/3/6 639/3/6 641/3/6
f 626/2/6 632/2/6 642/2/6
f 642/2/6 632/2/6 643/2/6
f 642/3/6 643/3/6 644/3/6
f 644/3/6 643/3/6 645/3/6
f 644/2/6 645/2/6 646/2/6
f 644/2/6 646/2/6 647/2/6
f 640/2/6 641/2/6 650/2/6
f 648/2/6 649/2/6 651/2/6
f 649/2/6 650/2/6 651/2/6
f 644/2/6 647/2/6 651/2/6
f 647/2/6 648/2/6 651/2/6
f 650/2/6 641/2/6 652/2/6
f 651/2/6 650/2/6 652/2/6
f 653/2/6 654/2/6 655/2/6
f 655/2/6 654/2/6 656/2/6
f 653/2/6 655/2/6 657/2/6
f 657/2/6 655/2/6 658/2/6
f 657/3/6 658/3/6 659/3/6
f 656/2/6 654/2/6 660/2/6
f 657/3/6 659/3/6 661/3/6
f 661/3/6 659/3/6 662/3/6
f 660/2/6 654/2/6 663/2/6
f 661/2/6 662/2/6 664/2/6
f 663/2/6 654/2/6 665/2/6
f 661/2/6 664/2/6 666/2/6
f 664/2/6 665/2/6 666/2/6
f 665/2/6 654/2/6 667/2/6
f 666/2/6 665/2/6 667/2/6
f 668/2/6 669/2/6 670/2/6
f 670/2/6 669/2/6 671/2/6
f 671/2/6 669/2/6 672/2/6
f 672/2/6 669/2/6 673/2/6
f 673/2/6 669/2/6 674/2/6
f 674/2/6 669/2/6 675/2/6
f 674/3/6 675/3/6 676/3/6
f 676/3/6 675/3/6 677/3/6
f 668/2/6 670/2/6 678/2/6
f 676/2/6 677/2/6 681/2/6
f 679/2/6 680/2/6 682/2/6
f 680/2/6 681/2/6 682/2/6
f 668/2/6 678/2/6 682/2/6
f 678/2/6 679/2/6 682/2/6
f 681/2/6 677/2/6 683/2/6
f 682/2/6 681/2/6 683/2/6
f 684/3/6 685/3/6 687/3/6
f 685/2/6 686/2/6 688/2/6
f 687/3/6 685/3/6 688/3/6
f 688/2/6 686/2/6 689/2/6
f 687/2/6 688/2/6 690/2/6
f 689/2/6 686/2/6 691/2/6
f 687/2/6 690/2/6 692/2/6
f 690/2/6 691/2/6 692/2/6
f 691/2/6 686/2/6 693/2/6
f 692/2/6 691/2/6 693/2/6
f 694/2/6 695/2/6 698/2/6
f 695/3/6 696/3/6 699/3/6
f 698/2/6 695/2/6 699/2/6
f 696/2/6 697/2/6 700/2/6
f 699/3/6 696/3/6 700/3/6
f 700/2/6 697/2/6 701/2/6
f 701/2/6 697/2/6 702/2/6
f 702/2/6 697/2/6 703/2/6
f 703/2/6 697/2/6 704/2/6
f 694/2/6 698/2/6 705/2/6
f 694/2/6 705/2/6 706/2/6
f 694/2/6 706/2/6 707/2/6
f 704/2/6 697/2/6 708/2/6
f 694/2/6 707/2/6 709/2/6
f 707/2/6 708/2/6 709/2/6
f 708/2/6 697/2/6 710/2/6
f 709/2/6 708/2/6 710/2/6
f 711/2/6 712/2/6 713/2/6
f 713/2/6 712/2/6 714/2/6
f 714/2/6 712/2/6 715/2/6
f 715/2/6 712/2/6 716/2/6
f 715/3/6 716/3/6 717/3/6
f 717/3/6 716/3/6 718/3/6
f 711/2/6 713/2/6 719/2/6
f 719/2/6 713/2/6 720/2/6
f 719/3/6 720/3/6 721/3/6
f 721/3/6 720/3/6 722/3/6
f 721/2/6 722/2/6 723/2/6
f 717/2/6 718/2/6 727/2/6
f 721/2/6 723/2/6 728/2/6
f 723/2/6 724/2/6 728/2/6
f 724/2/6 725/2/6 728/2/6
f 725/3/6 726/3/6 729/3/6
f 728/2/6 725/2/6 729/2/6
f 726/2/6 727/2/6 730/2/6
f 729/3/6 726/3/6 730/3/6
f 727/2/6 718/2/6 731/2/6
f 730/2/6 727/2/6 731/2/6
f 732/2/6 733/2/6 734/2/6
f 734/2/6 733/2/6 735/2/6
f 732/2/6 734/2/6 736/2/6
f 735/2/6 733/2/6 737/2/6
f 732/2/6 736/2/6 738/2/6
f 736/2/6 737/2/6 738/2/6
f 737/2/6 733/2/6 739/2/6
f 738/2/6 737/2/6 739/2/6
f 740/2/6 741/2/6 742/2/6
f 742/2/6 741/2/6 743/2/6
f 743/2/6 741/2/6 744/2/6
f 740/2/6 742/2/6 745/2/6
f 740/2/6 745/2/6 746/2/6
f 744/2/6 741/2/6 747/2/6
f 740/2/6 746/2/6 748/2/6
f 746/2/6 747/2/6 748/2/6
f 747/2/6 741/2/6 749/2/6
f 748/2/6 747/2/6 749/2/6
f 750/2/6 751/2/6 752/2/6
f 752/2/6 751/2/6 753/2/6
f 753/2/6 751/2/6 754/2/6
f 754/2/6 751/2/6 755/2/6
f 754/3/6 755/3/6 756/3/6
f 756/3/6 755/3/6 757/3/6
f 750/2/6 752/2/6 758/2/6
f 756/2/6 757/2/6 759/2/6
f 750/2/6 758/2/6 760/2/6
f 758/2/6 759/2/6 760/2/6
f 759/2/6 757/2/6 761/2/6
f 760/2/6 759/2/6 761/2/6
f 762/2/6 763/2/6 765/2/6
f 763/3/6 764/3/6 766/3/6
f 765/2/6 763/2/6 766/2/6
f 766/3/6 764/3/6 767/3/6
f 762/2/6 765/2/6 768/2/6
f 766/2/6 767/2/6 769/2/6
f 762/2/6 768/2/6 770/2/6
f 768/2/6 769/2/6 770/2/6
f 769/2/6 767/2/6 771/2/6
f 770/2/6 769/2/6 771/2/6
f 772/2/6 773/2/6 774/2/6
f 774/2/6 773/2/6 775/2/6
f 775/2/6 773/2/6 776/2/6
f 772/2/6 774/2/6 777/2/6
f 777/2/6 774/2/6 778/2/6
f 777/3/6 778/3/6 779/3/6
f 779/3/6 778/3/6 780/3/6
f 776/2/6 773/2/6 781/2/6
f 779/2/6 780/2/6 782/2/6
f 780/2/6 781/2/6 782/2/6
f 781/2/6 773/2/6 783/2/6
f 782/2/6 781/2/6 783/2/6
f 784/2/6 785/2/6 786/2/6
f 786/2/6 785/2/6 787/2/6
f 786/3/6 787/3/6 788/3/6
f 787/2/6 785/2/6 789/2/6
f 788/3/6 787/3/6 789/3/6
f 789/2/6 785/2/6 790/2/6
