# MagicaVoxel @ ephtracy

# material
mtllib iceStalactites3.mtl
usemtl palette

# normals
vn -1 0 0
vn 1 0 0
vn 0 0 1
vn 0 0 -1
vn 0 -1 0
vn 0 1 0

# texcoords
vt 0.00195313 0.5
vt 0.142578 0.5
vt 0.306641 0.5

# verts
v -5.5 0 5.5
v -5.5 0 4.5
v -5.5 0 -4.5
v -5.5 0 -5.5
v -5.5 1 5.5
v -5.5 1 4.5
v -5.5 2 5.5
v -5.5 2 4.5
v -5.5 2 -4.5
v -5.5 2 -5.5
v -4.5 0 4.5
v -4.5 0 3.5
v -4.5 0 -3.5
v -4.5 0 -4.5
v -4.5 1 4.5
v -4.5 2 4.5
v -4.5 2 -4.5
v -4.5 3 4.5
v -4.5 3 3.5
v -4.5 4 4.5
v -4.5 4 3.5
v -4.5 4 -3.5
v -4.5 4 -4.5
v -4.5 5 4.5
v -4.5 5 3.5
v -3.5 0 3.5
v -3.5 0 2.5
v -3.5 0 -2.5
v -3.5 0 -3.5
v -3.5 1 -2.5
v -3.5 1 -3.5
v -3.5 2 -2.5
v -3.5 2 -3.5
v -3.5 3 3.5
v -3.5 3 2.5
v -2.5 0 2.5
v -2.5 0 1.5
v -2.5 0 -1.5
v -2.5 0 -2.5
v -2.5 1 -2.5
v -2.5 2 -2.5
v -2.5 3 2.5
v -2.5 4 2.5
v -2.5 4 1.5
v -2.5 6 2.5
v -2.5 6 1.5
v -2.5 7 -1.5
v -2.5 7 -2.5
v -2.5 8 -1.5
v -2.5 8 -2.5
v -2.5 9 -1.5
v -2.5 9 -2.5
v -1.5 0 1.5
v -1.5 0 0.5
v -1.5 0 -0.5
v -1.5 0 -1.5
v -1.5 1 1.5
v -1.5 1 0.5
v -1.5 2 1.5
v -1.5 2 0.5
v -1.5 3 1.5
v -1.5 3 0.5
v -1.5 3 -0.5
v -1.5 3 -1.5
v -0.5 0 0.5
v -0.5 0 -0.5
v -0.5 1 0.5
v -0.5 2 0.5
v -0.5 3 0.5
v -0.5 3 -0.5
v -0.5 5 0.5
v -0.5 5 -0.5
v -0.5 6 0.5
v -0.5 6 -0.5
v -0.5 7 0.5
v -0.5 7 -0.5
v -0.5 11 0.5
v -0.5 11 -0.5
v 0.5 0 1.5
v 0.5 0 0.5
v 0.5 0 -0.5
v 0.5 0 -1.5
v 0.5 2 1.5
v 0.5 2 0.5
v 0.5 2 -0.5
v 0.5 2 -1.5
v 0.5 4 -0.5
v 0.5 4 -1.5
v 0.5 5 -0.5
v 0.5 6 -0.5
v 0.5 6 -1.5
v 1.5 0 2.5
v 1.5 0 1.5
v 1.5 0 -1.5
v 1.5 0 -2.5
v 1.5 1 2.5
v 1.5 1 1.5
v 1.5 2 2.5
v 1.5 2 1.5
v 1.5 2 -1.5
v 1.5 3 2.5
v 1.5 3 1.5
v 1.5 4 2.5
v 1.5 4 1.5
v 1.5 4 -1.5
v 1.5 5 2.5
v 1.5 5 1.5
v 1.5 6 -1.5
v 1.5 7 -1.5
v 1.5 7 -2.5
v 1.5 8 2.5
v 1.5 8 1.5
v 1.5 8 -1.5
v 1.5 8 -2.5
v 1.5 9 -1.5
v 1.5 9 -2.5
v 1.5 10 -1.5
v 1.5 10 -2.5
v 2.5 0 3.5
v 2.5 0 2.5
v 2.5 0 -2.5
v 2.5 0 -3.5
v 2.5 1 2.5
v 2.5 2 2.5
v 2.5 2 -2.5
v 2.5 2 -3.5
v 2.5 3 3.5
v 2.5 3 2.5
v 2.5 3 -2.5
v 2.5 3 -3.5
v 3.5 0 4.5
v 3.5 0 3.5
v 3.5 0 -3.5
v 3.5 0 -4.5
v 3.5 1 -3.5
v 3.5 1 -4.5
v 3.5 2 -3.5
v 3.5 2 -4.5
v 3.5 3 3.5
v 3.5 3 -3.5
v 3.5 5 4.5
v 3.5 5 3.5
v 3.5 5 -3.5
v 3.5 5 -4.5
v 3.5 6 4.5
v 3.5 6 3.5
v 4.5 0 5.5
v 4.5 0 4.5
v 4.5 0 -4.5
v 4.5 0 -5.5
v 4.5 1 5.5
v 4.5 1 4.5
v 4.5 1 -4.5
v 4.5 1 -5.5
v -4.5 0 5.5
v -4.5 0 4.5
v -4.5 0 -4.5
v -4.5 0 -5.5
v -4.5 1 5.5
v -4.5 1 4.5
v -4.5 2 5.5
v -4.5 2 4.5
v -4.5 2 -4.5
v -4.5 2 -5.5
v -3.5 0 4.5
v -3.5 0 3.5
v -3.5 0 -3.5
v -3.5 0 -4.5
v -3.5 1 -3.5
v -3.5 2 -3.5
v -3.5 3 4.5
v -3.5 3 3.5
v -3.5 4 4.5
v -3.5 4 3.5
v -3.5 4 -3.5
v -3.5 4 -4.5
v -3.5 5 4.5
v -3.5 5 3.5
v -2.5 0 3.5
v -2.5 0 2.5
v -2.5 0 -2.5
v -2.5 0 -3.5
v -2.5 1 -2.5
v -2.5 1 -3.5
v -2.5 2 -2.5
v -2.5 2 -3.5
v -2.5 3 3.5
v -2.5 3 2.5
v -1.5 0 2.5
v -1.5 0 1.5
v -1.5 0 -1.5
v -1.5 0 -2.5
v -1.5 1 1.5
v -1.5 2 1.5
v -1.5 3 1.5
v -1.5 3 -1.5
v -1.5 4 2.5
v -1.5 4 1.5
v -1.5 6 2.5
v -1.5 6 1.5
v -1.5 7 -1.5
v -1.5 7 -2.5
v -1.5 8 -1.5
v -1.5 8 -2.5
v -1.5 9 -1.5
v -1.5 9 -2.5
v -0.5 0 1.5
v -0.5 0 0.5
v -0.5 0 -0.5
v -0.5 0 -1.5
v -0.5 1 1.5
v -0.5 1 0.5
v -0.5 2 1.5
v -0.5 2 0.5
v -0.5 3 1.5
v -0.5 3 0.5
v -0.5 3 -0.5
v -0.5 3 -1.5
v 0.5 0 0.5
v 0.5 0 -0.5
v 0.5 2 0.5
v 0.5 2 -0.5
v 0.5 4 -0.5
v 0.5 5 0.5
v 0.5 5 -0.5
v 0.5 6 0.5
v 0.5 6 -0.5
v 0.5 7 0.5
v 0.5 7 -0.5
v 0.5 11 0.5
v 0.5 11 -0.5
v 1.5 0 1.5
v 1.5 0 0.5
v 1.5 0 -0.5
v 1.5 0 -1.5
v 1.5 1 1.5
v 1.5 2 1.5
v 1.5 2 0.5
v 1.5 2 -0.5
v 1.5 2 -1.5
v 1.5 4 -0.5
v 1.5 4 -1.5
v 1.5 6 -0.5
v 1.5 6 -1.5
v 2.5 0 2.5
v 2.5 0 1.5
v 2.5 0 -1.5
v 2.5 0 -2.5
v 2.5 1 2.5
v 2.5 1 1.5
v 2.5 2 2.5
v 2.5 2 1.5
v 2.5 2 -2.5
v 2.5 3 2.5
v 2.5 3 1.5
v 2.5 3 -2.5
v 2.5 4 2.5
v 2.5 4 1.5
v 2.5 5 2.5
v 2.5 5 1.5
v 2.5 7 -1.5
v 2.5 7 -2.5
v 2.5 8 2.5
v 2.5 8 1.5
v 2.5 8 -1.5
v 2.5 8 -2.5
v 2.5 9 -1.5
v 2.5 9 -2.5
v 2.5 10 -1.5
v 2.5 10 -2.5
v 3.5 0 3.5
v 3.5 0 2.5
v 3.5 0 -2.5
v 3.5 0 -3.5
v 3.5 1 -3.5
v 3.5 2 -2.5
v 3.5 2 -3.5
v 3.5 3 3.5
v 3.5 3 2.5
v 3.5 3 -2.5
v 3.5 3 -3.5
v 4.5 0 4.5
v 4.5 0 3.5
v 4.5 0 -3.5
v 4.5 0 -4.5
v 4.5 1 4.5
v 4.5 1 -3.5
v 4.5 1 -4.5
v 4.5 2 -3.5
v 4.5 2 -4.5
v 4.5 5 4.5
v 4.5 5 3.5
v 4.5 5 -3.5
v 4.5 5 -4.5
v 4.5 6 4.5
v 4.5 6 3.5
v 5.5 0 5.5
v 5.5 0 4.5
v 5.5 0 -4.5
v 5.5 0 -5.5
v 5.5 1 5.5
v 5.5 1 4.5
v 5.5 1 -4.5
v 5.5 1 -5.5
v -5.5 0 5.5
v -5.5 1 5.5
v -5.5 2 5.5
v -4.5 0 5.5
v -4.5 1 5.5
v -4.5 2 5.5
v 4.5 0 5.5
v 4.5 1 5.5
v 5.5 0 5.5
v 5.5 1 5.5
v -4.5 0 4.5
v -4.5 1 4.5
v -4.5 2 4.5
v -4.5 3 4.5
v -4.5 4 4.5
v -4.5 5 4.5
v -3.5 0 4.5
v -3.5 3 4.5
v -3.5 4 4.5
v -3.5 5 4.5
v 3.5 0 4.5
v 3.5 5 4.5
v 3.5 6 4.5
v 4.5 0 4.5
v 4.5 1 4.5
v 4.5 5 4.5
v 4.5 6 4.5
v -3.5 0 3.5
v -3.5 3 3.5
v -2.5 0 3.5
v -2.5 3 3.5
v 2.5 0 3.5
v 2.5 3 3.5
v 3.5 0 3.5
v 3.5 3 3.5
v -2.5 0 2.5
v -2.5 3 2.5
v -2.5 4 2.5
v -2.5 6 2.5
v -1.5 0 2.5
v -1.5 4 2.5
v -1.5 6 2.5
v 1.5 0 2.5
v 1.5 1 2.5
v 1.5 2 2.5
v 1.5 3 2.5
v 1.5 4 2.5
v 1.5 5 2.5
v 1.5 8 2.5
v 2.5 0 2.5
v 2.5 1 2.5
v 2.5 2 2.5
v 2.5 3 2.5
v 2.5 4 2.5
v 2.5 5 2.5
v 2.5 8 2.5
v -1.5 0 1.5
v -1.5 1 1.5
v -1.5 2 1.5
v -1.5 3 1.5
v -0.5 0 1.5
v -0.5 1 1.5
v -0.5 2 1.5
v -0.5 3 1.5
v 0.5 0 1.5
v 0.5 2 1.5
v 1.5 0 1.5
v 1.5 1 1.5
v 1.5 2 1.5
v -0.5 0 0.5
v -0.5 1 0.5
v -0.5 2 0.5
v -0.5 3 0.5
v -0.5 5 0.5
v -0.5 6 0.5
v -0.5 7 0.5
v -0.5 11 0.5
v 0.5 0 0.5
v 0.5 2 0.5
v 0.5 5 0.5
v 0.5 6 0.5
v 0.5 7 0.5
v 0.5 11 0.5
v -1.5 0 -0.5
v -1.5 3 -0.5
v -0.5 0 -0.5
v -0.5 3 -0.5
v 0.5 0 -0.5
v 0.5 2 -0.5
v 0.5 4 -0.5
v 0.5 5 -0.5
v 0.5 6 -0.5
v 1.5 0 -0.5
v 1.5 2 -0.5
v 1.5 4 -0.5
v 1.5 6 -0.5
v -2.5 0 -1.5
v -2.5 7 -1.5
v -2.5 8 -1.5
v -2.5 9 -1.5
v -1.5 0 -1.5
v -1.5 3 -1.5
v -1.5 7 -1.5
v -1.5 8 -1.5
v -1.5 9 -1.5
v 1.5 0 -1.5
v 1.5 2 -1.5
v 1.5 4 -1.5
v 1.5 6 -1.5
v 1.5 7 -1.5
v 1.5 8 -1.5
v 1.5 9 -1.5
v 1.5 10 -1.5
v 2.5 0 -1.5
v 2.5 7 -1.5
v 2.5 8 -1.5
v 2.5 9 -1.5
v 2.5 10 -1.5
v -3.5 0 -2.5
v -3.5 1 -2.5
v -3.5 2 -2.5
v -2.5 0 -2.5
v -2.5 1 -2.5
v -2.5 2 -2.5
v 2.5 0 -2.5
v 2.5 2 -2.5
v 2.5 3 -2.5
v 3.5 0 -2.5
v 3.5 2 -2.5
v 3.5 3 -2.5
v -4.5 0 -3.5
v -4.5 4 -3.5
v -3.5 0 -3.5
v -3.5 1 -3.5
v -3.5 2 -3.5
v -3.5 4 -3.5
v 3.5 0 -3.5
v 3.5 1 -3.5
v 3.5 2 -3.5
v 3.5 3 -3.5
v 3.5 5 -3.5
v 4.5 0 -3.5
v 4.5 1 -3.5
v 4.5 2 -3.5
v 4.5 5 -3.5
v -5.5 0 -4.5
v -5.5 2 -4.5
v -4.5 0 -4.5
v -4.5 2 -4.5
v 4.5 0 -4.5
v 4.5 1 -4.5
v 5.5 0 -4.5
v 5.5 1 -4.5
v -5.5 0 4.5
v -5.5 1 4.5
v -5.5 2 4.5
v -4.5 0 4.5
v -4.5 1 4.5
v -4.5 2 4.5
v 4.5 0 4.5
v 4.5 1 4.5
v 5.5 0 4.5
v 5.5 1 4.5
v -4.5 0 3.5
v -4.5 3 3.5
v -4.5 4 3.5
v -4.5 5 3.5
v -3.5 0 3.5
v -3.5 3 3.5
v -3.5 4 3.5
v -3.5 5 3.5
v 3.5 0 3.5
v 3.5 3 3.5
v 3.5 5 3.5
v 3.5 6 3.5
v 4.5 0 3.5
v 4.5 5 3.5
v 4.5 6 3.5
v -3.5 0 2.5
v -3.5 3 2.5
v -2.5 0 2.5
v -2.5 3 2.5
v 2.5 0 2.5
v 2.5 1 2.5
v 2.5 2 2.5
v 2.5 3 2.5
v 3.5 0 2.5
v 3.5 3 2.5
v -2.5 0 1.5
v -2.5 4 1.5
v -2.5 6 1.5
v -1.5 0 1.5
v -1.5 1 1.5
v -1.5 2 1.5
v -1.5 3 1.5
v -1.5 4 1.5
v -1.5 6 1.5
v 1.5 0 1.5
v 1.5 1 1.5
v 1.5 2 1.5
v 1.5 3 1.5
v 1.5 4 1.5
v 1.5 5 1.5
v 1.5 8 1.5
v 2.5 0 1.5
v 2.5 1 1.5
v 2.5 2 1.5
v 2.5 3 1.5
v 2.5 4 1.5
v 2.5 5 1.5
v 2.5 8 1.5
v -1.5 0 0.5
v -1.5 1 0.5
v -1.5 2 0.5
v -1.5 3 0.5
v -0.5 0 0.5
v -0.5 1 0.5
v -0.5 2 0.5
v -0.5 3 0.5
v 0.5 0 0.5
v 0.5 2 0.5
v 1.5 0 0.5
v 1.5 2 0.5
v -0.5 0 -0.5
v -0.5 3 -0.5
v -0.5 5 -0.5
v -0.5 6 -0.5
v -0.5 7 -0.5
v -0.5 11 -0.5
v 0.5 0 -0.5
v 0.5 2 -0.5
v 0.5 4 -0.5
v 0.5 5 -0.5
v 0.5 6 -0.5
v 0.5 7 -0.5
v 0.5 11 -0.5
v -1.5 0 -1.5
v -1.5 3 -1.5
v -0.5 0 -1.5
v -0.5 3 -1.5
v 0.5 0 -1.5
v 0.5 2 -1.5
v 0.5 4 -1.5
v 0.5 6 -1.5
v 1.5 0 -1.5
v 1.5 2 -1.5
v 1.5 4 -1.5
v 1.5 6 -1.5
v -2.5 0 -2.5
v -2.5 1 -2.5
v -2.5 2 -2.5
v -2.5 7 -2.5
v -2.5 8 -2.5
v -2.5 9 -2.5
v -1.5 0 -2.5
v -1.5 7 -2.5
v -1.5 8 -2.5
v -1.5 9 -2.5
v 1.5 0 -2.5
v 1.5 7 -2.5
v 1.5 8 -2.5
v 1.5 9 -2.5
v 1.5 10 -2.5
v 2.5 0 -2.5
v 2.5 2 -2.5
v 2.5 3 -2.5
v 2.5 7 -2.5
v 2.5 8 -2.5
v 2.5 9 -2.5
v 2.5 10 -2.5
v -3.5 0 -3.5
v -3.5 1 -3.5
v -3.5 2 -3.5
v -2.5 0 -3.5
v -2.5 1 -3.5
v -2.5 2 -3.5
v 2.5 0 -3.5
v 2.5 2 -3.5
v 2.5 3 -3.5
v 3.5 0 -3.5
v 3.5 1 -3.5
v 3.5 2 -3.5
v 3.5 3 -3.5
v -4.5 0 -4.5
v -4.5 2 -4.5
v -4.5 4 -4.5
v -3.5 0 -4.5
v -3.5 4 -4.5
v 3.5 0 -4.5
v 3.5 1 -4.5
v 3.5 2 -4.5
v 3.5 5 -4.5
v 4.5 0 -4.5
v 4.5 1 -4.5
v 4.5 2 -4.5
v 4.5 5 -4.5
v -5.5 0 -5.5
v -5.5 2 -5.5
v -4.5 0 -5.5
v -4.5 2 -5.5
v 4.5 0 -5.5
v 4.5 1 -5.5
v 5.5 0 -5.5
v 5.5 1 -5.5
v -5.5 0 5.5
v -4.5 0 5.5
v 4.5 0 5.5
v 5.5 0 5.5
v -5.5 0 4.5
v -4.5 0 4.5
v -3.5 0 4.5
v 3.5 0 4.5
v 4.5 0 4.5
v 5.5 0 4.5
v -4.5 0 3.5
v -3.5 0 3.5
v -2.5 0 3.5
v 2.5 0 3.5
v 3.5 0 3.5
v 4.5 0 3.5
v -3.5 0 2.5
v -2.5 0 2.5
v -1.5 0 2.5
v 1.5 0 2.5
v 2.5 0 2.5
v 3.5 0 2.5
v -2.5 0 1.5
v -1.5 0 1.5
v -0.5 0 1.5
v 0.5 0 1.5
v 1.5 0 1.5
v 2.5 0 1.5
v -1.5 0 0.5
v -0.5 0 0.5
v 0.5 0 0.5
v 1.5 0 0.5
v -1.5 0 -0.5
v -0.5 0 -0.5
v 0.5 0 -0.5
v 1.5 0 -0.5
v -2.5 0 -1.5
v -1.5 0 -1.5
v -0.5 0 -1.5
v 0.5 0 -1.5
v 1.5 0 -1.5
v 2.5 0 -1.5
v -3.5 0 -2.5
v -2.5 0 -2.5
v -1.5 0 -2.5
v 1.5 0 -2.5
v 2.5 0 -2.5
v 3.5 0 -2.5
v -4.5 0 -3.5
v -3.5 0 -3.5
v -2.5 0 -3.5
v 2.5 0 -3.5
v 3.5 0 -3.5
v 4.5 0 -3.5
v -5.5 0 -4.5
v -4.5 0 -4.5
v -3.5 0 -4.5
v 3.5 0 -4.5
v 4.5 0 -4.5
v 5.5 0 -4.5
v -5.5 0 -5.5
v -4.5 0 -5.5
v 4.5 0 -5.5
v 5.5 0 -5.5
v 4.5 1 5.5
v 5.5 1 5.5
v 4.5 1 4.5
v 5.5 1 4.5
v 4.5 1 -4.5
v 5.5 1 -4.5
v 4.5 1 -5.5
v 5.5 1 -5.5
v -5.5 2 5.5
v -4.5 2 5.5
v -5.5 2 4.5
v -4.5 2 4.5
v 0.5 2 1.5
v 1.5 2 1.5
v 0.5 2 0.5
v 1.5 2 0.5
v -3.5 2 -2.5
v -2.5 2 -2.5
v -3.5 2 -3.5
v -2.5 2 -3.5
v -5.5 2 -4.5
v -4.5 2 -4.5
v -5.5 2 -5.5
v -4.5 2 -5.5
v -3.5 3 3.5
v -2.5 3 3.5
v 2.5 3 3.5
v 3.5 3 3.5
v -3.5 3 2.5
v -2.5 3 2.5
v 2.5 3 2.5
v 3.5 3 2.5
v -1.5 3 1.5
v -0.5 3 1.5
v -1.5 3 0.5
v -0.5 3 0.5
v -1.5 3 -0.5
v -0.5 3 -0.5
v -1.5 3 -1.5
v -0.5 3 -1.5
v 2.5 3 -2.5
v 3.5 3 -2.5
v 2.5 3 -3.5
v 3.5 3 -3.5
v -4.5 4 -3.5
v -3.5 4 -3.5
v -4.5 4 -4.5
v -3.5 4 -4.5
v -4.5 5 4.5
v -3.5 5 4.5
v -4.5 5 3.5
v -3.5 5 3.5
v 3.5 5 -3.5
v 4.5 5 -3.5
v 3.5 5 -4.5
v 4.5 5 -4.5
v 3.5 6 4.5
v 4.5 6 4.5
v 3.5 6 3.5
v 4.5 6 3.5
v -2.5 6 2.5
v -1.5 6 2.5
v -2.5 6 1.5
v -1.5 6 1.5
v 0.5 6 -0.5
v 1.5 6 -0.5
v 0.5 6 -1.5
v 1.5 6 -1.5
v 1.5 8 2.5
v 2.5 8 2.5
v 1.5 8 1.5
v 2.5 8 1.5
v -2.5 9 -1.5
v -1.5 9 -1.5
v -2.5 9 -2.5
v -1.5 9 -2.5
v 1.5 10 -1.5
v 2.5 10 -1.5
v 1.5 10 -2.5
v 2.5 10 -2.5
v -0.5 11 0.5
v 0.5 11 0.5
v -0.5 11 -0.5
v 0.5 11 -0.5

# faces
f 5/2/1 2/2/1 1/2/1
f 6/2/1 2/2/1 5/2/1
f 7/3/1 6/3/1 5/3/1
f 8/3/1 6/3/1 7/3/1
f 9/2/1 4/2/1 3/2/1
f 10/2/1 4/2/1 9/2/1
f 15/2/1 12/2/1 11/2/1
f 16/2/1 12/2/1 15/2/1
f 17/2/1 14/2/1 13/2/1
f 18/2/1 12/2/1 16/2/1
f 19/2/1 12/2/1 18/2/1
f 20/1/1 19/1/1 18/1/1
f 21/1/1 19/1/1 20/1/1
f 22/2/1 17/2/1 13/2/1
f 23/2/1 17/2/1 22/2/1
f 24/2/1 21/2/1 20/2/1
f 25/2/1 21/2/1 24/2/1
f 30/2/1 29/2/1 28/2/1
f 31/2/1 29/2/1 30/2/1
f 32/3/1 31/3/1 30/3/1
f 33/3/1 31/3/1 32/3/1
f 34/2/1 27/2/1 26/2/1
f 35/2/1 27/2/1 34/2/1
f 40/2/1 39/2/1 38/2/1
f 41/2/1 40/2/1 38/2/1
f 42/2/1 37/2/1 36/2/1
f 43/2/1 37/2/1 42/2/1
f 44/2/1 37/2/1 43/2/1
f 45/3/1 44/3/1 43/3/1
f 46/3/1 44/3/1 45/3/1
f 47/2/1 41/2/1 38/2/1
f 48/2/1 41/2/1 47/2/1
f 49/1/1 48/1/1 47/1/1
f 50/1/1 48/1/1 49/1/1
f 51/2/1 50/2/1 49/2/1
f 52/2/1 50/2/1 51/2/1
f 57/3/1 54/3/1 53/3/1
f 58/3/1 54/3/1 57/3/1
f 59/2/1 58/2/1 57/2/1
f 60/2/1 58/2/1 59/2/1
f 61/1/1 60/1/1 59/1/1
f 62/1/1 60/1/1 61/1/1
f 63/2/1 56/2/1 55/2/1
f 64/2/1 56/2/1 63/2/1
f 67/2/1 66/2/1 65/2/1
f 68/2/1 66/2/1 67/2/1
f 69/2/1 66/2/1 68/2/1
f 70/2/1 66/2/1 69/2/1
f 71/2/1 70/2/1 69/2/1
f 72/2/1 70/2/1 71/2/1
f 73/1/1 72/1/1 71/1/1
f 74/1/1 72/1/1 73/1/1
f 75/3/1 74/3/1 73/3/1
f 76/3/1 74/3/1 75/3/1
f 77/2/1 76/2/1 75/2/1
f 78/2/1 76/2/1 77/2/1
f 83/2/1 80/2/1 79/2/1
f 84/2/1 80/2/1 83/2/1
f 85/2/1 82/2/1 81/2/1
f 86/2/1 82/2/1 85/2/1
f 87/1/1 86/1/1 85/1/1
f 88/1/1 86/1/1 87/1/1
f 89/2/1 88/2/1 87/2/1
f 90/2/1 88/2/1 89/2/1
f 91/2/1 88/2/1 90/2/1
f 96/2/1 93/2/1 92/2/1
f 97/2/1 93/2/1 96/2/1
f 98/1/1 97/1/1 96/1/1
f 99/1/1 97/1/1 98/1/1
f 100/2/1 95/2/1 94/2/1
f 101/2/1 99/2/1 98/2/1
f 102/2/1 99/2/1 101/2/1
f 103/3/1 102/3/1 101/3/1
f 104/3/1 102/3/1 103/3/1
f 105/2/1 95/2/1 100/2/1
f 106/1/1 104/1/1 103/1/1
f 107/1/1 104/1/1 106/1/1
f 108/2/1 95/2/1 105/2/1
f 109/2/1 95/2/1 108/2/1
f 110/2/1 95/2/1 109/2/1
f 111/2/1 107/2/1 106/2/1
f 112/2/1 107/2/1 111/2/1
f 113/3/1 110/3/1 109/3/1
f 114/3/1 110/3/1 113/3/1
f 115/1/1 114/1/1 113/1/1
f 116/1/1 114/1/1 115/1/1
f 117/2/1 116/2/1 115/2/1
f 118/2/1 116/2/1 117/2/1
f 123/2/1 120/2/1 119/2/1
f 124/2/1 123/2/1 119/2/1
f 125/2/1 122/2/1 121/2/1
f 126/2/1 122/2/1 125/2/1
f 127/2/1 124/2/1 119/2/1
f 128/2/1 124/2/1 127/2/1
f 129/3/1 126/3/1 125/3/1
f 130/3/1 126/3/1 129/3/1
f 135/2/1 134/2/1 133/2/1
f 136/2/1 134/2/1 135/2/1
f 137/3/1 136/3/1 135/3/1
f 138/3/1 136/3/1 137/3/1
f 139/2/1 132/2/1 131/2/1
f 140/2/1 138/2/1 137/2/1
f 141/2/1 139/2/1 131/2/1
f 142/2/1 139/2/1 141/2/1
f 143/2/1 138/2/1 140/2/1
f 144/2/1 138/2/1 143/2/1
f 145/1/1 142/1/1 141/1/1
f 146/1/1 142/1/1 145/1/1
f 151/2/1 148/2/1 147/2/1
f 152/2/1 148/2/1 151/2/1
f 153/2/1 150/2/1 149/2/1
f 154/2/1 150/2/1 153/2/1
f 155/2/2 156/2/2 159/2/2
f 159/2/2 156/2/2 160/2/2
f 159/3/2 160/3/2 161/3/2
f 161/3/2 160/3/2 162/3/2
f 157/2/2 158/2/2 163/2/2
f 163/2/2 158/2/2 164/2/2
f 167/2/2 168/2/2 169/2/2
f 169/2/2 168/2/2 170/2/2
f 165/2/2 166/2/2 171/2/2
f 171/2/2 166/2/2 172/2/2
f 171/1/2 172/1/2 173/1/2
f 173/1/2 172/1/2 174/1/2
f 170/2/2 168/2/2 175/2/2
f 175/2/2 168/2/2 176/2/2
f 173/2/2 174/2/2 177/2/2
f 177/2/2 174/2/2 178/2/2
f 181/2/2 182/2/2 183/2/2
f 183/2/2 182/2/2 184/2/2
f 183/3/2 184/3/2 185/3/2
f 185/3/2 184/3/2 186/3/2
f 179/2/2 180/2/2 187/2/2
f 187/2/2 180/2/2 188/2/2
f 189/2/2 190/2/2 193/2/2
f 189/2/2 193/2/2 194/2/2
f 189/2/2 194/2/2 195/2/2
f 191/2/2 192/2/2 196/2/2
f 189/2/2 195/2/2 197/2/2
f 197/2/2 195/2/2 198/2/2
f 197/3/2 198/3/2 199/3/2
f 199/3/2 198/3/2 200/3/2
f 196/2/2 192/2/2 201/2/2
f 201/2/2 192/2/2 202/2/2
f 201/1/2 202/1/2 203/1/2
f 203/1/2 202/1/2 204/1/2
f 203/2/2 204/2/2 205/2/2
f 205/2/2 204/2/2 206/2/2
f 207/3/2 208/3/2 211/3/2
f 211/3/2 208/3/2 212/3/2
f 211/2/2 212/2/2 213/2/2
f 213/2/2 212/2/2 214/2/2
f 213/1/2 214/1/2 215/1/2
f 215/1/2 214/1/2 216/1/2
f 209/2/2 210/2/2 217/2/2
f 217/2/2 210/2/2 218/2/2
f 219/2/2 220/2/2 221/2/2
f 221/2/2 220/2/2 222/2/2
f 221/2/2 222/2/2 223/2/2
f 221/2/2 223/2/2 224/2/2
f 224/2/2 223/2/2 225/2/2
f 224/1/2 225/1/2 226/1/2
f 226/1/2 225/1/2 227/1/2
f 226/3/2 227/3/2 228/3/2
f 228/3/2 227/3/2 229/3/2
f 228/2/2 229/2/2 230/2/2
f 230/2/2 229/2/2 231/2/2
f 232/2/2 233/2/2 236/2/2
f 236/2/2 233/2/2 237/2/2
f 237/2/2 233/2/2 238/2/2
f 234/2/2 235/2/2 239/2/2
f 239/2/2 235/2/2 240/2/2
f 239/1/2 240/1/2 241/1/2
f 241/1/2 240/1/2 242/1/2
f 241/2/2 242/2/2 243/2/2
f 243/2/2 242/2/2 244/2/2
f 245/2/2 246/2/2 249/2/2
f 249/2/2 246/2/2 250/2/2
f 249/1/2 250/1/2 251/1/2
f 251/1/2 250/1/2 252/1/2
f 247/2/2 248/2/2 253/2/2
f 251/2/2 252/2/2 254/2/2
f 254/2/2 252/2/2 255/2/2
f 247/2/2 253/2/2 256/2/2
f 254/3/2 255/3/2 257/3/2
f 257/3/2 255/3/2 258/3/2
f 257/1/2 258/1/2 259/1/2
f 259/1/2 258/1/2 260/1/2
f 247/2/2 256/2/2 261/2/2
f 261/2/2 256/2/2 262/2/2
f 259/2/2 260/2/2 263/2/2
f 263/2/2 260/2/2 264/2/2
f 261/3/2 262/3/2 265/3/2
f 265/3/2 262/3/2 266/3/2
f 265/1/2 266/1/2 267/1/2
f 267/1/2 266/1/2 268/1/2
f 267/2/2 268/2/2 269/2/2
f 269/2/2 268/2/2 270/2/2
f 273/2/2 274/2/2 275/2/2
f 273/2/2 275/2/2 276/2/2
f 276/2/2 275/2/2 277/2/2
f 271/2/2 272/2/2 278/2/2
f 278/2/2 272/2/2 279/2/2
f 276/3/2 277/3/2 280/3/2
f 280/3/2 277/3/2 281/3/2
f 282/2/2 283/2/2 286/2/2
f 284/2/2 285/2/2 287/2/2
f 287/2/2 285/2/2 288/2/2
f 287/3/2 288/3/2 289/3/2
f 289/3/2 288/3/2 290/3/2
f 286/2/2 283/2/2 291/2/2
f 291/2/2 283/2/2 292/2/2
f 289/2/2 290/2/2 293/2/2
f 293/2/2 290/2/2 294/2/2
f 291/1/2 292/1/2 295/1/2
f 295/1/2 292/1/2 296/1/2
f 297/2/2 298/2/2 301/2/2
f 301/2/2 298/2/2 302/2/2
f 299/2/2 300/2/2 303/2/2
f 303/2/2 300/2/2 304/2/2
f 308/2/3 306/2/3 305/2/3
f 309/3/3 307/3/3 306/3/3
f 309/2/3 306/2/3 308/2/3
f 310/3/3 307/3/3 309/3/3
f 313/2/3 312/2/3 311/2/3
f 314/2/3 312/2/3 313/2/3
f 321/2/3 316/2/3 315/2/3
f 321/2/3 317/2/3 316/2/3
f 321/2/3 318/2/3 317/2/3
f 322/1/3 319/1/3 318/1/3
f 322/2/3 318/2/3 321/2/3
f 323/2/3 320/2/3 319/2/3
f 323/1/3 319/1/3 322/1/3
f 324/2/3 320/2/3 323/2/3
f 328/2/3 326/2/3 325/2/3
f 329/2/3 326/2/3 328/2/3
f 330/1/3 327/1/3 326/1/3
f 330/2/3 326/2/3 329/2/3
f 331/1/3 327/1/3 330/1/3
f 334/2/3 333/2/3 332/2/3
f 335/2/3 333/2/3 334/2/3
f 338/2/3 337/2/3 336/2/3
f 339/2/3 337/2/3 338/2/3
f 344/2/3 341/2/3 340/2/3
f 344/2/3 342/2/3 341/2/3
f 345/3/3 343/3/3 342/3/3
f 345/2/3 342/2/3 344/2/3
f 346/3/3 343/3/3 345/3/3
f 354/2/3 348/2/3 347/2/3
f 355/1/3 349/1/3 348/1/3
f 355/2/3 348/2/3 354/2/3
f 356/2/3 350/2/3 349/2/3
f 356/1/3 349/1/3 355/1/3
f 357/3/3 351/3/3 350/3/3
f 357/2/3 350/2/3 356/2/3
f 358/1/3 352/1/3 351/1/3
f 358/3/3 351/3/3 357/3/3
f 359/2/3 353/2/3 352/2/3
f 359/1/3 352/1/3 358/1/3
f 360/2/3 353/2/3 359/2/3
f 365/3/3 362/3/3 361/3/3
f 366/2/3 363/2/3 362/2/3
f 366/3/3 362/3/3 365/3/3
f 367/1/3 364/1/3 363/1/3
f 367/2/3 363/2/3 366/2/3
f 368/1/3 364/1/3 367/1/3
f 371/2/3 370/2/3 369/2/3
f 372/2/3 370/2/3 371/2/3
f 373/2/3 370/2/3 372/2/3
f 382/2/3 375/2/3 374/2/3
f 382/2/3 376/2/3 375/2/3
f 382/2/3 377/2/3 376/2/3
f 382/2/3 378/2/3 377/2/3
f 383/2/3 378/2/3 382/2/3
f 384/1/3 379/1/3 378/1/3
f 384/2/3 378/2/3 383/2/3
f 385/3/3 380/3/3 379/3/3
f 385/1/3 379/1/3 384/1/3
f 386/2/3 381/2/3 380/2/3
f 386/3/3 380/3/3 385/3/3
f 387/2/3 381/2/3 386/2/3
f 390/2/3 389/2/3 388/2/3
f 391/2/3 389/2/3 390/2/3
f 397/2/3 393/2/3 392/2/3
f 398/1/3 394/1/3 393/1/3
f 398/2/3 393/2/3 397/2/3
f 399/2/3 396/2/3 395/2/3
f 399/1/3 394/1/3 398/1/3
f 399/2/3 395/2/3 394/2/3
f 400/2/3 396/2/3 399/2/3
f 405/2/3 402/2/3 401/2/3
f 406/2/3 402/2/3 405/2/3
f 407/1/3 403/1/3 402/1/3
f 407/2/3 402/2/3 406/2/3
f 408/2/3 404/2/3 403/2/3
f 408/1/3 403/1/3 407/1/3
f 409/2/3 404/2/3 408/2/3
f 418/2/3 411/2/3 410/2/3
f 418/2/3 412/2/3 411/2/3
f 418/2/3 413/2/3 412/2/3
f 418/2/3 414/2/3 413/2/3
f 419/3/3 415/3/3 414/3/3
f 419/2/3 414/2/3 418/2/3
f 420/1/3 416/1/3 415/1/3
f 420/3/3 415/3/3 419/3/3
f 421/2/3 417/2/3 416/2/3
f 421/1/3 416/1/3 420/1/3
f 422/2/3 417/2/3 421/2/3
f 426/2/3 424/2/3 423/2/3
f 427/3/3 425/3/3 424/3/3
f 427/2/3 424/2/3 426/2/3
f 428/3/3 425/3/3 427/3/3
f 432/2/3 430/2/3 429/2/3
f 433/3/3 431/3/3 430/3/3
f 433/2/3 430/2/3 432/2/3
f 434/3/3 431/3/3 433/3/3
f 437/2/3 436/2/3 435/2/3
f 438/2/3 436/2/3 437/2/3
f 439/2/3 436/2/3 438/2/3
f 440/2/3 436/2/3 439/2/3
f 446/2/3 442/2/3 441/2/3
f 447/3/3 443/3/3 442/3/3
f 447/2/3 442/2/3 446/2/3
f 448/2/3 444/2/3 443/2/3
f 448/3/3 443/3/3 447/3/3
f 448/2/3 445/2/3 444/2/3
f 449/2/3 445/2/3 448/2/3
f 452/2/3 451/2/3 450/2/3
f 453/2/3 451/2/3 452/2/3
f 456/2/3 455/2/3 454/2/3
f 457/2/3 455/2/3 456/2/3
f 458/2/4 459/2/4 461/2/4
f 459/3/4 460/3/4 462/3/4
f 461/2/4 459/2/4 462/2/4
f 462/3/4 460/3/4 463/3/4
f 464/2/4 465/2/4 466/2/4
f 466/2/4 465/2/4 467/2/4
f 468/2/4 469/2/4 472/2/4
f 469/1/4 470/1/4 473/1/4
f 472/2/4 469/2/4 473/2/4
f 470/2/4 471/2/4 474/2/4
f 473/1/4 470/1/4 474/1/4
f 474/2/4 471/2/4 475/2/4
f 477/2/4 478/2/4 480/2/4
f 476/2/4 477/2/4 480/2/4
f 478/1/4 479/1/4 481/1/4
f 480/2/4 478/2/4 481/2/4
f 481/1/4 479/1/4 482/1/4
f 483/2/4 484/2/4 485/2/4
f 485/2/4 484/2/4 486/2/4
f 487/2/4 488/2/4 491/2/4
f 489/2/4 490/2/4 491/2/4
f 488/2/4 489/2/4 491/2/4
f 491/2/4 490/2/4 492/2/4
f 493/2/4 494/2/4 496/2/4
f 496/2/4 494/2/4 497/2/4
f 497/2/4 494/2/4 498/2/4
f 498/2/4 494/2/4 499/2/4
f 494/3/4 495/3/4 500/3/4
f 499/2/4 494/2/4 500/2/4
f 500/3/4 495/3/4 501/3/4
f 502/2/4 503/2/4 509/2/4
f 503/1/4 504/1/4 510/1/4
f 509/2/4 503/2/4 510/2/4
f 504/2/4 505/2/4 511/2/4
f 510/1/4 504/1/4 511/1/4
f 505/3/4 506/3/4 512/3/4
f 511/2/4 505/2/4 512/2/4
f 506/1/4 507/1/4 513/1/4
f 512/3/4 506/3/4 513/3/4
f 507/2/4 508/2/4 514/2/4
f 513/1/4 507/1/4 514/1/4
f 514/2/4 508/2/4 515/2/4
f 516/3/4 517/3/4 520/3/4
f 517/2/4 518/2/4 521/2/4
f 520/3/4 517/3/4 521/3/4
f 518/1/4 519/1/4 522/1/4
f 521/2/4 518/2/4 522/2/4
f 522/1/4 519/1/4 523/1/4
f 524/2/4 525/2/4 526/2/4
f 526/2/4 525/2/4 527/2/4
f 528/2/4 529/2/4 534/2/4
f 529/2/4 530/2/4 534/2/4
f 534/2/4 530/2/4 535/2/4
f 535/2/4 530/2/4 536/2/4
f 530/1/4 531/1/4 537/1/4
f 536/2/4 530/2/4 537/2/4
f 531/3/4 532/3/4 538/3/4
f 537/1/4 531/1/4 538/1/4
f 532/2/4 533/2/4 539/2/4
f 538/3/4 532/3/4 539/3/4
f 539/2/4 533/2/4 540/2/4
f 541/2/4 542/2/4 543/2/4
f 543/2/4 542/2/4 544/2/4
f 545/2/4 546/2/4 549/2/4
f 546/1/4 547/1/4 550/1/4
f 549/2/4 546/2/4 550/2/4
f 547/2/4 548/2/4 551/2/4
f 550/1/4 547/1/4 551/1/4
f 551/2/4 548/2/4 552/2/4
f 553/2/4 554/2/4 559/2/4
f 554/2/4 555/2/4 559/2/4
f 555/2/4 556/2/4 559/2/4
f 556/1/4 557/1/4 560/1/4
f 559/2/4 556/2/4 560/2/4
f 557/2/4 558/2/4 561/2/4
f 560/1/4 557/1/4 561/1/4
f 561/2/4 558/2/4 562/2/4
f 563/2/4 564/2/4 568/2/4
f 568/2/4 564/2/4 569/2/4
f 569/2/4 564/2/4 570/2/4
f 564/3/4 565/3/4 571/3/4
f 570/2/4 564/2/4 571/2/4
f 565/1/4 566/1/4 572/1/4
f 571/3/4 565/3/4 572/3/4
f 566/2/4 567/2/4 573/2/4
f 572/1/4 566/1/4 573/1/4
f 573/2/4 567/2/4 574/2/4
f 575/2/4 576/2/4 578/2/4
f 576/3/4 577/3/4 579/3/4
f 578/2/4 576/2/4 579/2/4
f 579/3/4 577/3/4 580/3/4
f 581/2/4 582/2/4 584/2/4
f 584/2/4 582/2/4 585/2/4
f 582/3/4 583/3/4 586/3/4
f 585/2/4 582/2/4 586/2/4
f 586/3/4 583/3/4 587/3/4
f 588/2/4 589/2/4 591/2/4
f 589/2/4 590/2/4 591/2/4
f 591/2/4 590/2/4 592/2/4
f 593/2/4 594/2/4 597/2/4
f 594/3/4 595/3/4 598/3/4
f 597/2/4 594/2/4 598/2/4
f 595/2/4 596/2/4 599/2/4
f 598/3/4 595/3/4 599/3/4
f 599/2/4 596/2/4 600/2/4
f 601/2/4 602/2/4 603/2/4
f 603/2/4 602/2/4 604/2/4
f 605/2/4 606/2/4 607/2/4
f 607/2/4 606/2/4 608/2/4
f 613/2/5 610/2/5 609/2/5
f 614/2/5 610/2/5 613/2/5
f 617/2/5 612/2/5 611/2/5
f 618/2/5 612/2/5 617/2/5
f 619/2/5 615/2/5 614/2/5
f 620/2/5 615/2/5 619/2/5
f 623/2/5 617/2/5 616/2/5
f 624/2/5 617/2/5 623/2/5
f 625/2/5 621/2/5 620/2/5
f 626/2/5 621/2/5 625/2/5
f 629/2/5 623/2/5 622/2/5
f 630/2/5 623/2/5 629/2/5
f 631/2/5 627/2/5 626/2/5
f 632/2/5 627/2/5 631/2/5
f 635/2/5 629/2/5 628/2/5
f 636/2/5 629/2/5 635/2/5
f 637/3/5 633/3/5 632/3/5
f 638/3/5 633/3/5 637/3/5
f 639/2/5 635/2/5 634/2/5
f 640/2/5 635/2/5 639/2/5
f 642/2/5 639/2/5 638/2/5
f 643/2/5 639/2/5 642/2/5
f 646/2/5 642/2/5 641/2/5
f 647/2/5 642/2/5 646/2/5
f 648/2/5 644/2/5 643/2/5
f 649/2/5 644/2/5 648/2/5
f 652/2/5 646/2/5 645/2/5
f 653/2/5 646/2/5 652/2/5
f 654/2/5 650/2/5 649/2/5
f 655/2/5 650/2/5 654/2/5
f 658/2/5 652/2/5 651/2/5
f 659/2/5 652/2/5 658/2/5
f 660/2/5 656/2/5 655/2/5
f 661/2/5 656/2/5 660/2/5
f 664/2/5 658/2/5 657/2/5
f 665/2/5 658/2/5 664/2/5
f 666/2/5 662/2/5 661/2/5
f 667/2/5 662/2/5 666/2/5
f 669/2/5 664/2/5 663/2/5
f 670/2/5 664/2/5 669/2/5
f 671/2/5 668/2/5 667/2/5
f 672/2/5 668/2/5 671/2/5
f 673/2/6 674/2/6 675/2/6
f 675/2/6 674/2/6 676/2/6
f 677/2/6 678/2/6 679/2/6
f 679/2/6 678/2/6 680/2/6
f 681/3/6 682/3/6 683/3/6
f 683/3/6 682/3/6 684/3/6
f 685/2/6 686/2/6 687/2/6
f 687/2/6 686/2/6 688/2/6
f 689/3/6 690/3/6 691/3/6
f 691/3/6 690/3/6 692/3/6
f 693/2/6 694/2/6 695/2/6
f 695/2/6 694/2/6 696/2/6
f 697/2/6 698/2/6 701/2/6
f 701/2/6 698/2/6 702/2/6
f 699/2/6 700/2/6 703/2/6
f 703/2/6 700/2/6 704/2/6
f 705/1/6 706/1/6 707/1/6
f 707/1/6 706/1/6 708/1/6
f 709/2/6 710/2/6 711/2/6
f 711/2/6 710/2/6 712/2/6
f 713/3/6 714/3/6 715/3/6
f 715/3/6 714/3/6 716/3/6
f 717/2/6 718/2/6 719/2/6
f 719/2/6 718/2/6 720/2/6
f 721/2/6 722/2/6 723/2/6
f 723/2/6 722/2/6 724/2/6
f 725/2/6 726/2/6 727/2/6
f 727/2/6 726/2/6 728/2/6
f 729/1/6 730/1/6 731/1/6
f 731/1/6 730/1/6 732/1/6
f 733/3/6 734/3/6 735/3/6
f 735/3/6 734/3/6 736/3/6
f 737/2/6 738/2/6 739/2/6
f 739/2/6 738/2/6 740/2/6
f 741/2/6 742/2/6 743/2/6
f 743/2/6 742/2/6 744/2/6
f 745/2/6 746/2/6 747/2/6
f 747/2/6 746/2/6 748/2/6
f 749/2/6 750/2/6 751/2/6
f 751/2/6 750/2/6 752/2/6
f 753/2/6 754/2/6 755/2/6
f 755/2/6 754/2/6 756/2/6
