^C:\USERS\SHEES\SOURCE\REPOS\HELLO VFTSH!!\HELLO VFTSH!!\HELLO VFTSH!!.CPP
C:\USERS\SHEES\SOURCE\REPOS\HELLO VFTSH!!\HELLO VFTSH!!\DEBUG\VC142.PDB
C:\USERS\SHEES\SOURCE\REPOS\HELLO VFTSH!!\HELLO VFTSH!!\DEBUG\VC142.IDB
C:\USERS\SHEES\SOURCE\REPOS\HELLO VFTSH!!\HELLO VFTSH!!\DEBUG\HELLO VFTSH!!.OBJ
