{
  "segment": ["fashion", "jewelry"],
  "report": true,
  "dev": true,
  "favicons": [16, 32, 48, 57, 64, 72, 120],
  "templates": {
    "header": {
      "modules": [
        {
          "name": "header",
          "lang": {
            "default": "ptbr",
            "ptbr": {
            },
            "enus": {
            }
          },
          "areas": [
            {
              "name": "top",
              "float": false,
              "modifiers": [ "tipbar" ],
              "container": false,
              "modules": [
                {
                  "name": "tipbar"
                }
              ]
            },
            {
              "name": "middle",
              "modifiers": [ ],
              "float": true,
              "container": true,
              "modules": [
                {
                  "name": "logo"
                },
                {
                  "name": "search"
                },
                {
                  "name": "user"
                },
                {
                  "name": "minicart"
                }
              ]
            },
            {
              "name": "bottom",
              "modifiers": [ ],
              "float": true,
              "container": true,
              "modules": [
                {
                  "name": "menu"
                }
              ]
            }
          ]
        }
      ]
    },
    "footer": {
      "modules": []
    }
  },
  "layouts": {
    "default": {
      "head": [],
      "header": {
        "templates": [
          "header"
        ],
        "modules": []
      },
      "footer": {
        "templates": [
          "footer"
        ],
        "modules": []
      }
    },
    "secure": {
      "header": {
        "modules": [

        ]
      },
      "footer": {
        "modules": [

        ]
      }
    }
  },
  "showcases": [],
  "pages": {
    "home": {
      "layout": "default",
      "modifiers": ["devs"],
      "areas": [{
          "modifiers": ["primeira"],
          "container": true,
          "title": "Título area 1",
          "modules": [
            {
              "name": "banner",
              "id": "TV",
              "types": ["fullwidth", "fullheight", "caption"],
              "slides": {
                "small": 1,
                "medium": 1,
                "large": 1
              },
              "items": [
                {
                  "image": "",
                  "width": 1920,
                  "height": 1080,
                  "text": "banner tv center middle #cm#"
                }
              ]
            }
          ]
        },
        {
          "modifiers": ["segunda"],
          "container": false,
          "templates": [],
          "title": "Título area 2",
          "modules": [
            {
              "name": "banner",
              "id": "Mosaic",
              "types": ["groupwidth"],
              "slides": {
                "small": 0,
                "medium": 0,
                "large": 0
              },
              "items": [
                {
                  "image": "",
                  "width": 800,
                  "height": 600,
                  "text": "group hero top center #tc#"
                },
                {
                  "image": "",
                  "width": 200,
                  "height": 400,
                  "text": "group 1 top left #tl#"
                },
                {
                  "image": "",
                  "width": 400,
                  "height": 400,
                  "text": "group 2 middle center #cm#"
                },
                {
                  "image": "",
                  "width": 200,
                  "height": 400,
                  "text": "group 3 bottom right #rb#"
                }
              ]
            }
          ]
        }
      ]
    },
    "product": {
      "layout": "default",
      "head": [],
      "areas": [{
          "modifiers": [],
          "container": true,
          "modules": []
        },
        {
          "modifiers": [],
          "container": true,
          "templates": [],
          "modules": []
        }
      ]
    }
  },
  "style": {
    "breakpoint": {
      "small": {
        "min": "320px",
        "max": "767px"
      },
      "medium": {
        "min": "768px",
        "max": "1024px"
      },
      "large": {
        "min": "1025px",
        "max": "1920px"
      }
    },
    "container": {
      "max": "1366px",
      "space": {
        "sm": "10px",
        "md": "15px",
        "lg": "12px"
      }
    },
    "grid": 12,
    "color": {
      "black": "#000000",
      "white": "#ffffff",
      "theme": "#bdbdbd",
      "gray": {
        "lightest": "#f0f0f0",
        "lighter": "#f0f0f0",
        "light": "#e0e0e0",
        "": "#bdbdbd",
        "dark": "#828282",
        "darker": "#828282",
        "darkest": "#828282"
      },
      "status": {
        "success": "#00ff00",
        "info": "#0000ff",
        "warning": "#ffcc88",
        "error": "#00ff00"
      },
      "": [{
          "lightest": "#f0f0f0",
          "lighter": "#f0f0f0",
          "light": "#e0e0e0",
          "": "#bdbdbd",
          "dark": "#828282",
          "darker": "#828282",
          "darkest": "#828282"
        },
        {
          "lightest": "#f0f0f0",
          "lighter": "#f0f0f0",
          "light": "#e0e0e0",
          "": "#bdbdbd",
          "dark": "#828282",
          "darker": "#828282",
          "darkest": "#828282"
        },
        {
          "lightest": "#f0f0f0",
          "lighter": "#f0f0f0",
          "light": "#e0e0e0",
          "": "#bdbdbd",
          "dark": "#828282",
          "darker": "#828282",
          "darkest": "#828282"
        }
      ]
    },
    "font": {
      "color": "#000000",
      "space": "0.015px",
      "size": {
        "action": {
          "sm": {
            "small": "10px",
            "medium": "12px",
            "large": "14px"
          },
          "md": {
            "small": "10px",
            "medium": "12px",
            "large": "14px"
          },
          "lg": {
            "small": "12px",
            "medium": "14px",
            "large": "16px"
          }
        },
        "default": {
          "sm": {
            "small": "10px",
            "medium": "12px",
            "large": "14px"
          },
          "md": {
            "small": "10px",
            "medium": "12px",
            "large": "14px"
          },
          "lg": {
            "small": "10px",
            "medium": "12px",
            "large": "14px"
          }
        },
        "impact": {
          "xs": {
            "small": "12px",
            "medium": "14px",
            "large": "16px"
          },
          "sm": {
            "small": "12px",
            "medium": "14px",
            "large": "16px"
          },
          "md": {
            "small": "14px",
            "medium": "16px",
            "large": "18px"
          },
          "lg": {
            "small": "16px",
            "medium": "18px",
            "large": "20px"
          },
          "xl": {
            "small": "16px",
            "medium": "18px",
            "large": "20px"
          }
        }
      },
      "type": [{
          "name": "'Open Sans'",
          "fallback": "-apple-system, BlinkMacSystemFont, 'Segoe UI', Helvetica, Arial, sans-serif, 'Apple Color Emoji', 'Segoe UI Emoji', 'Segoe UI Symbol'",
          "weight": {
            "light": 100,
            "normal": 400,
            "semibold": 600,
            "bold": 700,
            "bolder": 900
          },
          "_files": [{
            "weight": 100,
            "style": "normal",
            "src": "/arquivos/VAGRounded-Thin.eot.css",
            "formats": {
              "embedded-opentype": "/arquivos/VAGRounded-Thin.eot.css?#iefix",
              "woff": "/arquivos/VAGRounded-Thin.woff.css",
              "woff2": "/arquivos/VAGRounded-Thin.woff2.css",
              "truetype": "/arquivos/VAGRounded-Thin.ttf.css",
              "svg": "/arquivos/VAGRounded-Thin.svg.css#VAGRounded-Thin"
            }
          }]
        },
        {
          "name": "'Nunito'",
          "_href": "https://fonts.googleapis.com/css?family=Nunito:400,500,700,800",
          "fallback": "-apple-system, BlinkMacSystemFont, 'Segoe UI', Helvetica, Arial, sans-serif, 'Apple Color Emoji', 'Segoe UI Emoji', 'Segoe UI Symbol'",
          "weight": {
            "light": 100,
            "normal": 400,
            "semibold": 600,
            "bold": 700,
            "bolder": 800
          }
        }
      ]
    },
    "space": {
      "xs": {
        "small": "2.5px",
        "medium": "5px",
        "large": "5px"
      },
      "sm": {
        "small": "10px",
        "medium": "10px",
        "large": "10px"
      },
      "md": {
        "small": "15px",
        "medium": "15px",
        "large": "20px"
      },
      "lg": {
        "small": "20px",
        "medium": "25px",
        "large": "30px"
      },
      "xl": {
        "small": "25px",
        "medium": "30px",
        "large": "60px"
      }
    },
    "transition": {
      "animation": "linear",
      "duration": {
        "fast": "0.15s",
        "normal": "0.3s",
        "slow": "0.6s"
      }
    },
    "overlay": {
      "color": "#000000",
      "opacity": "0.7"
    }
  }
}