{
  "type": "service_account",
  "project_id": "tablabreplica",
  "private_key_id": "927471f1549af5fc065cb0d863fa1543fad7218a",
  "private_key": "-----BEGIN PRIVATE KEY-----\nMIIEvgIBADANBgkqhkiG9w0BAQEFAASCBKgwggSkAgEAAoIBAQDn9z3Jrm9Y7Ss2\nGQJf6Q9FIsKL+QEXq4J727InqqY4f3iy41wrEfB8N58QjkCqL/GHjzTw0+trnz5J\nnFtkZuwf+tnZKRtOEH8HVtwR6wjXK06KmEQ/To9NEg3ts2s6Fcvj0zGoB0jzAXig\n3ybzAPY2iu6kD6XXDijoh3oINDNvKEDduuMZAJf31JV6lvVJhNmH2RqkpjqNxdCu\neyX9N2iFLlL3NeS5jPveIfyBjh/WTG/26FN/2bYjFjXXGGQ1f+PLLRRC0qSW0/3R\nMyk+tAs8f4yyot0CRV2r2ihM/LPU3Y/tYnUb5PXQBOYozJUY3QFB1DLXWJMGYfnk\nZPayM8/xAgMBAAECggEAWPLPQCeB7gUf5UIozXNWlimylS76EsQDKJCBm8FNtOt4\ncoxJewCJiXBgr94EgN4ajWNGJzT0GNQ688ofp3vp/odYAvRG0qPzufI+OCa6wJuM\nJgwmW2o5/BE4wxXiP6c9BFMnPunwOLKvOWzoiBUt1JNo2ANiEfmNiUDt8/hkYrI/\nX6YZ7X2+ILFljHPZ/3GjeuTa8q1WiolVYEs4tT7V1QnQN1NgRiXxDRNcw7BfBLB0\n9c0dvki8vLu+0OUUFm0665+/qXjrzQQ0b54QIdHv8I/irPVErWT5bQuCdZPt5ci9\n+O9XDwJexJTcMoUEBLoO7ve5LtXCZd+3xLFzAzGNWwKBgQD5tEfAtqZ8SDEoG//V\nnpw/EvWlfU/GeF88H5XFKU4mT+hy1QrjhX+4jH5FxxvmLI6TbqsTfLcGYAQFCPuS\nONDYZW1OgYKmX91bVpVqdmQelozblh4Hg8Os/L2uzFCaUfVO2N2EMbr3uRyS75dm\n48vb4JhYBZNnSJKHqDgt28b+vwKBgQDt0HfUZJYU9VYd8HOOkY1dpq7yN4wQgje3\nejIEz36nGDf5Fvtevlx5Q1faqB5kAlJJfOKgqnWaHYPUSsPFtj0XVoC33Pa5HO5R\nT+m8ha3yNyCYqiRMETCzn2tI8jxyfGq0PtjzrpT/SXQHiqtrKF5KCW6VZ+JDFppF\nAaeN1YSNTwKBgQDGPqIE1z4gR7R3MpuPvsgvr17FT1LJsIFzm2Ptz1hTRHe4y3lE\nn5WCMFCEF4sH1/IuDNvXsdkhP5ORZ8tLEL6GPyhj/qB6dHuqa3heuLXOLxqPr4QR\n1UPCEDqMD3wiuNT4D2b28ACPcjDEW2Gpd0s/OvXYVDzt8AkdmKlZhzZawwKBgCvX\njN/ZE1oVyKSIWaVk6/zh58q7ttSsTP1ER8hfQGgprNf9BqZ2zbGFWsLyz3d8fhMS\nNO2Nv1SEMHOIvQLMEAMnbV94GvwRe1X+N4cL1f+bbiT26O4lFSdoMm0mS0KH8Vv9\nYh26h7lwnzVsuSFuNcPMbViZ6DqaBiLGpU8el+s9AoGBAKZI7fQi+PI5rf6I3biB\neZCizIfBxRueHVV0S+qduA1uuxS3HmSWXXcPFZz9NKcISLbPb7JN23zI2Zh2YdjP\nnnENDn97ixehlC56Desv9zUpg3oEskfw4CxabZ6otGS3ZMHEe5kInLgmJ6x/rN3A\n9EoevoPtzGFcc3NdCmd2Japw\n-----END PRIVATE KEY-----\n",
  "client_email": "firebase-adminsdk-2p3dl@tablabreplica.iam.gserviceaccount.com",
  "client_id": "105585812368694135258",
  "auth_uri": "https://accounts.google.com/o/oauth2/auth",
  "token_uri": "https://oauth2.googleapis.com/token",
  "auth_provider_x509_cert_url": "https://www.googleapis.com/oauth2/v1/certs",
  "client_x509_cert_url": "https://www.googleapis.com/robot/v1/metadata/x509/firebase-adminsdk-2p3dl%40tablabreplica.iam.gserviceaccount.com"
}
