material Particles/Fireball.001
{
	technique
	{
		pass
		{
			lighting off
			depth_write off
			scene_blend add

			texture_unit
			{
				texture particleresources/Textures/Fireball.001.png
			}
		}
	}
}
