material Particles/BrightStar.001
{
	technique
	{
		pass
		{
			lighting off
			depth_write off
			scene_blend add

			texture_unit
			{
				texture Resources/Textures/BrightStar.001.png
			}
		}
	}
}
