
// blender material: ice
material ice 
{
    receive_shadows on
    technique b2ogre_1333110592.631
    {
        pass b2ogre_1333110592.631
        {
            ambient 0.0 0.0 0.0 1.0
            diffuse 0.03916765807818856 0.0653601179325598 0.10565663733566755 1.0
            specular 1.0 0.6858586072921753 0.6858586072921753 1.0 12.5
            emissive 0.19583828747272491 0.3268005847930908 0.5282831788063049 1.0
            alpha_to_coverage off
            colour_write on
            cull_hardware clockwise
            depth_check on
            depth_func less_equal
            depth_write on
            illumination_stage 
            light_clip_planes off
            light_scissor off
            lighting on
            normalise_normals off
            polygon_mode solid
            scene_blend one zero
            scene_blend_op add
            shading gouraud
            transparent_sorting on

            texture_unit b2ogre_1333110592.632
            {
                texture ice_reflection.jpg
                //tex_address_mode border
                tex_address_mode wrap
				//tex_border_colour 1.0 0.0 1.0
                scale 1.0 1.0
                //colour_op_ex replace src_texture src_current
				colour_op replace
			}
        }
    }
}
