
// blender material: DirArrowsMat
material DirArrowsMat 
{
    technique b2ogre_1332586096.001
    {
        pass b2ogre_1332586096.001
        {
			emissive 1.0 1.0 1.0
			lighting off
			receive_shadows off
			cull_hardware none
			//scene_blend colour_blend
            scene_blend modulate
			//scene_blend_op add
            
			//depth_write off
			depth_check off

            texture_unit b2ogre_1332586096.001
            {
                texture direction.tga
				tex_address_mode wrap
                scale 1.0 1.0
                colour_op modulate
            }
        }
    }
}

