
// blender material: Material.011
material Material.011 
{
    receive_shadows on
    technique b2ogre_1337195229.038
    {
        pass b2ogre_1337195229.038
        {
            ambient 0.800000011920929 0.05264797434210777 0.08321485668420792 1.0
            diffuse 0.6400000190734865 0.04211838010129898 0.06657188633936473 1.0
            specular 0.5 0.5 0.5 1.0 12.5
            emissive 0.0 0.0 0.0 1.0
            alpha_to_coverage off
            colour_write on
            cull_hardware clockwise
            depth_check on
            depth_func less_equal
            depth_write on
            illumination_stage 
            light_clip_planes off
            light_scissor off
            lighting on
            normalise_normals off
            polygon_mode solid
            scene_blend one zero
            scene_blend_op add
            shading gouraud
            transparent_sorting on
        }
    }
}
