particle_system Trace
{
	material Particles/Flare.000
	particle_width 5
	particle_height 5
	quota 10
	cull_each false
	sorted false
	local_space false
	iteration_interval 0.0
	nonvisible_update_timeout 0.0
	billboard_type point
	billboard_origin center
	billboard_rotation_type texcoord
	point_rendering false
	accurate_facing false

	emitter Point
	{
		position 0.0 0.0 0.0
		direction 1.0 0.0 0.0
		angle 0
		emission_rate 50
		velocity_min 1
		velocity_max 1
		time_to_live_min 0.2
		time_to_live_max 0.4
		duration_min 0
		duration_max 0
		repeat_delay_min 0
		repeat_delay_max 0
		colour_range_start 1 0.00392157 0.00392157 1
		colour_range_end 0 0 0.3 1
	}
}
