
// blender material: FloorMaterial001
material FloorMaterial001 
{
    receive_shadows on
    technique b2ogre_1332437775.889
    {
        pass b2ogre_1332437775.889
        {

            texture_unit b2ogre_1332437775.89
            {
                texture MRAMOR6X6.jpg
                tex_address_mode wrap
                scale 1.0 1.0
                colour_op replace
            }
        }
    }
}
