material Particles/Thunder.001
{
	technique
	{
		pass
		{
			lighting off
			depth_write off
			scene_blend alpha_blend

			texture_unit
			{
				anim_texture Resources/Textures/Thunder1.png 6 0.02
			}
		}
	}
}
