{
  "test_directory": "test",
  "ci": "circleci",
  "circleci_api_endpoint": "https://circleci.com/api/v1.1/project",
  "git_host": "bb",
  "owner": "__sam",
  "project": "eice-project-1",
  "non_cache_list": [
    ".+&offset=0&filter=completed$"
  ],
  "plugins": {
    "includes": [
      "var-caus",
      "var-cons",
      "commit-break",
      "performance",
      "test-history",
      "valuelike",
      "coverage"
    ],
    "test-history": {
      "limit": 30,
      "test_result_xml": "test-results.xml"
    },
    "coverage": {
      "cover_result_json": "coverage/coverage-final.json"
    },
    "profiling": {
      "profileFile": "profiling.cpuprofile",
      "filterFunction": "(node) => node.url && node.url.startsWith('src/')",
      "postprocess": {
        "replace": {
          "fromStr": "bin/JsBarcode.js",
          "toStr": "src/JsBarcode.js"
        }
      }
    }
  },
  "eice-inject": [{
    "pattern": "^src/JsBarcode.js$",
    "function": "injectProfilingHeader",
    "preprocess": [{
      "type": "replace",
      "filePattern": "^test/node/.+.js$",
      "fromStr": "bin/JsBarcode.js",
      "toStr": "src/JsBarcode.js"
    }],
    "script": "node -r esm node_modules/mocha/bin/_mocha test/node/",
    "persist": ["profiling.cpuprofile"]
  }, {
    "pattern": "^$",
    "function": "",
    "preprocess": [{
      "type": "replace",
      "filePattern": "^test/node/.+.js$",
      "fromStr": "bin/JsBarcode.js",
      "toStr": "src/JsBarcode.js"
    }],
    "script": "node -r esm node_modules/mocha/bin/_mocha --reporter mocha-junit-reporter --reporter-options mochaFile=./test-results.xml test/node/",
    "persist": ["test-results.xml"]
  }, {
    "pattern": "^$",
    "function": "",
    "preprocess": [{
      "type": "replace",
      "filePattern": "^test/node/.+.js$",
      "fromStr": "bin/JsBarcode.js",
      "toStr": "src/JsBarcode.js"
    }],
    "script": "./node_modules/.bin/nyc --reporter json --reporter html node -r esm node_modules/mocha/bin/_mocha test/node/",
    "persist": [
      "coverage"
    ]
  }, {
    "pattern": "^src/.+.js$",
    "function": "injectValueLikeHeader",
    "preprocess": [{
      "type": "replace",
      "filePattern": "^test/node/.+.js$",
      "fromStr": "bin/JsBarcode.js",
      "toStr": "src/JsBarcode.js"
    }],
    "script": "node -r esm node_modules/mocha/bin/_mocha test/node/",
    "persist": ["DA.after.json", "DA.before.json"]
  }]
}
