{
	"object": {
		"uuid": "12497E55-8603-4BCC-99AA-E8E812551FD6",
		"type": "Group",
		"name": "union.dae",
		"matrix": [0.029999999329447746,0,0,0,0,0.000023889801013865508,-0.02999999187886715,0,0,0.02999999187886715,0.000023889801013865508,0,0,0,0,1],
		"children": [
			{
				"uuid": "E69CC2D2-D925-4AD8-897D-7AAA11ED821C",
				"type": "Object3D",
				"name": "SketchUp",
				"matrix": [1,0,0,0,0,1,0,0,0,0,1,0,0,0,0,1],
				"children": [
					{
						"uuid": "0CED8222-8883-437E-A52A-0DE5D4266B40",
						"type": "Mesh",
						"matrix": [1,0,0,0,0,1,0,0,0,0,1,0,0,0,0,1],
						"geometry": "0BE46AAA-4AA1-43F8-B8D1-B40D2BB662C2",
						"material": "3EF3C852-D063-4770-A887-0F5C3D86AAD9"
					},
					{
						"uuid": "134423B3-5EE9-4C14-BB28-1B415DD50DAF",
						"type": "Mesh",
						"matrix": [1,0,0,0,0,1,0,0,0,0,1,0,0,0,0,1],
						"geometry": "47822B44-8D50-47F7-B058-68EB53E4E38C",
						"material": "1B076BFB-D052-479D-A834-84FB0E8E6AED"
					},
					{
						"uuid": "970ABFE1-CAFA-4C0B-8062-86857F459C9C",
						"type": "Mesh",
						"matrix": [1,0,0,0,0,1,0,0,0,0,1,0,0,0,0,1],
						"geometry": "1A0CAE95-659D-435D-9AF5-8F74B7294DC7",
						"material": "1B076BFB-D052-479D-A834-84FB0E8E6AED"
					},
					{
						"uuid": "82F8EB39-8ACD-4A7A-8D2B-1D132D12148E",
						"type": "Mesh",
						"matrix": [1,0,0,0,0,1,0,0,0,0,1,0,0,0,0,1],
						"geometry": "9A962121-66C6-49C4-AC3B-B33A9BB1E7B9",
						"material": "1B076BFB-D052-479D-A834-84FB0E8E6AED"
					},
					{
						"uuid": "1C8CBC3B-CD29-484D-B005-CB77C81372BF",
						"type": "Mesh",
						"matrix": [1,0,0,0,0,1,0,0,0,0,1,0,0,0,0,1],
						"geometry": "63DE26F7-B99E-4D98-AC00-42ABEED969B2",
						"material": "1B076BFB-D052-479D-A834-84FB0E8E6AED"
					}]
			}]
	},
	"metadata": {
		"version": 4.4,
		"type": "Object",
		"generator": "Object3D.toJSON"
	},
	"geometries": [
		{
			"uuid": "0BE46AAA-4AA1-43F8-B8D1-B40D2BB662C2",
			"type": "Geometry",
			"data": {
				"vertices": [787.4016,0,0,0,-787.4016,0,0,0,0,787.4016,-787.4016,0,787.4016,-787.4016,33.46457,0,-787.4016,0,787.4016,-787.4016,0,0,-787.4016,33.46457,771.6535,-787.4016,33.46457,763.7795,-787.4016,33.46457,23.62205,-787.4016,33.46457,15.74803,-787.4016,33.46457,0,-771.6535,33.46457,0,-787.4016,0,0,-787.4016,33.46457,0,0,0,0,-763.7795,33.46457,0,-23.62205,33.46457,0,-15.74803,33.46457,0,0,33.46457,15.74803,0,33.46457,763.7795,0,33.46457,0,0,33.46457,23.62205,0,33.46457,787.4016,0,0,0,0,0,787.4016,0,33.46457,771.6535,0,33.46457,787.4016,0,0,787.4016,-787.4016,33.46457,787.4016,-787.4016,0,787.4016,-771.6535,33.46457,787.4016,-763.7795,33.46457,787.4016,-23.62205,33.46457,787.4016,-15.74803,33.46457,787.4016,0,33.46457,787.4016,-787.4016,33.46457,771.6535,-771.6535,33.46457,771.6535,-787.4016,33.46457,787.4016,-771.6535,33.46457,787.4016,-763.7795,33.46457,763.7795,-23.62205,33.46457,763.7795,-763.7795,33.46457,787.4016,-23.62205,33.46457,23.62205,-763.7795,33.46457,0,-23.62205,33.46457,0,-763.7795,33.46457,23.62205,-23.62205,33.46457,23.62205,-787.4016,33.46457,23.62205,0,33.46457,763.7795,0,33.46457,763.7795,-787.4016,33.46457,15.74803,-787.4016,33.46457,0,-771.6535,33.46457,0,-787.4016,33.46457,15.74803,-771.6535,33.46457,15.74803,-15.74803,33.46457,0,0,33.46457,0,-15.74803,33.46457,15.74803,0,33.46457,771.6535,-15.74803,33.46457,787.4016,0,33.46457,771.6535,0,33.46457,787.4016,-15.74803,33.46457],
				"normals": [0,0,-1,0,-1,0,-1,0,0,0,1,0,1,0,0,0,0,1,6.130716e-18,3.138889e-34,1,-4.511946e-16,4.136677e-31,1,-4.511946e-16,-3.175795e-32,1],
				"faces": [32,0,1,2,0,0,0,32,1,0,3,0,0,0,32,4,5,6,1,1,1,32,5,4,7,1,1,1,32,7,4,8,1,1,1,32,7,8,9,1,1,1,32,7,9,10,1,1,1,32,7,10,11,1,1,1,32,12,13,14,2,2,2,32,13,12,15,2,2,2,32,15,12,16,2,2,2,32,15,16,17,2,2,2,32,15,17,18,2,2,2,32,15,18,19,2,2,2,32,20,21,22,3,3,3,32,21,20,23,3,3,3,32,22,24,25,3,3,3,32,24,22,26,3,3,3,32,26,22,21,3,3,3,32,26,21,27,3,3,3,32,28,29,30,4,4,4,32,29,28,31,4,4,4,32,31,28,32,4,4,4,32,32,28,33,4,4,4,32,33,28,34,4,4,4,32,34,28,35,4,4,4,32,36,37,38,5,5,5,32,37,36,39,5,5,5,32,40,41,42,6,6,6,32,41,40,43,6,6,6,32,44,45,46,6,6,6,32,45,44,47,6,6,6,32,47,44,48,6,6,6,32,47,48,49,6,6,6,32,49,48,50,6,6,6,32,50,48,51,6,6,6,32,50,51,42,6,6,6,32,50,42,41,6,6,6,32,52,53,54,7,7,7,32,53,52,55,7,7,7,32,56,57,58,8,8,8,32,57,56,59,8,8,8,32,60,61,62,5,5,5,32,61,60,63,5,5,5]
			}
		},
		{
			"uuid": "47822B44-8D50-47F7-B058-68EB53E4E38C",
			"type": "Geometry",
			"data": {
				"vertices": [23.62205,-23.62205,33.46457,0,-15.74803,33.46457,0,-23.62205,33.46457,15.74803,-15.74803,33.46457,23.62205,0,33.46457,15.74803,0,33.46457],
				"normals": [-3.062407e-16,-4.083209e-17,1],
				"faces": [32,0,1,2,0,0,0,32,1,0,3,0,0,0,32,3,4,5,0,0,0,32,4,3,0,0,0,0]
			}
		},
		{
			"uuid": "1A0CAE95-659D-435D-9AF5-8F74B7294DC7",
			"type": "Geometry",
			"data": {
				"vertices": [763.7795,-23.62205,33.46457,771.6535,-15.74803,33.46457,763.7795,0,33.46457,787.4016,-23.62205,33.46457,771.6535,0,33.46457,787.4016,-15.74803,33.46457],
				"normals": [0,0,1],
				"faces": [32,0,1,2,0,0,0,32,1,0,3,0,0,0,32,2,1,4,0,0,0,32,1,3,5,0,0,0]
			}
		},
		{
			"uuid": "9A962121-66C6-49C4-AC3B-B33A9BB1E7B9",
			"type": "Geometry",
			"data": {
				"vertices": [771.6535,-787.4016,33.46457,763.7795,-763.7795,33.46457,763.7795,-787.4016,33.46457,771.6535,-771.6535,33.46457,787.4016,-763.7795,33.46457,787.4016,-771.6535,33.46457],
				"normals": [0,0,1],
				"faces": [32,0,1,2,0,0,0,32,1,0,3,0,0,0,32,1,3,4,0,0,0,32,4,3,5,0,0,0]
			}
		},
		{
			"uuid": "63DE26F7-B99E-4D98-AC00-42ABEED969B2",
			"type": "Geometry",
			"data": {
				"vertices": [23.62205,-787.4016,33.46457,15.74803,-771.6535,33.46457,15.74803,-787.4016,33.46457,23.62205,-763.7795,33.46457,0,-763.7795,33.46457,0,-771.6535,33.46457],
				"normals": [-3.062407e-16,4.083209e-17,1],
				"faces": [32,0,1,2,0,0,0,32,1,0,3,0,0,0,32,1,4,5,0,0,0,32,4,1,3,0,0,0]
			}
		}],
	"materials": [
		{
			"uuid": "3EF3C852-D063-4770-A887-0F5C3D86AAD9",
			"type": "MeshLambertMaterial",
			"name": "Color_005",
			"color": 3816004,
			"emissive": 0
		},
		{
			"uuid": "1B076BFB-D052-479D-A834-84FB0E8E6AED",
			"type": "MeshLambertMaterial",
			"name": "Color_001",
			"color": 16760320,
			"emissive": 0
		}]
}