<?xml version="1.0" encoding="UTF-8" standalone="no" ?>
<COLLADA xmlns="http://www.collada.org/2005/11/COLLADASchema" version="1.4.1">
    <asset>
        <contributor>
            <authoring_tool>SketchUp 15.3.331</authoring_tool>
        </contributor>
        <created>2015-09-24T00:51:58Z</created>
        <modified>2015-09-24T00:51:58Z</modified>
        <unit meter="0.0254" name="inch" />
        <up_axis>Z_UP</up_axis>
    </asset>
    <library_visual_scenes>
        <visual_scene id="ID1">
            <node name="SketchUp">
                <node id="ID2" name="group_0">
                    <matrix>1 0 0 55.34034 0 1 0 -19.68504 0 0 1 -1.776357e-014 0 0 0 1</matrix>
                    <instance_geometry url="#ID3">
                        <bind_material>
                            <technique_common>
                                <instance_material symbol="Material2" target="#ID4">
                                    <bind_vertex_input semantic="UVSET0" input_semantic="TEXCOORD" input_set="0" />
                                </instance_material>
                            </technique_common>
                        </bind_material>
                    </instance_geometry>
                    <instance_geometry url="#ID11">
                        <bind_material>
                            <technique_common>
                                <instance_material symbol="Material2" target="#ID12">
                                    <bind_vertex_input semantic="UVSET0" input_semantic="TEXCOORD" input_set="0" />
                                </instance_material>
                            </technique_common>
                        </bind_material>
                    </instance_geometry>
                    <instance_geometry url="#ID19">
                        <bind_material>
                            <technique_common>
                                <instance_material symbol="Material2" target="#ID21">
                                    <bind_vertex_input semantic="UVSET0" input_semantic="TEXCOORD" input_set="0" />
                                </instance_material>
                                <instance_material symbol="Material3" target="#ID25">
                                    <bind_vertex_input semantic="UVSET0" input_semantic="TEXCOORD" input_set="0" />
                                </instance_material>
                            </technique_common>
                        </bind_material>
                    </instance_geometry>
                    <instance_geometry url="#ID29">
                        <bind_material>
                            <technique_common>
                                <instance_material symbol="Material2" target="#ID21">
                                    <bind_vertex_input semantic="UVSET0" input_semantic="TEXCOORD" input_set="0" />
                                </instance_material>
                                <instance_material symbol="Material3" target="#ID33">
                                    <bind_vertex_input semantic="UVSET0" input_semantic="TEXCOORD" input_set="0" />
                                </instance_material>
                            </technique_common>
                        </bind_material>
                    </instance_geometry>
                    <instance_geometry url="#ID37">
                        <bind_material>
                            <technique_common>
                                <instance_material symbol="Material2" target="#ID21">
                                    <bind_vertex_input semantic="UVSET0" input_semantic="TEXCOORD" input_set="0" />
                                </instance_material>
                                <instance_material symbol="Material3" target="#ID41">
                                    <bind_vertex_input semantic="UVSET0" input_semantic="TEXCOORD" input_set="0" />
                                </instance_material>
                            </technique_common>
                        </bind_material>
                    </instance_geometry>
                    <instance_geometry url="#ID45">
                        <bind_material>
                            <technique_common>
                                <instance_material symbol="Material2" target="#ID21">
                                    <bind_vertex_input semantic="UVSET0" input_semantic="TEXCOORD" input_set="0" />
                                </instance_material>
                                <instance_material symbol="Material3" target="#ID41">
                                    <bind_vertex_input semantic="UVSET0" input_semantic="TEXCOORD" input_set="0" />
                                </instance_material>
                            </technique_common>
                        </bind_material>
                    </instance_geometry>
                    <instance_geometry url="#ID51">
                        <bind_material>
                            <technique_common>
                                <instance_material symbol="Material2" target="#ID21">
                                    <bind_vertex_input semantic="UVSET0" input_semantic="TEXCOORD" input_set="0" />
                                </instance_material>
                                <instance_material symbol="Material3" target="#ID41">
                                    <bind_vertex_input semantic="UVSET0" input_semantic="TEXCOORD" input_set="0" />
                                </instance_material>
                            </technique_common>
                        </bind_material>
                    </instance_geometry>
                    <instance_geometry url="#ID57">
                        <bind_material>
                            <technique_common>
                                <instance_material symbol="Material2" target="#ID21">
                                    <bind_vertex_input semantic="UVSET0" input_semantic="TEXCOORD" input_set="0" />
                                </instance_material>
                                <instance_material symbol="Material3" target="#ID41">
                                    <bind_vertex_input semantic="UVSET0" input_semantic="TEXCOORD" input_set="0" />
                                </instance_material>
                            </technique_common>
                        </bind_material>
                    </instance_geometry>
                    <instance_geometry url="#ID63">
                        <bind_material>
                            <technique_common>
                                <instance_material symbol="Material2" target="#ID21">
                                    <bind_vertex_input semantic="UVSET0" input_semantic="TEXCOORD" input_set="0" />
                                </instance_material>
                                <instance_material symbol="Material3" target="#ID67">
                                    <bind_vertex_input semantic="UVSET0" input_semantic="TEXCOORD" input_set="0" />
                                </instance_material>
                            </technique_common>
                        </bind_material>
                    </instance_geometry>
                    <instance_geometry url="#ID71">
                        <bind_material>
                            <technique_common>
                                <instance_material symbol="Material2" target="#ID21">
                                    <bind_vertex_input semantic="UVSET0" input_semantic="TEXCOORD" input_set="0" />
                                </instance_material>
                                <instance_material symbol="Material3" target="#ID41">
                                    <bind_vertex_input semantic="UVSET0" input_semantic="TEXCOORD" input_set="0" />
                                </instance_material>
                            </technique_common>
                        </bind_material>
                    </instance_geometry>
                    <instance_geometry url="#ID77">
                        <bind_material>
                            <technique_common>
                                <instance_material symbol="Material2" target="#ID21">
                                    <bind_vertex_input semantic="UVSET0" input_semantic="TEXCOORD" input_set="0" />
                                </instance_material>
                                <instance_material symbol="Material3" target="#ID41">
                                    <bind_vertex_input semantic="UVSET0" input_semantic="TEXCOORD" input_set="0" />
                                </instance_material>
                            </technique_common>
                        </bind_material>
                    </instance_geometry>
                    <instance_geometry url="#ID83">
                        <bind_material>
                            <technique_common>
                                <instance_material symbol="Material2" target="#ID21">
                                    <bind_vertex_input semantic="UVSET0" input_semantic="TEXCOORD" input_set="0" />
                                </instance_material>
                                <instance_material symbol="Material3" target="#ID41">
                                    <bind_vertex_input semantic="UVSET0" input_semantic="TEXCOORD" input_set="0" />
                                </instance_material>
                            </technique_common>
                        </bind_material>
                    </instance_geometry>
                    <instance_geometry url="#ID89">
                        <bind_material>
                            <technique_common>
                                <instance_material symbol="Material2" target="#ID21">
                                    <bind_vertex_input semantic="UVSET0" input_semantic="TEXCOORD" input_set="0" />
                                </instance_material>
                                <instance_material symbol="Material3" target="#ID67">
                                    <bind_vertex_input semantic="UVSET0" input_semantic="TEXCOORD" input_set="0" />
                                </instance_material>
                            </technique_common>
                        </bind_material>
                    </instance_geometry>
                    <instance_geometry url="#ID95">
                        <bind_material>
                            <technique_common>
                                <instance_material symbol="Material2" target="#ID21">
                                    <bind_vertex_input semantic="UVSET0" input_semantic="TEXCOORD" input_set="0" />
                                </instance_material>
                                <instance_material symbol="Material3" target="#ID41">
                                    <bind_vertex_input semantic="UVSET0" input_semantic="TEXCOORD" input_set="0" />
                                </instance_material>
                            </technique_common>
                        </bind_material>
                    </instance_geometry>
                    <instance_geometry url="#ID101">
                        <bind_material>
                            <technique_common>
                                <instance_material symbol="Material2" target="#ID21">
                                    <bind_vertex_input semantic="UVSET0" input_semantic="TEXCOORD" input_set="0" />
                                </instance_material>
                                <instance_material symbol="Material3" target="#ID41">
                                    <bind_vertex_input semantic="UVSET0" input_semantic="TEXCOORD" input_set="0" />
                                </instance_material>
                            </technique_common>
                        </bind_material>
                    </instance_geometry>
                    <instance_geometry url="#ID107">
                        <bind_material>
                            <technique_common>
                                <instance_material symbol="Material2" target="#ID21">
                                    <bind_vertex_input semantic="UVSET0" input_semantic="TEXCOORD" input_set="0" />
                                </instance_material>
                                <instance_material symbol="Material3" target="#ID41">
                                    <bind_vertex_input semantic="UVSET0" input_semantic="TEXCOORD" input_set="0" />
                                </instance_material>
                            </technique_common>
                        </bind_material>
                    </instance_geometry>
                    <instance_geometry url="#ID113">
                        <bind_material>
                            <technique_common>
                                <instance_material symbol="Material2" target="#ID21">
                                    <bind_vertex_input semantic="UVSET0" input_semantic="TEXCOORD" input_set="0" />
                                </instance_material>
                                <instance_material symbol="Material3" target="#ID41">
                                    <bind_vertex_input semantic="UVSET0" input_semantic="TEXCOORD" input_set="0" />
                                </instance_material>
                            </technique_common>
                        </bind_material>
                    </instance_geometry>
                    <instance_geometry url="#ID119">
                        <bind_material>
                            <technique_common>
                                <instance_material symbol="Material2" target="#ID21">
                                    <bind_vertex_input semantic="UVSET0" input_semantic="TEXCOORD" input_set="0" />
                                </instance_material>
                            </technique_common>
                        </bind_material>
                    </instance_geometry>
                    <instance_geometry url="#ID125">
                        <bind_material>
                            <technique_common>
                                <instance_material symbol="Material2" target="#ID21">
                                    <bind_vertex_input semantic="UVSET0" input_semantic="TEXCOORD" input_set="0" />
                                </instance_material>
                            </technique_common>
                        </bind_material>
                    </instance_geometry>
                    <instance_geometry url="#ID131">
                        <bind_material>
                            <technique_common>
                                <instance_material symbol="Material2" target="#ID25">
                                    <bind_vertex_input semantic="UVSET0" input_semantic="TEXCOORD" input_set="0" />
                                </instance_material>
                            </technique_common>
                        </bind_material>
                    </instance_geometry>
                    <instance_geometry url="#ID137">
                        <bind_material>
                            <technique_common>
                                <instance_material symbol="Material2" target="#ID21">
                                    <bind_vertex_input semantic="UVSET0" input_semantic="TEXCOORD" input_set="0" />
                                </instance_material>
                                <instance_material symbol="Material3" target="#ID41">
                                    <bind_vertex_input semantic="UVSET0" input_semantic="TEXCOORD" input_set="0" />
                                </instance_material>
                            </technique_common>
                        </bind_material>
                    </instance_geometry>
                    <instance_geometry url="#ID143">
                        <bind_material>
                            <technique_common>
                                <instance_material symbol="Material2" target="#ID21">
                                    <bind_vertex_input semantic="UVSET0" input_semantic="TEXCOORD" input_set="0" />
                                </instance_material>
                                <instance_material symbol="Material3" target="#ID67">
                                    <bind_vertex_input semantic="UVSET0" input_semantic="TEXCOORD" input_set="0" />
                                </instance_material>
                            </technique_common>
                        </bind_material>
                    </instance_geometry>
                    <instance_geometry url="#ID149">
                        <bind_material>
                            <technique_common>
                                <instance_material symbol="Material2" target="#ID150">
                                    <bind_vertex_input semantic="UVSET0" input_semantic="TEXCOORD" input_set="0" />
                                </instance_material>
                            </technique_common>
                        </bind_material>
                    </instance_geometry>
                    <instance_geometry url="#ID155">
                        <bind_material>
                            <technique_common>
                                <instance_material symbol="Material2" target="#ID150">
                                    <bind_vertex_input semantic="UVSET0" input_semantic="TEXCOORD" input_set="0" />
                                </instance_material>
                            </technique_common>
                        </bind_material>
                    </instance_geometry>
                    <instance_geometry url="#ID159">
                        <bind_material>
                            <technique_common>
                                <instance_material symbol="Material2" target="#ID150">
                                    <bind_vertex_input semantic="UVSET0" input_semantic="TEXCOORD" input_set="0" />
                                </instance_material>
                            </technique_common>
                        </bind_material>
                    </instance_geometry>
                    <instance_geometry url="#ID163">
                        <bind_material>
                            <technique_common>
                                <instance_material symbol="Material2" target="#ID150">
                                    <bind_vertex_input semantic="UVSET0" input_semantic="TEXCOORD" input_set="0" />
                                </instance_material>
                            </technique_common>
                        </bind_material>
                    </instance_geometry>
                </node>
            </node>
        </visual_scene>
    </library_visual_scenes>
    <library_geometries>
        <geometry id="ID3">
            <mesh>
                <source id="ID6">
                    <float_array id="ID9" count="15">237.13 310.7319 107.9824 243.65 0 119.8184 237.13 0 107.9824 243.65 354.3307 119.8184 237.13 354.3307 107.9824</float_array>
                    <technique_common>
                        <accessor count="5" source="#ID9" stride="3">
                            <param name="X" type="float" />
                            <param name="Y" type="float" />
                            <param name="Z" type="float" />
                        </accessor>
                    </technique_common>
                </source>
                <source id="ID7">
                    <float_array id="ID10" count="15">0.8758959 -1.206371e-018 -0.4825001 0.8758959 -1.206371e-018 -0.4825001 0.8758959 -1.206371e-018 -0.4825001 0.8758959 -1.206371e-018 -0.4825001 0.8758959 -1.206371e-018 -0.4825001</float_array>
                    <technique_common>
                        <accessor count="5" source="#ID10" stride="3">
                            <param name="X" type="float" />
                            <param name="Y" type="float" />
                            <param name="Z" type="float" />
                        </accessor>
                    </technique_common>
                </source>
                <vertices id="ID8">
                    <input semantic="POSITION" source="#ID6" />
                    <input semantic="NORMAL" source="#ID7" />
                </vertices>
                <triangles count="3" material="Material2">
                    <input offset="0" semantic="VERTEX" source="#ID8" />
                    <p>0 1 2 1 0 3 3 0 4</p>
                </triangles>
            </mesh>
        </geometry>
        <geometry id="ID11">
            <mesh>
                <source id="ID14">
                    <float_array id="ID17" count="72">243.65 0 119.8184 121.825 0 177.1654 237.13 0 107.9824 121.825 0 192.9134 0 0 119.8184 6.520038 0 107.9824 121.825 0 192.9134 0 354.3307 119.8184 0 0 119.8184 121.825 354.3307 192.9134 0 354.3307 119.8184 6.520038 0 107.9824 0 0 119.8184 6.520038 354.3307 107.9824 243.65 0 119.8184 121.825 354.3307 192.9134 121.825 0 192.9134 243.65 354.3307 119.8184 0 354.3307 119.8184 121.825 354.3307 177.1654 6.520038 354.3307 107.9824 121.825 354.3307 192.9134 243.65 354.3307 119.8184 237.13 354.3307 107.9824</float_array>
                    <technique_common>
                        <accessor count="24" source="#ID17" stride="3">
                            <param name="X" type="float" />
                            <param name="Y" type="float" />
                            <param name="Z" type="float" />
                        </accessor>
                    </technique_common>
                </source>
                <source id="ID15">
                    <float_array id="ID18" count="72">-0 -1 -0 -0 -1 -0 -0 -1 -0 -0 -1 -0 -0 -1 -0 -0 -1 -0 -0.5144958 0 0.8574929 -0.5144958 0 0.8574929 -0.5144958 0 0.8574929 -0.5144958 0 0.8574929 -0.8758959 -0 -0.4825001 -0.8758959 -0 -0.4825001 -0.8758959 -0 -0.4825001 -0.8758959 -0 -0.4825001 0.5144958 0 0.8574929 0.5144958 0 0.8574929 0.5144958 0 0.8574929 0.5144958 0 0.8574929 0 1 0 0 1 0 0 1 0 0 1 0 0 1 0 0 1 0</float_array>
                    <technique_common>
                        <accessor count="24" source="#ID18" stride="3">
                            <param name="X" type="float" />
                            <param name="Y" type="float" />
                            <param name="Z" type="float" />
                        </accessor>
                    </technique_common>
                </source>
                <vertices id="ID16">
                    <input semantic="POSITION" source="#ID14" />
                    <input semantic="NORMAL" source="#ID15" />
                </vertices>
                <triangles count="14" material="Material2">
                    <input offset="0" semantic="VERTEX" source="#ID16" />
                    <p>0 1 2 1 0 3 1 4 5 4 1 3 6 7 8 7 6 9 10 11 12 11 10 13 14 15 16 15 14 17 18 19 20 19 18 21 19 22 23 22 19 21</p>
                </triangles>
            </mesh>
        </geometry>
        <geometry id="ID19">
            <mesh>
                <source id="ID22">
                    <float_array id="ID27" count="96">43.08486 334.6457 3.552714e-015 38.86701 19.68504 25.30708 43.08486 19.68504 3.552714e-015 38.86701 334.6457 25.30708 38.86701 334.6457 25.30708 43.08486 334.6457 3.552714e-015 38.86701 19.68504 25.30708 43.08486 19.68504 3.552714e-015 38.86701 334.6457 25.30708 200.5652 334.6457 3.552714e-015 43.08486 334.6457 3.552714e-015 204.783 334.6457 25.30708 43.08486 19.68504 3.552714e-015 88.4613 19.68504 25.30708 92.67914 19.68504 2.43388e-015 38.86701 19.68504 25.30708 38.86701 19.68504 25.30708 43.08486 19.68504 3.552714e-015 88.4613 19.68504 25.30708 92.67914 19.68504 2.43388e-015 200.5652 334.6457 3.552714e-015 204.783 19.68504 25.30708 200.5652 19.68504 1.421085e-014 204.783 334.6457 25.30708 155.1887 19.68504 25.30708 200.5652 19.68504 1.421085e-014 150.9709 19.68504 8.537356e-016 204.783 19.68504 25.30708 204.783 19.68504 25.30708 155.1887 19.68504 25.30708 200.5652 19.68504 1.421085e-014 150.9709 19.68504 8.537356e-016</float_array>
                    <technique_common>
                        <accessor count="32" source="#ID27" stride="3">
                            <param name="X" type="float" />
                            <param name="Y" type="float" />
                            <param name="Z" type="float" />
                        </accessor>
                    </technique_common>
                </source>
                <source id="ID23">
                    <float_array id="ID28" count="96">0.9863939 3.768138e-018 0.164399 0.9863939 3.768138e-018 0.164399 0.9863939 3.768138e-018 0.164399 0.9863939 3.768138e-018 0.164399 -0.9863939 -3.768138e-018 -0.164399 -0.9863939 -3.768138e-018 -0.164399 -0.9863939 -3.768138e-018 -0.164399 -0.9863939 -3.768138e-018 -0.164399 0 1 0 0 1 0 0 1 0 0 1 0 0 1 0 0 1 0 0 1 0 0 1 0 -0 -1 -0 -0 -1 -0 -0 -1 -0 -0 -1 -0 0.9863939 -6.405834e-018 -0.164399 0.9863939 -6.405834e-018 -0.164399 0.9863939 -6.405834e-018 -0.164399 0.9863939 -6.405834e-018 -0.164399 0 1 0 0 1 0 0 1 0 0 1 0 -0 -1 -0 -0 -1 -0 -0 -1 -0 -0 -1 -0</float_array>
                    <technique_common>
                        <accessor count="32" source="#ID28" stride="3">
                            <param name="X" type="float" />
                            <param name="Y" type="float" />
                            <param name="Z" type="float" />
                        </accessor>
                    </technique_common>
                </source>
                <vertices id="ID24">
                    <input semantic="POSITION" source="#ID22" />
                    <input semantic="NORMAL" source="#ID23" />
                </vertices>
                <triangles count="6" material="Material2">
                    <input offset="0" semantic="VERTEX" source="#ID24" />
                    <p>0 1 2 1 0 3 12 13 14 13 12 15 24 25 26 25 24 27</p>
                </triangles>
                <triangles count="10" material="Material3">
                    <input offset="0" semantic="VERTEX" source="#ID24" />
                    <p>4 5 6 7 6 5 8 9 10 9 8 11 16 17 18 19 18 17 20 21 22 21 20 23 28 29 30 31 30 29</p>
                </triangles>
            </mesh>
        </geometry>
        <geometry id="ID29">
            <mesh>
                <source id="ID30">
                    <float_array id="ID35" count="141">23.39982 19.68504 118.1102 88.4613 19.68504 25.30708 38.86701 19.68504 25.30708 76.37235 19.68504 97.84074 167.2777 19.68504 97.84074 204.783 19.68504 25.30708 155.1887 19.68504 25.30708 220.2502 19.68504 118.1102 121.825 19.68504 177.1654 121.825 19.68504 177.1654 23.39982 19.68504 118.1102 220.2502 19.68504 118.1102 167.2777 19.68504 97.84074 204.783 19.68504 25.30708 155.1887 19.68504 25.30708 76.37235 19.68504 97.84074 88.4613 19.68504 25.30708 38.86701 19.68504 25.30708 38.86701 19.68504 25.30708 36.34462 108.4872 40.44142 23.39982 19.68504 118.1102 38.86701 334.6457 25.30708 27.57741 99.26594 93.04468 36.34462 245.8435 40.44142 27.57741 255.0648 93.04468 23.39982 334.6457 118.1102 38.86701 334.6457 25.30708 27.57741 255.0648 93.04468 23.39982 334.6457 118.1102 27.57741 99.26594 93.04468 23.39982 19.68504 118.1102 36.34462 245.8435 40.44142 36.34462 108.4872 40.44142 38.86701 19.68504 25.30708 204.783 19.68504 25.30708 207.0921 107.1324 39.16141 220.2502 19.68504 118.1102 204.783 334.6457 25.30708 215.8593 97.91111 91.76467 207.0921 244.4887 39.16141 215.8593 253.71 91.76467 220.2502 334.6457 118.1102 23.39982 334.6457 118.1102 204.783 334.6457 25.30708 38.86701 334.6457 25.30708 220.2502 334.6457 118.1102 121.825 334.6457 177.1654</float_array>
                    <technique_common>
                        <accessor count="47" source="#ID35" stride="3">
                            <param name="X" type="float" />
                            <param name="Y" type="float" />
                            <param name="Z" type="float" />
                        </accessor>
                    </technique_common>
                </source>
                <source id="ID31">
                    <float_array id="ID36" count="141">0 1 0 0 1 0 0 1 0 0 1 0 0 1 0 0 1 0 0 1 0 0 1 0 0 1 0 -0 -1 -0 -0 -1 -0 -0 -1 -0 -0 -1 -0 -0 -1 -0 -0 -1 -0 -0 -1 -0 -0 -1 -0 -0 -1 -0 0.9863939 -9.926316e-018 0.164399 0.9863939 -9.926316e-018 0.164399 0.9863939 -9.926316e-018 0.164399 0.9863939 -9.926316e-018 0.164399 0.9863939 -9.926316e-018 0.164399 0.9863939 -9.926316e-018 0.164399 0.9863939 -9.926316e-018 0.164399 0.9863939 -9.926316e-018 0.164399 -0.9863939 9.926316e-018 -0.164399 -0.9863939 9.926316e-018 -0.164399 -0.9863939 9.926316e-018 -0.164399 -0.9863939 9.926316e-018 -0.164399 -0.9863939 9.926316e-018 -0.164399 -0.9863939 9.926316e-018 -0.164399 -0.9863939 9.926316e-018 -0.164399 -0.9863939 9.926316e-018 -0.164399 0.9863939 -3.01451e-018 -0.164399 0.9863939 -3.01451e-018 -0.164399 0.9863939 -3.01451e-018 -0.164399 0.9863939 -3.01451e-018 -0.164399 0.9863939 -3.01451e-018 -0.164399 0.9863939 -3.01451e-018 -0.164399 0.9863939 -3.01451e-018 -0.164399 0.9863939 -3.01451e-018 -0.164399 0 1 0 0 1 0 0 1 0 0 1 0 0 1 0</float_array>
                    <technique_common>
                        <accessor count="47" source="#ID36" stride="3">
                            <param name="X" type="float" />
                            <param name="Y" type="float" />
                            <param name="Z" type="float" />
                        </accessor>
                    </technique_common>
                </source>
                <vertices id="ID32">
                    <input semantic="POSITION" source="#ID30" />
                    <input semantic="NORMAL" source="#ID31" />
                </vertices>
                <triangles count="15" material="Material2">
                    <input offset="0" semantic="VERTEX" source="#ID32" />
                    <p>0 1 2 1 0 3 3 0 4 4 5 6 5 4 7 7 4 0 7 0 8 18 19 20 19 18 21 20 19 22 19 21 23 23 21 24 22 25 20 25 22 24 25 24 21</p>
                </triangles>
                <triangles count="26" material="Material3">
                    <input offset="0" semantic="VERTEX" source="#ID32" />
                    <p>9 10 11 10 12 11 11 12 13 14 13 12 12 10 15 15 10 16 17 16 10 26 27 28 27 29 28 30 28 29 27 26 31 31 26 32 29 32 30 26 33 32 30 32 33 34 35 36 35 34 37 36 35 38 35 37 39 39 37 40 38 41 36 41 38 40 41 40 37 42 43 44 43 42 45 45 42 46</p>
                </triangles>
            </mesh>
        </geometry>
        <geometry id="ID37">
            <mesh>
                <source id="ID38">
                    <float_array id="ID43" count="36">88.91382 19.68504 86.57312 121.0376 19.68504 58.23823 95.03077 19.68504 58.23823 121.0376 19.68504 60.78651 121.0376 19.68504 62.36131 121.0376 19.68504 86.57312 121.0376 19.68504 86.57312 88.91382 19.68504 86.57312 121.0376 19.68504 62.36131 121.0376 19.68504 60.78651 121.0376 19.68504 58.23823 95.03077 19.68504 58.23823</float_array>
                    <technique_common>
                        <accessor count="12" source="#ID43" stride="3">
                            <param name="X" type="float" />
                            <param name="Y" type="float" />
                            <param name="Z" type="float" />
                        </accessor>
                    </technique_common>
                </source>
                <source id="ID39">
                    <float_array id="ID44" count="36">0 1 0 0 1 0 0 1 0 0 1 0 0 1 0 0 1 0 -0 -1 -0 -0 -1 -0 -0 -1 -0 -0 -1 -0 -0 -1 -0 -0 -1 -0</float_array>
                    <technique_common>
                        <accessor count="12" source="#ID44" stride="3">
                            <param name="X" type="float" />
                            <param name="Y" type="float" />
                            <param name="Z" type="float" />
                        </accessor>
                    </technique_common>
                </source>
                <vertices id="ID40">
                    <input semantic="POSITION" source="#ID38" />
                    <input semantic="NORMAL" source="#ID39" />
                </vertices>
                <triangles count="4" material="Material2">
                    <input offset="0" semantic="VERTEX" source="#ID40" />
                    <p>0 1 2 1 0 3 3 0 4 4 0 5</p>
                </triangles>
                <triangles count="4" material="Material3">
                    <input offset="0" semantic="VERTEX" source="#ID40" />
                    <p>6 7 8 8 7 9 9 7 10 11 10 7</p>
                </triangles>
            </mesh>
        </geometry>
        <geometry id="ID45">
            <mesh>
                <source id="ID46">
                    <float_array id="ID49" count="30">122.6124 19.68504 56.66343 141.5101 19.68504 25.30708 122.6124 19.68504 25.30708 148.2793 19.68504 56.66343 123.8425 19.68504 56.66343 123.8425 19.68504 56.66343 122.6124 19.68504 56.66343 148.2793 19.68504 56.66343 141.5101 19.68504 25.30708 122.6124 19.68504 25.30708</float_array>
                    <technique_common>
                        <accessor count="10" source="#ID49" stride="3">
                            <param name="X" type="float" />
                            <param name="Y" type="float" />
                            <param name="Z" type="float" />
                        </accessor>
                    </technique_common>
                </source>
                <source id="ID47">
                    <float_array id="ID50" count="30">0 1 0 0 1 0 0 1 0 0 1 0 0 1 0 -0 -1 -0 -0 -1 -0 -0 -1 -0 -0 -1 -0 -0 -1 -0</float_array>
                    <technique_common>
                        <accessor count="10" source="#ID50" stride="3">
                            <param name="X" type="float" />
                            <param name="Y" type="float" />
                            <param name="Z" type="float" />
                        </accessor>
                    </technique_common>
                </source>
                <vertices id="ID48">
                    <input semantic="POSITION" source="#ID46" />
                    <input semantic="NORMAL" source="#ID47" />
                </vertices>
                <triangles count="3" material="Material2">
                    <input offset="0" semantic="VERTEX" source="#ID48" />
                    <p>0 1 2 1 0 3 3 0 4</p>
                </triangles>
                <triangles count="3" material="Material3">
                    <input offset="0" semantic="VERTEX" source="#ID48" />
                    <p>5 6 7 7 6 8 9 8 6</p>
                </triangles>
            </mesh>
        </geometry>
        <geometry id="ID51">
            <mesh>
                <source id="ID52">
                    <float_array id="ID55" count="24">95.37074 19.68504 56.66343 121.0376 19.68504 25.30708 102.14 19.68504 25.30708 121.0376 19.68504 56.66343 121.0376 19.68504 56.66343 95.37074 19.68504 56.66343 121.0376 19.68504 25.30708 102.14 19.68504 25.30708</float_array>
                    <technique_common>
                        <accessor count="8" source="#ID55" stride="3">
                            <param name="X" type="float" />
                            <param name="Y" type="float" />
                            <param name="Z" type="float" />
                        </accessor>
                    </technique_common>
                </source>
                <source id="ID53">
                    <float_array id="ID56" count="24">0 1 0 0 1 0 0 1 0 0 1 0 -0 -1 -0 -0 -1 -0 -0 -1 -0 -0 -1 -0</float_array>
                    <technique_common>
                        <accessor count="8" source="#ID56" stride="3">
                            <param name="X" type="float" />
                            <param name="Y" type="float" />
                            <param name="Z" type="float" />
                        </accessor>
                    </technique_common>
                </source>
                <vertices id="ID54">
                    <input semantic="POSITION" source="#ID52" />
                    <input semantic="NORMAL" source="#ID53" />
                </vertices>
                <triangles count="2" material="Material2">
                    <input offset="0" semantic="VERTEX" source="#ID54" />
                    <p>0 1 2 1 0 3</p>
                </triangles>
                <triangles count="2" material="Material3">
                    <input offset="0" semantic="VERTEX" source="#ID54" />
                    <p>4 5 6 7 6 5</p>
                </triangles>
            </mesh>
        </geometry>
        <geometry id="ID57">
            <mesh>
                <source id="ID58">
                    <float_array id="ID61" count="42">122.6124 19.68504 60.78651 123.8425 19.68504 58.23823 122.6124 19.68504 58.23823 148.6193 19.68504 58.23823 154.7362 19.68504 86.57312 122.6124 19.68504 62.36131 122.6124 19.68504 86.57312 122.6124 19.68504 86.57312 122.6124 19.68504 62.36131 154.7362 19.68504 86.57312 122.6124 19.68504 60.78651 148.6193 19.68504 58.23823 123.8425 19.68504 58.23823 122.6124 19.68504 58.23823</float_array>
                    <technique_common>
                        <accessor count="14" source="#ID61" stride="3">
                            <param name="X" type="float" />
                            <param name="Y" type="float" />
                            <param name="Z" type="float" />
                        </accessor>
                    </technique_common>
                </source>
                <source id="ID59">
                    <float_array id="ID62" count="42">0 1 0 0 1 0 0 1 0 0 1 0 0 1 0 0 1 0 0 1 0 -0 -1 -0 -0 -1 -0 -0 -1 -0 -0 -1 -0 -0 -1 -0 -0 -1 -0 -0 -1 -0</float_array>
                    <technique_common>
                        <accessor count="14" source="#ID62" stride="3">
                            <param name="X" type="float" />
                            <param name="Y" type="float" />
                            <param name="Z" type="float" />
                        </accessor>
                    </technique_common>
                </source>
                <vertices id="ID60">
                    <input semantic="POSITION" source="#ID58" />
                    <input semantic="NORMAL" source="#ID59" />
                </vertices>
                <triangles count="5" material="Material2">
                    <input offset="0" semantic="VERTEX" source="#ID60" />
                    <p>0 1 2 1 0 3 3 0 4 4 0 5 4 5 6</p>
                </triangles>
                <triangles count="5" material="Material3">
                    <input offset="0" semantic="VERTEX" source="#ID60" />
                    <p>7 8 9 8 10 9 9 10 11 11 10 12 13 12 10</p>
                </triangles>
            </mesh>
        </geometry>
        <geometry id="ID63">
            <mesh>
                <source id="ID64">
                    <float_array id="ID69" count="174">76.37235 19.68504 97.84074 102.14 19.68504 25.30708 88.4613 19.68504 25.30708 95.37074 19.68504 56.66343 95.03077 19.68504 58.23823 122.6124 19.68504 56.66343 123.8425 19.68504 56.66343 148.2793 19.68504 56.66343 88.91382 19.68504 86.57312 121.0376 19.68504 86.57312 122.6124 19.68504 86.57312 154.7362 19.68504 86.57312 92.67914 19.68504 2.43388e-015 150.9709 19.68504 8.537356e-016 121.825 19.68504 0 155.1887 19.68504 25.30708 121.0376 19.68504 25.30708 122.6124 19.68504 25.30708 141.5101 19.68504 25.30708 167.2777 19.68504 97.84074 148.6193 19.68504 58.23823 121.0376 19.68504 58.23823 122.6124 19.68504 58.23823 123.8425 19.68504 58.23823 121.0376 19.68504 60.78651 122.6124 19.68504 60.78651 121.0376 19.68504 62.36131 122.6124 19.68504 62.36131 121.0376 19.68504 56.66343 95.37074 19.68504 56.66343 121.0376 19.68504 56.66343 122.6124 19.68504 56.66343 122.6124 19.68504 25.30708 121.0376 19.68504 25.30708 122.6124 19.68504 86.57312 121.0376 19.68504 86.57312 122.6124 19.68504 62.36131 121.0376 19.68504 62.36131 122.6124 19.68504 60.78651 121.0376 19.68504 60.78651 122.6124 19.68504 58.23823 121.0376 19.68504 58.23823 76.37235 19.68504 97.84074 154.7362 19.68504 86.57312 167.2777 19.68504 97.84074 148.6193 19.68504 58.23823 123.8425 19.68504 58.23823 95.03077 19.68504 58.23823 148.2793 19.68504 56.66343 155.1887 19.68504 25.30708 141.5101 19.68504 25.30708 102.14 19.68504 25.30708 88.4613 19.68504 25.30708 92.67914 19.68504 2.43388e-015 150.9709 19.68504 8.537356e-016 121.825 19.68504 0 88.91382 19.68504 86.57312 123.8425 19.68504 56.66343</float_array>
                    <technique_common>
                        <accessor count="58" source="#ID69" stride="3">
                            <param name="X" type="float" />
                            <param name="Y" type="float" />
                            <param name="Z" type="float" />
                        </accessor>
                    </technique_common>
                </source>
                <source id="ID65">
                    <float_array id="ID70" count="174">0 1 0 0 1 0 0 1 0 0 1 0 0 1 0 0 1 0 0 1 0 0 1 0 0 1 0 0 1 0 0 1 0 0 1 0 0 1 0 0 1 0 0 1 0 0 1 0 0 1 0 0 1 0 0 1 0 0 1 0 0 1 0 0 1 0 0 1 0 0 1 0 0 1 0 0 1 0 0 1 0 0 1 0 0 1 0 -0 -1 -0 -0 -1 -0 -0 -1 -0 -0 -1 -0 -0 -1 -0 -0 -1 -0 -0 -1 -0 -0 -1 -0 -0 -1 -0 -0 -1 -0 -0 -1 -0 -0 -1 -0 -0 -1 -0 -0 -1 -0 -0 -1 -0 -0 -1 -0 -0 -1 -0 -0 -1 -0 -0 -1 -0 -0 -1 -0 -0 -1 -0 -0 -1 -0 -0 -1 -0 -0 -1 -0 -0 -1 -0 -0 -1 -0 -0 -1 -0 -0 -1 -0 -0 -1 -0</float_array>
                    <technique_common>
                        <accessor count="58" source="#ID70" stride="3">
                            <param name="X" type="float" />
                            <param name="Y" type="float" />
                            <param name="Z" type="float" />
                        </accessor>
                    </technique_common>
                </source>
                <vertices id="ID66">
                    <input semantic="POSITION" source="#ID64" />
                    <input semantic="NORMAL" source="#ID65" />
                </vertices>
                <triangles count="35" material="Material2">
                    <input offset="0" semantic="VERTEX" source="#ID66" />
                    <p>0 1 2 1 0 3 3 0 4 3 4 5 5 4 6 6 4 7 4 0 8 8 0 9 9 0 10 10 0 11 12 13 14 13 12 15 15 12 2 15 2 1 15 1 16 15 16 17 15 17 18 15 18 7 15 7 19 19 7 20 20 7 4 20 4 21 20 21 22 20 22 23 19 20 11 19 11 0 24 22 21 22 24 25 25 24 26 25 26 27 27 26 9 27 9 10 28 17 16 17 28 5 5 28 3</p>
                </triangles>
                <triangles count="35" material="Material3">
                    <input offset="0" semantic="VERTEX" source="#ID66" />
                    <p>29 30 31 31 30 32 33 32 30 34 35 36 35 37 36 36 37 38 37 39 38 38 39 40 41 40 39 42 43 44 43 45 44 46 40 45 40 41 45 41 47 45 47 48 45 45 48 44 44 48 49 48 50 49 50 32 49 32 33 49 33 51 49 51 52 49 52 53 49 49 53 54 55 54 53 43 42 34 34 42 35 35 42 56 56 42 47 48 47 57 57 47 31 31 47 29 47 42 29 29 42 51 52 51 42</p>
                </triangles>
            </mesh>
        </geometry>
        <geometry id="ID71">
            <mesh>
                <source id="ID72">
                    <float_array id="ID75" count="30">214.7807 247.033 85.29311 214.6512 176.5979 84.51642 214.7807 176.5979 85.29311 211.771 176.5979 67.2349 211.771 243.4418 67.2349 211.771 243.4418 67.2349 214.7807 247.033 85.29311 211.771 176.5979 67.2349 214.6512 176.5979 84.51642 214.7807 176.5979 85.29311</float_array>
                    <technique_common>
                        <accessor count="10" source="#ID75" stride="3">
                            <param name="X" type="float" />
                            <param name="Y" type="float" />
                            <param name="Z" type="float" />
                        </accessor>
                    </technique_common>
                </source>
                <source id="ID73">
                    <float_array id="ID76" count="30">-0.9863939 4.956934e-018 0.164399 -0.9863939 4.956934e-018 0.164399 -0.9863939 4.956934e-018 0.164399 -0.9863939 4.956934e-018 0.164399 -0.9863939 4.956934e-018 0.164399 0.9863939 -4.956934e-018 -0.164399 0.9863939 -4.956934e-018 -0.164399 0.9863939 -4.956934e-018 -0.164399 0.9863939 -4.956934e-018 -0.164399 0.9863939 -4.956934e-018 -0.164399</float_array>
                    <technique_common>
                        <accessor count="10" source="#ID76" stride="3">
                            <param name="X" type="float" />
                            <param name="Y" type="float" />
                            <param name="Z" type="float" />
                        </accessor>
                    </technique_common>
                </source>
                <vertices id="ID74">
                    <input semantic="POSITION" source="#ID72" />
                    <input semantic="NORMAL" source="#ID73" />
                </vertices>
                <triangles count="3" material="Material2">
                    <input offset="0" semantic="VERTEX" source="#ID74" />
                    <p>0 1 2 1 0 3 3 0 4</p>
                </triangles>
                <triangles count="3" material="Material3">
                    <input offset="0" semantic="VERTEX" source="#ID74" />
                    <p>5 6 7 7 6 8 9 8 6</p>
                </triangles>
            </mesh>
        </geometry>
        <geometry id="ID77">
            <mesh>
                <source id="ID78">
                    <float_array id="ID81" count="30">208.5024 175.0231 47.62332 208.5024 111.7762 47.62332 208.6318 175.0231 48.4 211.5121 175.0231 65.68153 211.5121 108.2969 65.68153 208.6318 175.0231 48.4 211.5121 175.0231 65.68153 208.5024 111.7762 47.62332 211.5121 108.2969 65.68153 208.5024 175.0231 47.62332</float_array>
                    <technique_common>
                        <accessor count="10" source="#ID81" stride="3">
                            <param name="X" type="float" />
                            <param name="Y" type="float" />
                            <param name="Z" type="float" />
                        </accessor>
                    </technique_common>
                </source>
                <source id="ID79">
                    <float_array id="ID82" count="30">-0.9863939 -7.78923e-017 0.164399 -0.9863939 -7.78923e-017 0.164399 -0.9863939 -7.78923e-017 0.164399 -0.9863939 -7.78923e-017 0.164399 -0.9863939 -7.78923e-017 0.164399 0.9863939 7.78923e-017 -0.164399 0.9863939 7.78923e-017 -0.164399 0.9863939 7.78923e-017 -0.164399 0.9863939 7.78923e-017 -0.164399 0.9863939 7.78923e-017 -0.164399</float_array>
                    <technique_common>
                        <accessor count="10" source="#ID82" stride="3">
                            <param name="X" type="float" />
                            <param name="Y" type="float" />
                            <param name="Z" type="float" />
                        </accessor>
                    </technique_common>
                </source>
                <vertices id="ID80">
                    <input semantic="POSITION" source="#ID78" />
                    <input semantic="NORMAL" source="#ID79" />
                </vertices>
                <triangles count="3" material="Material2">
                    <input offset="0" semantic="VERTEX" source="#ID80" />
                    <p>0 1 2 3 1 4 1 3 2</p>
                </triangles>
                <triangles count="3" material="Material3">
                    <input offset="0" semantic="VERTEX" source="#ID80" />
                    <p>5 6 7 8 7 6 5 7 9</p>
                </triangles>
            </mesh>
        </geometry>
        <geometry id="ID83">
            <mesh>
                <source id="ID84">
                    <float_array id="ID87" count="36">211.5121 176.5979 65.68153 208.5024 176.5979 47.62332 208.6318 176.5979 48.4 208.5024 239.5416 47.62332 211.5121 243.1329 65.68153 208.6318 239.6961 48.4 208.6318 239.6961 48.4 211.5121 243.1329 65.68153 208.5024 239.5416 47.62332 211.5121 176.5979 65.68153 208.5024 176.5979 47.62332 208.6318 176.5979 48.4</float_array>
                    <technique_common>
                        <accessor count="12" source="#ID87" stride="3">
                            <param name="X" type="float" />
                            <param name="Y" type="float" />
                            <param name="Z" type="float" />
                        </accessor>
                    </technique_common>
                </source>
                <source id="ID85">
                    <float_array id="ID88" count="36">-0.9863939 1.552856e-017 0.164399 -0.9863939 1.552856e-017 0.164399 -0.9863939 1.552856e-017 0.164399 -0.9863939 1.552856e-017 0.164399 -0.9863939 1.552856e-017 0.164399 -0.9863939 1.552856e-017 0.164399 0.9863939 -1.552856e-017 -0.164399 0.9863939 -1.552856e-017 -0.164399 0.9863939 -1.552856e-017 -0.164399 0.9863939 -1.552856e-017 -0.164399 0.9863939 -1.552856e-017 -0.164399 0.9863939 -1.552856e-017 -0.164399</float_array>
                    <technique_common>
                        <accessor count="12" source="#ID88" stride="3">
                            <param name="X" type="float" />
                            <param name="Y" type="float" />
                            <param name="Z" type="float" />
                        </accessor>
                    </technique_common>
                </source>
                <vertices id="ID86">
                    <input semantic="POSITION" source="#ID84" />
                    <input semantic="NORMAL" source="#ID85" />
                </vertices>
                <triangles count="4" material="Material2">
                    <input offset="0" semantic="VERTEX" source="#ID86" />
                    <p>0 1 2 1 0 3 3 0 4 3 4 5</p>
                </triangles>
                <triangles count="4" material="Material3">
                    <input offset="0" semantic="VERTEX" source="#ID86" />
                    <p>6 7 8 7 9 8 8 9 10 11 10 9</p>
                </triangles>
            </mesh>
        </geometry>
        <geometry id="ID89">
            <mesh>
                <source id="ID90">
                    <float_array id="ID93" count="150">36.34462 108.4872 40.44142 28.65601 105.9429 86.57312 27.57741 99.26594 93.04468 31.66571 109.5341 68.51491 34.93431 113.4342 48.90333 36.34462 245.8435 40.44142 31.9246 109.843 66.96153 34.80486 113.2798 49.68001 34.93431 176.378 48.90333 34.93431 177.9528 48.90333 34.80486 176.378 49.68001 31.9246 176.378 66.96153 31.66571 176.378 68.51491 28.78545 176.378 85.79643 28.65601 176.378 86.57312 34.93431 241.1996 48.90333 31.9246 244.679 66.96153 31.66571 244.9783 68.51491 28.65601 248.4576 86.57312 27.57741 255.0648 93.04468 28.65601 177.9528 86.57312 34.80486 177.9528 49.68001 31.9246 177.9528 66.96153 31.66571 177.9528 68.51491 28.78545 177.9528 85.79643 31.9246 176.378 66.96153 31.9246 109.843 66.96153 31.66571 176.378 68.51491 31.66571 109.5341 68.51491 31.66571 244.9783 68.51491 31.9246 244.679 66.96153 31.66571 177.9528 68.51491 31.9246 177.9528 66.96153 28.65601 248.4576 86.57312 28.65601 177.9528 86.57312 27.57741 255.0648 93.04468 28.78545 177.9528 85.79643 34.80486 177.9528 49.68001 34.93431 177.9528 48.90333 28.65601 176.378 86.57312 28.65601 105.9429 86.57312 27.57741 99.26594 93.04468 36.34462 245.8435 40.44142 34.93431 241.1996 48.90333 28.78545 176.378 85.79643 34.80486 176.378 49.68001 34.93431 176.378 48.90333 34.93431 113.4342 48.90333 34.80486 113.2798 49.68001 36.34462 108.4872 40.44142</float_array>
                    <technique_common>
                        <accessor count="50" source="#ID93" stride="3">
                            <param name="X" type="float" />
                            <param name="Y" type="float" />
                            <param name="Z" type="float" />
                        </accessor>
                    </technique_common>
                </source>
                <source id="ID91">
                    <float_array id="ID94" count="150">0.9863939 -4.938938e-017 0.164399 0.9863939 -4.938938e-017 0.164399 0.9863939 -4.938938e-017 0.164399 0.9863939 -4.938938e-017 0.164399 0.9863939 -4.938938e-017 0.164399 0.9863939 -4.938938e-017 0.164399 0.9863939 -4.938938e-017 0.164399 0.9863939 -4.938938e-017 0.164399 0.9863939 -4.938938e-017 0.164399 0.9863939 -4.938938e-017 0.164399 0.9863939 -4.938938e-017 0.164399 0.9863939 -4.938938e-017 0.164399 0.9863939 -4.938938e-017 0.164399 0.9863939 -4.938938e-017 0.164399 0.9863939 -4.938938e-017 0.164399 0.9863939 -4.938938e-017 0.164399 0.9863939 -4.938938e-017 0.164399 0.9863939 -4.938938e-017 0.164399 0.9863939 -4.938938e-017 0.164399 0.9863939 -4.938938e-017 0.164399 0.9863939 -4.938938e-017 0.164399 0.9863939 -4.938938e-017 0.164399 0.9863939 -4.938938e-017 0.164399 0.9863939 -4.938938e-017 0.164399 0.9863939 -4.938938e-017 0.164399 -0.9863939 4.938938e-017 -0.164399 -0.9863939 4.938938e-017 -0.164399 -0.9863939 4.938938e-017 -0.164399 -0.9863939 4.938938e-017 -0.164399 -0.9863939 4.938938e-017 -0.164399 -0.9863939 4.938938e-017 -0.164399 -0.9863939 4.938938e-017 -0.164399 -0.9863939 4.938938e-017 -0.164399 -0.9863939 4.938938e-017 -0.164399 -0.9863939 4.938938e-017 -0.164399 -0.9863939 4.938938e-017 -0.164399 -0.9863939 4.938938e-017 -0.164399 -0.9863939 4.938938e-017 -0.164399 -0.9863939 4.938938e-017 -0.164399 -0.9863939 4.938938e-017 -0.164399 -0.9863939 4.938938e-017 -0.164399 -0.9863939 4.938938e-017 -0.164399 -0.9863939 4.938938e-017 -0.164399 -0.9863939 4.938938e-017 -0.164399 -0.9863939 4.938938e-017 -0.164399 -0.9863939 4.938938e-017 -0.164399 -0.9863939 4.938938e-017 -0.164399 -0.9863939 4.938938e-017 -0.164399 -0.9863939 4.938938e-017 -0.164399 -0.9863939 4.938938e-017 -0.164399</float_array>
                    <technique_common>
                        <accessor count="50" source="#ID94" stride="3">
                            <param name="X" type="float" />
                            <param name="Y" type="float" />
                            <param name="Z" type="float" />
                        </accessor>
                    </technique_common>
                </source>
                <vertices id="ID92">
                    <input semantic="POSITION" source="#ID90" />
                    <input semantic="NORMAL" source="#ID91" />
                </vertices>
                <triangles count="31" material="Material2">
                    <input offset="0" semantic="VERTEX" source="#ID92" />
                    <p>0 1 2 1 0 3 3 0 4 4 0 5 3 4 6 6 4 7 4 5 8 8 5 9 8 9 10 10 9 11 11 9 12 12 9 13 13 9 14 9 5 15 15 5 16 16 5 17 17 5 18 18 5 19 1 19 2 19 1 14 19 14 20 20 14 9 20 9 21 20 21 22 20 22 23 20 23 24 19 20 18 16 23 22 23 16 17 6 12 3 12 6 11</p>
                </triangles>
                <triangles count="31" material="Material3">
                    <input offset="0" semantic="VERTEX" source="#ID92" />
                    <p>25 26 27 28 27 26 29 30 31 32 31 30 33 34 35 36 31 34 31 32 34 32 37 34 37 38 34 38 39 34 34 39 35 39 40 35 41 35 40 35 42 33 33 42 29 29 42 30 30 42 43 43 42 38 39 38 44 44 38 27 27 38 25 25 38 45 45 38 46 38 42 46 46 42 47 48 47 26 26 47 28 42 49 47 47 49 28 28 49 40 41 40 49</p>
                </triangles>
            </mesh>
        </geometry>
        <geometry id="ID95">
            <mesh>
                <source id="ID96">
                    <float_array id="ID99" count="30">31.66571 244.9783 68.51491 28.78545 177.9528 85.79643 31.66571 177.9528 68.51491 28.65601 177.9528 86.57312 28.65601 248.4576 86.57312 28.65601 248.4576 86.57312 31.66571 244.9783 68.51491 28.65601 177.9528 86.57312 28.78545 177.9528 85.79643 31.66571 177.9528 68.51491</float_array>
                    <technique_common>
                        <accessor count="10" source="#ID99" stride="3">
                            <param name="X" type="float" />
                            <param name="Y" type="float" />
                            <param name="Z" type="float" />
                        </accessor>
                    </technique_common>
                </source>
                <source id="ID97">
                    <float_array id="ID100" count="30">0.9863939 -9.800828e-017 0.164399 0.9863939 -9.800828e-017 0.164399 0.9863939 -9.800828e-017 0.164399 0.9863939 -9.800828e-017 0.164399 0.9863939 -9.800828e-017 0.164399 -0.9863939 9.800828e-017 -0.164399 -0.9863939 9.800828e-017 -0.164399 -0.9863939 9.800828e-017 -0.164399 -0.9863939 9.800828e-017 -0.164399 -0.9863939 9.800828e-017 -0.164399</float_array>
                    <technique_common>
                        <accessor count="10" source="#ID100" stride="3">
                            <param name="X" type="float" />
                            <param name="Y" type="float" />
                            <param name="Z" type="float" />
                        </accessor>
                    </technique_common>
                </source>
                <vertices id="ID98">
                    <input semantic="POSITION" source="#ID96" />
                    <input semantic="NORMAL" source="#ID97" />
                </vertices>
                <triangles count="3" material="Material2">
                    <input offset="0" semantic="VERTEX" source="#ID98" />
                    <p>0 1 2 1 0 3 3 0 4</p>
                </triangles>
                <triangles count="3" material="Material3">
                    <input offset="0" semantic="VERTEX" source="#ID98" />
                    <p>5 6 7 7 6 8 9 8 6</p>
                </triangles>
            </mesh>
        </geometry>
        <geometry id="ID101">
            <mesh>
                <source id="ID102">
                    <float_array id="ID105" count="30">31.66571 109.5341 68.51491 28.65601 176.378 86.57312 28.65601 105.9429 86.57312 31.66571 176.378 68.51491 28.78545 176.378 85.79643 28.78545 176.378 85.79643 31.66571 176.378 68.51491 28.65601 176.378 86.57312 31.66571 109.5341 68.51491 28.65601 105.9429 86.57312</float_array>
                    <technique_common>
                        <accessor count="10" source="#ID105" stride="3">
                            <param name="X" type="float" />
                            <param name="Y" type="float" />
                            <param name="Z" type="float" />
                        </accessor>
                    </technique_common>
                </source>
                <source id="ID103">
                    <float_array id="ID106" count="30">0.9863939 -1.186874e-017 0.164399 0.9863939 -1.186874e-017 0.164399 0.9863939 -1.186874e-017 0.164399 0.9863939 -1.186874e-017 0.164399 0.9863939 -1.186874e-017 0.164399 -0.9863939 1.186874e-017 -0.164399 -0.9863939 1.186874e-017 -0.164399 -0.9863939 1.186874e-017 -0.164399 -0.9863939 1.186874e-017 -0.164399 -0.9863939 1.186874e-017 -0.164399</float_array>
                    <technique_common>
                        <accessor count="10" source="#ID106" stride="3">
                            <param name="X" type="float" />
                            <param name="Y" type="float" />
                            <param name="Z" type="float" />
                        </accessor>
                    </technique_common>
                </source>
                <vertices id="ID104">
                    <input semantic="POSITION" source="#ID102" />
                    <input semantic="NORMAL" source="#ID103" />
                </vertices>
                <triangles count="3" material="Material2">
                    <input offset="0" semantic="VERTEX" source="#ID104" />
                    <p>0 1 2 1 0 3 1 3 4</p>
                </triangles>
                <triangles count="3" material="Material3">
                    <input offset="0" semantic="VERTEX" source="#ID104" />
                    <p>5 6 7 6 8 7 9 7 8</p>
                </triangles>
            </mesh>
        </geometry>
        <geometry id="ID107">
            <mesh>
                <source id="ID108">
                    <float_array id="ID111" count="36">34.80486 113.2798 49.68001 31.9246 176.378 66.96153 31.9246 109.843 66.96153 34.93431 113.4342 48.90333 34.93431 176.378 48.90333 34.80486 176.378 49.68001 34.80486 176.378 49.68001 34.93431 176.378 48.90333 31.9246 176.378 66.96153 34.93431 113.4342 48.90333 34.80486 113.2798 49.68001 31.9246 109.843 66.96153</float_array>
                    <technique_common>
                        <accessor count="12" source="#ID111" stride="3">
                            <param name="X" type="float" />
                            <param name="Y" type="float" />
                            <param name="Z" type="float" />
                        </accessor>
                    </technique_common>
                </source>
                <source id="ID109">
                    <float_array id="ID112" count="36">0.9863939 -2.244037e-017 0.164399 0.9863939 -2.244037e-017 0.164399 0.9863939 -2.244037e-017 0.164399 0.9863939 -2.244037e-017 0.164399 0.9863939 -2.244037e-017 0.164399 0.9863939 -2.244037e-017 0.164399 -0.9863939 2.244037e-017 -0.164399 -0.9863939 2.244037e-017 -0.164399 -0.9863939 2.244037e-017 -0.164399 -0.9863939 2.244037e-017 -0.164399 -0.9863939 2.244037e-017 -0.164399 -0.9863939 2.244037e-017 -0.164399</float_array>
                    <technique_common>
                        <accessor count="12" source="#ID112" stride="3">
                            <param name="X" type="float" />
                            <param name="Y" type="float" />
                            <param name="Z" type="float" />
                        </accessor>
                    </technique_common>
                </source>
                <vertices id="ID110">
                    <input semantic="POSITION" source="#ID108" />
                    <input semantic="NORMAL" source="#ID109" />
                </vertices>
                <triangles count="4" material="Material2">
                    <input offset="0" semantic="VERTEX" source="#ID110" />
                    <p>0 1 2 1 0 3 1 3 4 1 4 5</p>
                </triangles>
                <triangles count="4" material="Material3">
                    <input offset="0" semantic="VERTEX" source="#ID110" />
                    <p>6 7 8 7 9 8 9 10 8 11 8 10</p>
                </triangles>
            </mesh>
        </geometry>
        <geometry id="ID113">
            <mesh>
                <source id="ID114">
                    <float_array id="ID117" count="30">34.93431 241.1996 48.90333 34.80486 177.9528 49.68001 34.93431 177.9528 48.90333 31.9246 177.9528 66.96153 31.9246 244.679 66.96153 31.9246 244.679 66.96153 34.93431 241.1996 48.90333 31.9246 177.9528 66.96153 34.80486 177.9528 49.68001 34.93431 177.9528 48.90333</float_array>
                    <technique_common>
                        <accessor count="10" source="#ID117" stride="3">
                            <param name="X" type="float" />
                            <param name="Y" type="float" />
                            <param name="Z" type="float" />
                        </accessor>
                    </technique_common>
                </source>
                <source id="ID115">
                    <float_array id="ID118" count="30">0.9863939 7.09805e-017 0.164399 0.9863939 7.09805e-017 0.164399 0.9863939 7.09805e-017 0.164399 0.9863939 7.09805e-017 0.164399 0.9863939 7.09805e-017 0.164399 -0.9863939 -7.09805e-017 -0.164399 -0.9863939 -7.09805e-017 -0.164399 -0.9863939 -7.09805e-017 -0.164399 -0.9863939 -7.09805e-017 -0.164399 -0.9863939 -7.09805e-017 -0.164399</float_array>
                    <technique_common>
                        <accessor count="10" source="#ID118" stride="3">
                            <param name="X" type="float" />
                            <param name="Y" type="float" />
                            <param name="Z" type="float" />
                        </accessor>
                    </technique_common>
                </source>
                <vertices id="ID116">
                    <input semantic="POSITION" source="#ID114" />
                    <input semantic="NORMAL" source="#ID115" />
                </vertices>
                <triangles count="3" material="Material2">
                    <input offset="0" semantic="VERTEX" source="#ID116" />
                    <p>0 1 2 1 0 3 3 0 4</p>
                </triangles>
                <triangles count="3" material="Material3">
                    <input offset="0" semantic="VERTEX" source="#ID116" />
                    <p>5 6 7 7 6 8 9 8 6</p>
                </triangles>
            </mesh>
        </geometry>
        <geometry id="ID119">
            <mesh>
                <source id="ID120">
                    <float_array id="ID123" count="24">121.825 334.6457 177.1654 23.39982 19.68504 118.1102 23.39982 334.6457 118.1102 121.825 19.68504 177.1654 220.2502 334.6457 118.1102 121.825 19.68504 177.1654 121.825 334.6457 177.1654 220.2502 19.68504 118.1102</float_array>
                    <technique_common>
                        <accessor count="8" source="#ID123" stride="3">
                            <param name="X" type="float" />
                            <param name="Y" type="float" />
                            <param name="Z" type="float" />
                        </accessor>
                    </technique_common>
                </source>
                <source id="ID121">
                    <float_array id="ID124" count="24">0.5144958 0 -0.8574929 0.5144958 0 -0.8574929 0.5144958 0 -0.8574929 0.5144958 0 -0.8574929 -0.5144958 7.597793e-018 -0.8574929 -0.5144958 7.597793e-018 -0.8574929 -0.5144958 7.597793e-018 -0.8574929 -0.5144958 7.597793e-018 -0.8574929</float_array>
                    <technique_common>
                        <accessor count="8" source="#ID124" stride="3">
                            <param name="X" type="float" />
                            <param name="Y" type="float" />
                            <param name="Z" type="float" />
                        </accessor>
                    </technique_common>
                </source>
                <vertices id="ID122">
                    <input semantic="POSITION" source="#ID120" />
                    <input semantic="NORMAL" source="#ID121" />
                </vertices>
                <triangles count="4" material="Material2">
                    <input offset="0" semantic="VERTEX" source="#ID122" />
                    <p>0 1 2 1 0 3 4 5 6 5 4 7</p>
                </triangles>
            </mesh>
        </geometry>
        <geometry id="ID125">
            <mesh>
                <source id="ID126">
                    <float_array id="ID129" count="21">200.5652 334.6457 3.552714e-015 43.08486 19.68504 3.552714e-015 43.08486 334.6457 3.552714e-015 92.67914 19.68504 2.43388e-015 121.825 19.68504 0 150.9709 19.68504 8.537356e-016 200.5652 19.68504 1.421085e-014</float_array>
                    <technique_common>
                        <accessor count="7" source="#ID129" stride="3">
                            <param name="X" type="float" />
                            <param name="Y" type="float" />
                            <param name="Z" type="float" />
                        </accessor>
                    </technique_common>
                </source>
                <source id="ID127">
                    <float_array id="ID130" count="21">2.993202e-017 -2.087636e-018 -1 2.993202e-017 -2.087636e-018 -1 2.993202e-017 -2.087636e-018 -1 2.993202e-017 -2.087636e-018 -1 2.993202e-017 -2.087636e-018 -1 2.993202e-017 -2.087636e-018 -1 2.993202e-017 -2.087636e-018 -1</float_array>
                    <technique_common>
                        <accessor count="7" source="#ID130" stride="3">
                            <param name="X" type="float" />
                            <param name="Y" type="float" />
                            <param name="Z" type="float" />
                        </accessor>
                    </technique_common>
                </source>
                <vertices id="ID128">
                    <input semantic="POSITION" source="#ID126" />
                    <input semantic="NORMAL" source="#ID127" />
                </vertices>
                <triangles count="5" material="Material2">
                    <input offset="0" semantic="VERTEX" source="#ID128" />
                    <p>0 1 2 1 0 3 3 0 4 4 0 5 5 0 6</p>
                </triangles>
            </mesh>
        </geometry>
        <geometry id="ID131">
            <mesh>
                <source id="ID132">
                    <float_array id="ID135" count="51">6.520038 354.3307 107.9824 23.39982 334.6457 118.1102 6.520038 0 107.9824 121.825 354.3307 177.1654 121.825 334.6457 177.1654 23.39982 19.68504 118.1102 121.825 0 177.1654 121.825 19.68504 177.1654 237.13 354.3307 107.9824 121.825 334.6457 177.1654 121.825 354.3307 177.1654 220.2502 334.6457 118.1102 220.2502 19.68504 118.1102 121.825 0 177.1654 121.825 19.68504 177.1654 237.13 0 107.9824 237.13 310.7319 107.9824</float_array>
                    <technique_common>
                        <accessor count="17" source="#ID135" stride="3">
                            <param name="X" type="float" />
                            <param name="Y" type="float" />
                            <param name="Z" type="float" />
                        </accessor>
                    </technique_common>
                </source>
                <source id="ID133">
                    <float_array id="ID136" count="51">0.5144958 2.045399e-018 -0.8574929 0.5144958 2.045399e-018 -0.8574929 0.5144958 2.045399e-018 -0.8574929 0.5144958 2.045399e-018 -0.8574929 0.5144958 2.045399e-018 -0.8574929 0.5144958 2.045399e-018 -0.8574929 0.5144958 2.045399e-018 -0.8574929 0.5144958 2.045399e-018 -0.8574929 -0.5144958 -7.754933e-018 -0.8574929 -0.5144958 -7.754933e-018 -0.8574929 -0.5144958 -7.754933e-018 -0.8574929 -0.5144958 -7.754933e-018 -0.8574929 -0.5144958 -7.754933e-018 -0.8574929 -0.5144958 -7.754933e-018 -0.8574929 -0.5144958 -7.754933e-018 -0.8574929 -0.5144958 -7.754933e-018 -0.8574929 -0.5144958 -7.754933e-018 -0.8574929</float_array>
                    <technique_common>
                        <accessor count="17" source="#ID136" stride="3">
                            <param name="X" type="float" />
                            <param name="Y" type="float" />
                            <param name="Z" type="float" />
                        </accessor>
                    </technique_common>
                </source>
                <vertices id="ID134">
                    <input semantic="POSITION" source="#ID132" />
                    <input semantic="NORMAL" source="#ID133" />
                </vertices>
                <triangles count="13" material="Material2">
                    <input offset="0" semantic="VERTEX" source="#ID134" />
                    <p>0 1 2 1 0 3 1 3 4 2 5 6 5 2 1 6 5 7 8 9 10 9 8 11 11 8 12 12 13 14 13 12 15 15 12 8 15 8 16</p>
                </triangles>
            </mesh>
        </geometry>
        <geometry id="ID137">
            <mesh>
                <source id="ID138">
                    <float_array id="ID141" count="30">214.7807 175.0231 85.29311 211.771 107.9976 67.2349 214.7807 104.5183 85.29311 211.771 175.0231 67.2349 214.6512 175.0231 84.51642 214.6512 175.0231 84.51642 214.7807 175.0231 85.29311 211.771 175.0231 67.2349 211.771 107.9976 67.2349 214.7807 104.5183 85.29311</float_array>
                    <technique_common>
                        <accessor count="10" source="#ID141" stride="3">
                            <param name="X" type="float" />
                            <param name="Y" type="float" />
                            <param name="Z" type="float" />
                        </accessor>
                    </technique_common>
                </source>
                <source id="ID139">
                    <float_array id="ID142" count="30">-0.9863939 9.109648e-017 0.164399 -0.9863939 9.109648e-017 0.164399 -0.9863939 9.109648e-017 0.164399 -0.9863939 9.109648e-017 0.164399 -0.9863939 9.109648e-017 0.164399 0.9863939 -9.109648e-017 -0.164399 0.9863939 -9.109648e-017 -0.164399 0.9863939 -9.109648e-017 -0.164399 0.9863939 -9.109648e-017 -0.164399 0.9863939 -9.109648e-017 -0.164399</float_array>
                    <technique_common>
                        <accessor count="10" source="#ID142" stride="3">
                            <param name="X" type="float" />
                            <param name="Y" type="float" />
                            <param name="Z" type="float" />
                        </accessor>
                    </technique_common>
                </source>
                <vertices id="ID140">
                    <input semantic="POSITION" source="#ID138" />
                    <input semantic="NORMAL" source="#ID139" />
                </vertices>
                <triangles count="3" material="Material2">
                    <input offset="0" semantic="VERTEX" source="#ID140" />
                    <p>0 1 2 1 0 3 3 0 4</p>
                </triangles>
                <triangles count="3" material="Material3">
                    <input offset="0" semantic="VERTEX" source="#ID140" />
                    <p>5 6 7 7 6 8 9 8 6</p>
                </triangles>
            </mesh>
        </geometry>
        <geometry id="ID143">
            <mesh>
                <source id="ID144">
                    <float_array id="ID147" count="150">215.8593 253.71 91.76467 214.7807 104.5183 85.29311 215.8593 97.91111 91.76467 214.7807 175.0231 85.29311 214.7807 176.5979 85.29311 214.6512 175.0231 84.51642 211.771 175.0231 67.2349 211.5121 175.0231 65.68153 208.6318 176.5979 48.4 214.7807 247.033 85.29311 207.0921 107.1324 39.16141 211.771 107.9976 67.2349 211.5121 108.2969 65.68153 208.5024 111.7762 47.62332 207.0921 244.4887 39.16141 208.5024 175.0231 47.62332 208.5024 176.5979 47.62332 208.5024 239.5416 47.62332 208.6318 239.6961 48.4 211.5121 243.1329 65.68153 211.771 243.4418 67.2349 211.5121 176.5979 65.68153 214.6512 176.5979 84.51642 211.771 176.5979 67.2349 208.6318 175.0231 48.4 211.5121 175.0231 65.68153 211.771 175.0231 67.2349 211.5121 108.2969 65.68153 211.771 107.9976 67.2349 208.6318 176.5979 48.4 208.5024 176.5979 47.62332 208.5024 175.0231 47.62332 208.6318 175.0231 48.4 211.5121 243.1329 65.68153 211.771 243.4418 67.2349 211.5121 176.5979 65.68153 211.771 176.5979 67.2349 214.6512 176.5979 84.51642 214.7807 176.5979 85.29311 215.8593 253.71 91.76467 214.7807 247.033 85.29311 207.0921 244.4887 39.16141 208.6318 239.6961 48.4 208.5024 239.5416 47.62332 208.5024 111.7762 47.62332 207.0921 107.1324 39.16141 214.7807 104.5183 85.29311 215.8593 97.91111 91.76467 214.6512 175.0231 84.51642 214.7807 175.0231 85.29311</float_array>
                    <technique_common>
                        <accessor count="50" source="#ID147" stride="3">
                            <param name="X" type="float" />
                            <param name="Y" type="float" />
                            <param name="Z" type="float" />
                        </accessor>
                    </technique_common>
                </source>
                <source id="ID145">
                    <float_array id="ID148" count="150">-0.9863939 1.126424e-017 0.164399 -0.9863939 1.126424e-017 0.164399 -0.9863939 1.126424e-017 0.164399 -0.9863939 1.126424e-017 0.164399 -0.9863939 1.126424e-017 0.164399 -0.9863939 1.126424e-017 0.164399 -0.9863939 1.126424e-017 0.164399 -0.9863939 1.126424e-017 0.164399 -0.9863939 1.126424e-017 0.164399 -0.9863939 1.126424e-017 0.164399 -0.9863939 1.126424e-017 0.164399 -0.9863939 1.126424e-017 0.164399 -0.9863939 1.126424e-017 0.164399 -0.9863939 1.126424e-017 0.164399 -0.9863939 1.126424e-017 0.164399 -0.9863939 1.126424e-017 0.164399 -0.9863939 1.126424e-017 0.164399 -0.9863939 1.126424e-017 0.164399 -0.9863939 1.126424e-017 0.164399 -0.9863939 1.126424e-017 0.164399 -0.9863939 1.126424e-017 0.164399 -0.9863939 1.126424e-017 0.164399 -0.9863939 1.126424e-017 0.164399 -0.9863939 1.126424e-017 0.164399 -0.9863939 1.126424e-017 0.164399 0.9863939 -1.126424e-017 -0.164399 0.9863939 -1.126424e-017 -0.164399 0.9863939 -1.126424e-017 -0.164399 0.9863939 -1.126424e-017 -0.164399 0.9863939 -1.126424e-017 -0.164399 0.9863939 -1.126424e-017 -0.164399 0.9863939 -1.126424e-017 -0.164399 0.9863939 -1.126424e-017 -0.164399 0.9863939 -1.126424e-017 -0.164399 0.9863939 -1.126424e-017 -0.164399 0.9863939 -1.126424e-017 -0.164399 0.9863939 -1.126424e-017 -0.164399 0.9863939 -1.126424e-017 -0.164399 0.9863939 -1.126424e-017 -0.164399 0.9863939 -1.126424e-017 -0.164399 0.9863939 -1.126424e-017 -0.164399 0.9863939 -1.126424e-017 -0.164399 0.9863939 -1.126424e-017 -0.164399 0.9863939 -1.126424e-017 -0.164399 0.9863939 -1.126424e-017 -0.164399 0.9863939 -1.126424e-017 -0.164399 0.9863939 -1.126424e-017 -0.164399 0.9863939 -1.126424e-017 -0.164399 0.9863939 -1.126424e-017 -0.164399 0.9863939 -1.126424e-017 -0.164399</float_array>
                    <technique_common>
                        <accessor count="50" source="#ID148" stride="3">
                            <param name="X" type="float" />
                            <param name="Y" type="float" />
                            <param name="Z" type="float" />
                        </accessor>
                    </technique_common>
                </source>
                <vertices id="ID146">
                    <input semantic="POSITION" source="#ID144" />
                    <input semantic="NORMAL" source="#ID145" />
                </vertices>
                <triangles count="31" material="Material2">
                    <input offset="0" semantic="VERTEX" source="#ID146" />
                    <p>0 1 2 1 0 3 3 0 4 3 4 5 5 4 6 6 4 7 7 4 8 4 0 9 1 10 2 10 1 11 10 11 12 10 12 13 10 13 14 14 13 15 14 15 16 14 16 17 14 17 18 14 18 19 14 19 20 14 20 9 14 9 0 4 21 8 21 4 22 21 22 23 21 23 20 21 20 19 7 15 24 15 7 16 16 7 8 6 12 11 12 6 7</p>
                </triangles>
                <triangles count="31" material="Material3">
                    <input offset="0" semantic="VERTEX" source="#ID146" />
                    <p>25 26 27 28 27 26 29 25 30 30 25 31 32 31 25 33 34 35 34 36 35 36 37 35 37 38 35 29 35 38 39 40 41 40 34 41 34 33 41 33 42 41 42 43 41 43 30 41 30 31 41 31 44 41 41 44 45 44 27 45 27 28 45 28 46 45 47 45 46 40 39 38 29 38 25 25 38 26 26 38 48 48 38 49 38 39 49 49 39 46 47 46 39</p>
                </triangles>
            </mesh>
        </geometry>
        <geometry id="ID149">
            <mesh>
                <source id="ID152">
                    <float_array id="ID154" count="6">28.65601 176.378 86.57312 28.65601 177.9528 86.57312</float_array>
                    <technique_common>
                        <accessor count="2" source="#ID154" stride="3">
                            <param name="X" type="float" />
                            <param name="Y" type="float" />
                            <param name="Z" type="float" />
                        </accessor>
                    </technique_common>
                </source>
                <vertices id="ID153">
                    <input semantic="POSITION" source="#ID152" />
                </vertices>
                <lines count="1" material="Material2">
                    <input offset="0" semantic="VERTEX" source="#ID153" />
                    <p>1 0</p>
                </lines>
            </mesh>
        </geometry>
        <geometry id="ID155">
            <mesh>
                <source id="ID156">
                    <float_array id="ID158" count="6">34.93431 176.378 48.90333 34.93431 177.9528 48.90333</float_array>
                    <technique_common>
                        <accessor count="2" source="#ID158" stride="3">
                            <param name="X" type="float" />
                            <param name="Y" type="float" />
                            <param name="Z" type="float" />
                        </accessor>
                    </technique_common>
                </source>
                <vertices id="ID157">
                    <input semantic="POSITION" source="#ID156" />
                </vertices>
                <lines count="1" material="Material2">
                    <input offset="0" semantic="VERTEX" source="#ID157" />
                    <p>1 0</p>
                </lines>
            </mesh>
        </geometry>
        <geometry id="ID159">
            <mesh>
                <source id="ID160">
                    <float_array id="ID162" count="6">31.9246 109.843 66.96153 31.66571 109.5341 68.51491</float_array>
                    <technique_common>
                        <accessor count="2" source="#ID162" stride="3">
                            <param name="X" type="float" />
                            <param name="Y" type="float" />
                            <param name="Z" type="float" />
                        </accessor>
                    </technique_common>
                </source>
                <vertices id="ID161">
                    <input semantic="POSITION" source="#ID160" />
                </vertices>
                <lines count="1" material="Material2">
                    <input offset="0" semantic="VERTEX" source="#ID161" />
                    <p>1 0</p>
                </lines>
            </mesh>
        </geometry>
        <geometry id="ID163">
            <mesh>
                <source id="ID164">
                    <float_array id="ID166" count="6">31.9246 244.679 66.96153 31.66571 244.9783 68.51491</float_array>
                    <technique_common>
                        <accessor count="2" source="#ID166" stride="3">
                            <param name="X" type="float" />
                            <param name="Y" type="float" />
                            <param name="Z" type="float" />
                        </accessor>
                    </technique_common>
                </source>
                <vertices id="ID165">
                    <input semantic="POSITION" source="#ID164" />
                </vertices>
                <lines count="1" material="Material2">
                    <input offset="0" semantic="VERTEX" source="#ID165" />
                    <p>1 0</p>
                </lines>
            </mesh>
        </geometry>
    </library_geometries>
    <library_materials>
        <material id="ID4" name="_0020_Red">
            <instance_effect url="#ID5" />
        </material>
        <material id="ID12" name="Color_A01">
            <instance_effect url="#ID13" />
        </material>
        <material id="ID21" name="material">
            <instance_effect url="#ID20" />
        </material>
        <material id="ID25" name="_0100_SteelBlue">
            <instance_effect url="#ID26" />
        </material>
        <material id="ID33" name="Color_H10">
            <instance_effect url="#ID34" />
        </material>
        <material id="ID41" name="_0091_MintCream">
            <instance_effect url="#ID42" />
        </material>
        <material id="ID67" name="Color_I18">
            <instance_effect url="#ID68" />
        </material>
        <material id="ID150" name="edge_color000255">
            <instance_effect url="#ID151" />
        </material>
    </library_materials>
    <library_effects>
        <effect id="ID5">
            <profile_COMMON>
                <technique sid="COMMON">
                    <lambert>
                        <diffuse>
                            <color>1 0 0 1</color>
                        </diffuse>
                    </lambert>
                </technique>
            </profile_COMMON>
        </effect>
        <effect id="ID13">
            <profile_COMMON>
                <technique sid="COMMON">
                    <lambert>
                        <diffuse>
                            <color>1 0 0 1</color>
                        </diffuse>
                    </lambert>
                </technique>
            </profile_COMMON>
        </effect>
        <effect id="ID20">
            <profile_COMMON>
                <technique sid="COMMON">
                    <lambert>
                        <diffuse>
                            <color>1 1 1 1</color>
                        </diffuse>
                    </lambert>
                </technique>
            </profile_COMMON>
        </effect>
        <effect id="ID26">
            <profile_COMMON>
                <technique sid="COMMON">
                    <lambert>
                        <diffuse>
                            <color>0.2745098 0.5098039 0.7058824 1</color>
                        </diffuse>
                    </lambert>
                </technique>
            </profile_COMMON>
        </effect>
        <effect id="ID34">
            <profile_COMMON>
                <technique sid="COMMON">
                    <lambert>
                        <diffuse>
                            <color>0.6392157 0.8 0.8 1</color>
                        </diffuse>
                    </lambert>
                </technique>
            </profile_COMMON>
        </effect>
        <effect id="ID42">
            <profile_COMMON>
                <technique sid="COMMON">
                    <lambert>
                        <diffuse>
                            <color>0.9607843 1 0.9803922 1</color>
                        </diffuse>
                    </lambert>
                </technique>
            </profile_COMMON>
        </effect>
        <effect id="ID68">
            <profile_COMMON>
                <technique sid="COMMON">
                    <lambert>
                        <diffuse>
                            <color>0.1568627 0.1568627 0.4 1</color>
                        </diffuse>
                    </lambert>
                </technique>
            </profile_COMMON>
        </effect>
        <effect id="ID151">
            <profile_COMMON>
                <technique sid="COMMON">
                    <constant>
                        <transparent opaque="A_ONE">
                            <color>0 0 0 1</color>
                        </transparent>
                        <transparency>
                            <float>1</float>
                        </transparency>
                    </constant>
                </technique>
            </profile_COMMON>
        </effect>
    </library_effects>
    <scene>
        <instance_visual_scene url="#ID1" />
    </scene>
</COLLADA>
