<?xml version="1.0" encoding="utf-8"?>
<!-- Generated by IcoMoon.io -->
<!DOCTYPE svg PUBLIC "-//W3C//DTD SVG 1.1//EN" "http://www.w3.org/Graphics/SVG/1.1/DTD/svg11.dtd">
<svg version="1.1" xmlns="http://www.w3.org/2000/svg" xmlns:xlink="http://www.w3.org/1999/xlink" width="512" height="512" viewBox="0 0 512 512">
<g>
</g>
	<path d="M184.177 103.281c111.657 118.661 66.263 223.406 8.53 290.386l41.37 35.656c100.854-116.992 97.147-249.457-10.117-363.459l-39.782 37.417z" fill="#000000" />
	<path d="M257.096 61.061c111.401 132.772 111.145 266.906-0.758 387.911l40.079 37.079c131.41-142.060 132.28-305.438 2.519-460.103l-41.841 35.113z" fill="#000000" />
	<path d="M116.388 155.464c66.376 62.157 70.021 125.614 11.131 193.945l41.37 35.666c78.5-91.106 73.113-186.819-15.186-269.466l-37.315 39.854z" fill="#000000" />
</svg>
