{
	"object": {
		"uuid": "2183CDFA-DDA8-4620-A2E8-6B02591CBDAF",
		"type": "Group",
		"name": "asfalto.dae",
		"matrix": [0.029999999329447746,0,0,0,0,0.000023889801013865508,-0.02999999187886715,0,0,0.02999999187886715,0.000023889801013865508,0,0,0,0,1],
		"children": [
			{
				"uuid": "C0025DE3-3C89-4D4C-A03C-EF608B74079E",
				"type": "Object3D",
				"name": "SketchUp",
				"matrix": [1,0,0,0,0,1,0,0,0,0,1,0,0,0,0,1],
				"children": [
					{
						"uuid": "6D0F18B2-2F03-4372-9D83-BE4489E99175",
						"type": "Mesh",
						"matrix": [1,0,0,0,0,1,0,0,0,0,1,0,0,0,0,1],
						"geometry": "BE389315-B00B-4611-81BC-FE1D40098D0B",
						"material": "17EFA7E2-0004-4F6B-B94A-5A09FFDF34DB"
					},
					{
						"uuid": "AD843E8B-0F42-4A13-9B65-631EFA7D2C12",
						"type": "Mesh",
						"matrix": [1,0,0,0,0,1,0,0,0,0,1,0,0,0,0,1],
						"geometry": "CF3722E5-CE9C-40E1-81ED-6208B1A9B1E0",
						"material": "682AA616-0D6E-435F-A17A-088E6C5B6A51"
					},
					{
						"uuid": "CBE8AED5-60D0-44AB-BA68-3ADE1DA1DEBC",
						"type": "Mesh",
						"matrix": [1,0,0,0,0,1,0,0,0,0,1,0,0,0,0,1],
						"geometry": "95ABAAD0-91FC-4D81-B5E6-5C6FC65BFFE2",
						"material": "682AA616-0D6E-435F-A17A-088E6C5B6A51"
					},
					{
						"uuid": "8D0AA90B-230D-493C-96F7-E56B9FF08A66",
						"type": "Mesh",
						"matrix": [1,0,0,0,0,1,0,0,0,0,1,0,0,0,0,1],
						"geometry": "8FABC17C-B079-4DE0-B961-BEEB98B0CAB8",
						"material": "682AA616-0D6E-435F-A17A-088E6C5B6A51"
					},
					{
						"uuid": "7A6ED327-18FD-43D0-A6A7-26050C35E04A",
						"type": "Mesh",
						"matrix": [1,0,0,0,0,1,0,0,0,0,1,0,0,0,0,1],
						"geometry": "3698F56E-6180-4B83-B793-BF9658D4EE81",
						"material": "682AA616-0D6E-435F-A17A-088E6C5B6A51"
					},
					{
						"uuid": "36CE68AC-A8EA-440A-A0E2-009991CD999F",
						"type": "Mesh",
						"matrix": [1,0,0,0,0,1,0,0,0,0,1,0,0,0,0,1],
						"geometry": "22B48F07-34B2-4C32-A9D8-E96BB8567D2C",
						"material": "682AA616-0D6E-435F-A17A-088E6C5B6A51"
					},
					{
						"uuid": "75B91CE9-04B3-4F0F-8D44-7A80F317D95B",
						"type": "Mesh",
						"matrix": [1,0,0,0,0,1,0,0,0,0,1,0,0,0,0,1],
						"geometry": "7A095CCF-3BF8-4843-8EDF-3D9C92351F0F",
						"material": "682AA616-0D6E-435F-A17A-088E6C5B6A51"
					},
					{
						"uuid": "FEE83520-0F89-4E24-9CDB-C10F2A91864A",
						"type": "Mesh",
						"matrix": [1,0,0,0,0,1,0,0,0,0,1,0,0,0,0,1],
						"geometry": "8D6BA9A5-9FEF-4CAE-B51E-2860A0FA5903",
						"material": "682AA616-0D6E-435F-A17A-088E6C5B6A51"
					},
					{
						"uuid": "ACC163B0-9DD8-4375-90FD-1F380DFF6AAE",
						"type": "Mesh",
						"matrix": [1,0,0,0,0,1,0,0,0,0,1,0,0,0,0,1],
						"geometry": "7EE28995-D56C-43B8-B27B-EB3603B69DA9",
						"material": "682AA616-0D6E-435F-A17A-088E6C5B6A51"
					},
					{
						"uuid": "D0D6DEC3-7DAA-4FF7-BEC7-6F9AD4394B3E",
						"type": "Mesh",
						"matrix": [1,0,0,0,0,1,0,0,0,0,1,0,0,0,0,1],
						"geometry": "33F29361-F2F2-47D0-BE56-53C091397AE6",
						"material": "682AA616-0D6E-435F-A17A-088E6C5B6A51"
					},
					{
						"uuid": "68E4ED8E-CB4E-46E0-B4D0-3722322A2486",
						"type": "Mesh",
						"matrix": [1,0,0,0,0,1,0,0,0,0,1,0,0,0,0,1],
						"geometry": "5AFA4F81-E114-4E37-9BCC-A3C3CC06A126",
						"material": "682AA616-0D6E-435F-A17A-088E6C5B6A51"
					},
					{
						"uuid": "7C602E07-24FD-4E1A-883F-C8B4491E96EE",
						"type": "Mesh",
						"matrix": [1,0,0,0,0,1,0,0,0,0,1,0,0,0,0,1],
						"geometry": "9219D21D-604A-4EE8-8B78-DB23DFCFDAE8",
						"material": "682AA616-0D6E-435F-A17A-088E6C5B6A51"
					},
					{
						"uuid": "1BCE514C-AC75-48CF-BB48-49062FC19232",
						"type": "Mesh",
						"matrix": [1,0,0,0,0,1,0,0,0,0,1,0,0,0,0,1],
						"geometry": "30D80496-02D0-4E48-8FF0-A5AF001FBD6C",
						"material": "682AA616-0D6E-435F-A17A-088E6C5B6A51"
					},
					{
						"uuid": "A9C6A5B7-1DA7-4AB2-8B8D-81C5E82EECCF",
						"type": "Mesh",
						"matrix": [1,0,0,0,0,1,0,0,0,0,1,0,0,0,0,1],
						"geometry": "2006DB84-7884-4AB2-8E80-914F07B2B434",
						"material": "682AA616-0D6E-435F-A17A-088E6C5B6A51"
					},
					{
						"uuid": "6A7BC737-3591-455E-96EF-DB01A3650C13",
						"type": "Mesh",
						"matrix": [1,0,0,0,0,1,0,0,0,0,1,0,0,0,0,1],
						"geometry": "AE9F6E89-F968-4C3B-9BEC-112901E7D952",
						"material": "682AA616-0D6E-435F-A17A-088E6C5B6A51"
					},
					{
						"uuid": "D1EA7C80-FFA8-4732-A6BB-939B7BB4C0BB",
						"type": "Mesh",
						"matrix": [1,0,0,0,0,1,0,0,0,0,1,0,0,0,0,1],
						"geometry": "38DD33B3-7D15-464E-A9A3-1EA31C1E874E",
						"material": "682AA616-0D6E-435F-A17A-088E6C5B6A51"
					},
					{
						"uuid": "526439BB-D195-4ECD-94D7-E4617DD69E19",
						"type": "Mesh",
						"matrix": [1,0,0,0,0,1,0,0,0,0,1,0,0,0,0,1],
						"geometry": "E82022F8-D698-402C-917F-A3AA1DF5407D",
						"material": "682AA616-0D6E-435F-A17A-088E6C5B6A51"
					},
					{
						"uuid": "20A43A44-0FD8-4DBC-8ACD-0430480EE502",
						"type": "Mesh",
						"matrix": [1,0,0,0,0,1,0,0,0,0,1,0,0,0,0,1],
						"geometry": "9CFC6954-2BDE-4A37-B16E-4B1307FFB95F",
						"material": "682AA616-0D6E-435F-A17A-088E6C5B6A51"
					},
					{
						"uuid": "BEE1B2D5-E989-4E95-B08B-E241EEDF3455",
						"type": "Mesh",
						"matrix": [1,0,0,0,0,1,0,0,0,0,1,0,0,0,0,1],
						"geometry": "867EDB42-E796-4DED-8253-28D241EAB5A6",
						"material": "682AA616-0D6E-435F-A17A-088E6C5B6A51"
					},
					{
						"uuid": "34A636E7-D07B-406D-90D6-F268D463EFB1",
						"type": "Mesh",
						"matrix": [1,0,0,0,0,1,0,0,0,0,1,0,0,0,0,1],
						"geometry": "D6F6B832-507C-45C9-AB76-08A57826531E",
						"material": "AD54BBC1-DAE7-43EB-9FE1-33F4187764B8"
					},
					{
						"uuid": "38291D99-EBF4-48A5-B1DF-C3D8D9B79AD3",
						"type": "Mesh",
						"matrix": [1,0,0,0,0,1,0,0,0,0,1,0,0,0,0,1],
						"geometry": "DA593E71-2A56-475F-BCAB-112720482E5E",
						"material": "682AA616-0D6E-435F-A17A-088E6C5B6A51"
					},
					{
						"uuid": "C197832F-BA4D-4B6D-9BBF-8FF40203134D",
						"type": "Mesh",
						"matrix": [1,0,0,0,0,1,0,0,0,0,1,0,0,0,0,1],
						"geometry": "47ED744D-301A-4DA2-8878-61B5CC3A46AD",
						"material": "AD54BBC1-DAE7-43EB-9FE1-33F4187764B8"
					},
					{
						"uuid": "10D855E1-6CD3-4A37-8AFC-984D32B67369",
						"type": "Mesh",
						"matrix": [1,0,0,0,0,1,0,0,0,0,1,0,0,0,0,1],
						"geometry": "2D112B79-4817-4F65-B2ED-E4C2690E80CC",
						"material": "682AA616-0D6E-435F-A17A-088E6C5B6A51"
					},
					{
						"uuid": "5FD7F9EE-90FD-477E-B77F-6005A761F601",
						"type": "Mesh",
						"matrix": [1,0,0,0,0,1,0,0,0,0,1,0,0,0,0,1],
						"geometry": "C805116D-7B40-46F7-BA4A-65F0AEFE74D5",
						"material": "682AA616-0D6E-435F-A17A-088E6C5B6A51"
					},
					{
						"uuid": "03FE0983-50E0-4F6C-9104-BC4732158BD1",
						"type": "Mesh",
						"matrix": [1,0,0,0,0,1,0,0,0,0,1,0,0,0,0,1],
						"geometry": "10075B29-D98E-4721-863E-1A7C0A6A9B94",
						"material": "682AA616-0D6E-435F-A17A-088E6C5B6A51"
					},
					{
						"uuid": "FE87D276-3805-4781-8308-26326E6A672A",
						"type": "Mesh",
						"matrix": [1,0,0,0,0,1,0,0,0,0,1,0,0,0,0,1],
						"geometry": "55900E0B-3ABD-4142-AC5A-ED14763D9815",
						"material": "682AA616-0D6E-435F-A17A-088E6C5B6A51"
					},
					{
						"uuid": "2EDA635F-0459-4C48-9659-808FE829C106",
						"type": "Mesh",
						"matrix": [1,0,0,0,0,1,0,0,0,0,1,0,0,0,0,1],
						"geometry": "F531B3C3-82BE-4CA0-BBFF-863981B09F7D",
						"material": "1504B1E0-138D-4451-8F9D-41B0CB5AC7AA"
					},
					{
						"uuid": "FC6C1938-3EB5-4761-8C4F-625717BAE084",
						"type": "Mesh",
						"matrix": [1,0,0,0,0,1,0,0,0,0,1,0,0,0,0,1],
						"geometry": "77987EC8-9C1F-4262-80C3-C6BD944FC942",
						"material": "682AA616-0D6E-435F-A17A-088E6C5B6A51"
					},
					{
						"uuid": "16CF5101-E676-4953-81BE-9BCF3AC94FE9",
						"type": "Mesh",
						"matrix": [1,0,0,0,0,1,0,0,0,0,1,0,0,0,0,1],
						"geometry": "6AECF69B-CB25-4EF0-B046-0165A0DE8701",
						"material": "1504B1E0-138D-4451-8F9D-41B0CB5AC7AA"
					},
					{
						"uuid": "A65F138D-101A-446C-A28B-F333223AB537",
						"type": "Mesh",
						"matrix": [1,0,0,0,0,1,0,0,0,0,1,0,0,0,0,1],
						"geometry": "6288307A-CAEA-4A75-A2BC-AF3F45B2E382",
						"material": "1504B1E0-138D-4451-8F9D-41B0CB5AC7AA"
					},
					{
						"uuid": "5B9BF141-6D84-4F6E-A8B0-9B9BD24B989C",
						"type": "Mesh",
						"matrix": [1,0,0,0,0,1,0,0,0,0,1,0,0,0,0,1],
						"geometry": "2507A9FC-897A-46AA-8945-C51FAF2D4B2D",
						"material": "1504B1E0-138D-4451-8F9D-41B0CB5AC7AA"
					},
					{
						"uuid": "0769FB20-A608-4F32-860C-3EC3F1081A0B",
						"type": "Mesh",
						"matrix": [1,0,0,0,0,1,0,0,0,0,1,0,0,0,0,1],
						"geometry": "5CA1E45F-EAD8-411D-A016-50A6B5FFD3E5",
						"material": "1504B1E0-138D-4451-8F9D-41B0CB5AC7AA"
					},
					{
						"uuid": "2FCB741D-C736-49FC-99FD-E6C3EE6D434C",
						"type": "Mesh",
						"matrix": [1,0,0,0,0,1,0,0,0,0,1,0,0,0,0,1],
						"geometry": "F50CB805-C35B-4B06-81C0-C4060792D218",
						"material": "1504B1E0-138D-4451-8F9D-41B0CB5AC7AA"
					},
					{
						"uuid": "C8BC95F4-358F-4497-8468-EDE3FB5F3954",
						"type": "Mesh",
						"matrix": [1,0,0,0,0,1,0,0,0,0,1,0,0,0,0,1],
						"geometry": "AB4E4775-4CF3-4F77-8868-F0C54907C1DD",
						"material": "1504B1E0-138D-4451-8F9D-41B0CB5AC7AA"
					},
					{
						"uuid": "3CCA8DE8-12BB-4DC6-9D35-527FF75C23D9",
						"type": "Mesh",
						"matrix": [1,0,0,0,0,1,0,0,0,0,1,0,0,0,0,1],
						"geometry": "26F3B1FF-7599-4DA7-88E7-01490B1566A7",
						"material": "1504B1E0-138D-4451-8F9D-41B0CB5AC7AA"
					},
					{
						"uuid": "EC0BA548-FD24-46C5-8ECC-4B09C81C9D9C",
						"type": "Mesh",
						"matrix": [1,0,0,0,0,1,0,0,0,0,1,0,0,0,0,1],
						"geometry": "F1A6B08F-D780-4C01-A846-140977309EB1",
						"material": "1504B1E0-138D-4451-8F9D-41B0CB5AC7AA"
					},
					{
						"uuid": "8758949E-BA6C-4DD8-BF6B-3F1C22E9D054",
						"type": "Mesh",
						"matrix": [1,0,0,0,0,1,0,0,0,0,1,0,0,0,0,1],
						"geometry": "961710BA-C567-4DD3-AF52-49939E6D26FD",
						"material": "1504B1E0-138D-4451-8F9D-41B0CB5AC7AA"
					},
					{
						"uuid": "04343EF3-968B-4295-8B70-BD6B6F5660EF",
						"type": "Mesh",
						"matrix": [1,0,0,0,0,1,0,0,0,0,1,0,0,0,0,1],
						"geometry": "00B97E0B-903F-44D1-B9A2-80366C5424C5",
						"material": "1504B1E0-138D-4451-8F9D-41B0CB5AC7AA"
					},
					{
						"uuid": "F4129CBB-DB0E-488D-8B77-D1CA6BE6B7F4",
						"type": "Mesh",
						"matrix": [1,0,0,0,0,1,0,0,0,0,1,0,0,0,0,1],
						"geometry": "286D0443-EC61-45A3-BD83-0E4E219A5D76",
						"material": "682AA616-0D6E-435F-A17A-088E6C5B6A51"
					},
					{
						"uuid": "E52976E3-5C43-441B-A387-F388D13DD8EE",
						"type": "Mesh",
						"matrix": [1,0,0,0,0,1,0,0,0,0,1,0,0,0,0,1],
						"geometry": "0D06820C-5502-4781-A2C4-6C87163065C3",
						"material": "1504B1E0-138D-4451-8F9D-41B0CB5AC7AA"
					},
					{
						"uuid": "B2E66588-B95A-467F-9FC2-E40D253ADB18",
						"type": "Mesh",
						"matrix": [1,0,0,0,0,1,0,0,0,0,1,0,0,0,0,1],
						"geometry": "82D45F95-50F3-49F1-9FC5-9B9F71A119C7",
						"material": "1504B1E0-138D-4451-8F9D-41B0CB5AC7AA"
					},
					{
						"uuid": "38EF3866-5DE4-4456-9144-44A3E3F49AB3",
						"type": "Mesh",
						"matrix": [1,0,0,0,0,1,0,0,0,0,1,0,0,0,0,1],
						"geometry": "E6E9CB99-90B1-4494-BE3F-3F7FCDE3E324",
						"material": "682AA616-0D6E-435F-A17A-088E6C5B6A51"
					},
					{
						"uuid": "1832E7D4-67BF-4143-B63B-CCA0BC3F687F",
						"type": "Mesh",
						"matrix": [1,0,0,0,0,1,0,0,0,0,1,0,0,0,0,1],
						"geometry": "380CDD58-9148-438E-96AF-1419F45FC981",
						"material": "682AA616-0D6E-435F-A17A-088E6C5B6A51"
					},
					{
						"uuid": "261713C3-9A14-49FE-B84D-835C89E58CBA",
						"type": "Mesh",
						"matrix": [1,0,0,0,0,1,0,0,0,0,1,0,0,0,0,1],
						"geometry": "72D3AB91-8FE0-4954-B8BC-AC92C6DEB97E",
						"material": "682AA616-0D6E-435F-A17A-088E6C5B6A51"
					},
					{
						"uuid": "1752930E-A710-44FA-8FF5-DF7980904152",
						"type": "Mesh",
						"matrix": [1,0,0,0,0,1,0,0,0,0,1,0,0,0,0,1],
						"geometry": "17125BC8-A9B9-415C-8C20-9BD0244D3B14",
						"material": "682AA616-0D6E-435F-A17A-088E6C5B6A51"
					},
					{
						"uuid": "75162629-3B51-4AC0-9B4B-B542D336D3C3",
						"type": "Mesh",
						"matrix": [1,0,0,0,0,1,0,0,0,0,1,0,0,0,0,1],
						"geometry": "EEBFB59C-6259-48A9-AEDB-AF709B59E697",
						"material": "682AA616-0D6E-435F-A17A-088E6C5B6A51"
					}]
			}]
	},
	"metadata": {
		"version": 4.4,
		"type": "Object",
		"generator": "Object3D.toJSON"
	},
	"geometries": [
		{
			"uuid": "BE389315-B00B-4611-81BC-FE1D40098D0B",
			"type": "Geometry",
			"data": {
				"vertices": [787.4016,0,-33.46457,0,-3937.008,-33.46457,0,0,-33.46457,787.4016,-3937.008,-33.46457,787.4016,-3937.008,0,0,-3937.008,-33.46457,787.4016,-3937.008,-33.46457,0,-3937.008,0,771.3225,-3937.008,0,763.4484,-3937.008,0,403.5433,-3937.008,0,383.8583,-3937.008,0,23.62205,-3937.008,0,15.74803,-3937.008,0,0,0,0,0,-3937.008,-33.46457,0,-3937.008,0,0,0,-33.46457,0,0,0,787.4016,0,-33.46457,0,0,-33.46457,787.4016,0,0,15.74803,0,0,23.62205,0,0,763.4484,-4.547474e-13,0,771.3225,-4.547474e-13,0,787.4016,0,-33.46457,787.4016,-3937.008,0,787.4016,-3937.008,-33.46457,787.4016,0,0,787.4016,-3937.008,0,771.3225,-4.547474e-13,0,771.3225,-3937.008,0,787.4016,0,0,748.0315,-196.8504,0,50,-157.4803,0,39.37008,-196.8504,0,69.68504,-157.4803,0,89.37008,-157.4803,0,69.68504,-39.37008,0,109.0551,-157.4803,0,128.7402,-157.4803,0,109.0551,-39.37008,0,148.4252,-157.4803,0,168.1102,-157.4803,0,148.4252,-39.37008,0,187.7953,-157.4803,0,207.4803,-157.4803,0,187.7953,-39.37008,0,227.1654,-157.4803,0,246.8504,-157.4803,0,227.1654,-39.37008,0,266.5354,-157.4803,0,286.2205,-157.4803,0,266.5354,-39.37008,0,305.9055,-157.4803,0,325.5906,-157.4803,0,305.9055,-39.37008,0,345.2756,-157.4803,0,364.9606,-157.4803,0,345.2756,-39.37008,0,384.6457,-157.4803,0,404.3307,-157.4803,0,384.6457,-39.37008,0,424.0157,-157.4803,0,443.7008,-157.4803,0,424.0157,-39.37008,0,463.3858,-157.4803,0,483.0709,-157.4803,0,463.3858,-39.37008,0,502.7559,-157.4803,0,522.4409,-157.4803,0,502.7559,-39.37008,0,542.126,-157.4803,0,561.811,-157.4803,0,542.126,-39.37008,0,581.4961,-157.4803,0,601.1811,-157.4803,0,581.4961,-39.37008,0,620.8661,-157.4803,0,640.5512,-157.4803,0,620.8661,-39.37008,0,660.2362,-157.4803,0,679.9213,-157.4803,0,660.2362,-39.37008,0,699.6063,-157.4803,0,719.2913,-157.4803,0,699.6063,-39.37008,0,738.9764,-157.4803,0,738.9764,-39.37008,0,763.4484,-3937.008,0,403.5433,-3859.337,0,403.5433,-3937.008,0,403.5433,-3820.765,0,403.5433,-3702.655,0,403.5433,-3663.285,0,403.5433,-3545.175,0,403.5433,-3505.985,0,403.5433,-3387.875,0,403.5433,-3348.505,0,403.5433,-3230.394,0,403.5433,-3191.024,0,403.5433,-3072.914,0,403.5433,-3034.342,0,403.5433,-2916.232,0,403.5433,-2876.862,0,403.5433,-2758.752,0,403.5433,-2718.078,0,403.5433,-2599.968,0,403.5433,-2560.598,0,403.5433,-2442.488,0,403.5433,-2403.117,0,403.5433,-2285.007,0,403.5433,-2246.435,0,403.5433,-2128.325,0,403.5433,-2088.955,0,403.5433,-1970.845,0,403.5433,-1930.647,0,403.5433,-1812.537,0,403.5433,-1773.167,0,403.5433,-1655.057,0,403.5433,-1615.687,0,403.5433,-1497.576,0,403.5433,-1459.004,0,403.5433,-1340.894,0,403.5433,-1301.524,0,403.5433,-1183.414,0,403.5433,-1140.934,0,403.5433,-1022.824,0,403.5433,-983.454,0,403.5433,-865.3437,0,403.5433,-825.9736,0,403.5433,-707.8634,0,403.5433,-669.2913,0,403.5433,-551.1811,0,403.5433,-511.811,0,403.5433,-393.7008,0,403.5433,-354.3307,0,403.5433,-236.2205,0,748.0315,-216.5354,0,763.4484,-4.547474e-13,0,23.62205,0,0,50,-39.37008,0,39.37008,-216.5354,0,89.37008,-39.37008,0,128.7402,-39.37008,0,168.1102,-39.37008,0,207.4803,-39.37008,0,246.8504,-39.37008,0,286.2205,-39.37008,0,325.5906,-39.37008,0,364.9606,-39.37008,0,404.3307,-39.37008,0,443.7008,-39.37008,0,483.0709,-39.37008,0,522.4409,-39.37008,0,561.811,-39.37008,0,601.1811,-39.37008,0,640.5512,-39.37008,0,679.9213,-39.37008,0,719.2913,-39.37008,0,23.62205,-3937.008,0,383.8583,-3937.008,0,383.8583,-236.2205,0,383.8583,-3859.337,0,383.8583,-3820.765,0,383.8583,-3702.655,0,383.8583,-3663.285,0,383.8583,-3545.175,0,383.8583,-3505.985,0,383.8583,-3387.875,0,383.8583,-3348.505,0,383.8583,-3230.394,0,383.8583,-3191.024,0,383.8583,-3072.914,0,383.8583,-3034.342,0,383.8583,-2916.232,0,383.8583,-2876.862,0,383.8583,-2758.752,0,383.8583,-2718.078,0,383.8583,-2599.968,0,383.8583,-2560.598,0,383.8583,-2442.488,0,383.8583,-2403.117,0,383.8583,-2285.007,0,383.8583,-2246.435,0,383.8583,-2128.325,0,383.8583,-2088.955,0,383.8583,-1970.845,0,383.8583,-1930.647,0,383.8583,-1812.537,0,383.8583,-1773.167,0,383.8583,-1655.057,0,383.8583,-1615.687,0,383.8583,-1497.576,0,383.8583,-1459.004,0,383.8583,-1340.894,0,383.8583,-1301.524,0,383.8583,-1183.414,0,383.8583,-1140.934,0,383.8583,-1022.824,0,383.8583,-983.454,0,383.8583,-865.3437,0,383.8583,-825.9736,0,383.8583,-707.8634,0,383.8583,-669.2913,0,383.8583,-551.1811,0,383.8583,-511.811,0,383.8583,-393.7008,0,383.8583,-354.3307,0,15.74803,-3937.008,0,0,0,0,0,-3937.008,0,15.74803,0,0],
				"normals": [0,0,-1,-2.921432e-16,-1,5.095123e-15,-1,0,0,2.883208e-16,1,4.530591e-15,1,3.356153e-17,4.158097e-15,0,0,1],
				"faces": [32,0,1,2,0,0,0,32,1,0,3,0,0,0,32,4,5,6,1,1,1,32,5,4,7,1,1,1,32,7,4,8,1,1,1,32,7,8,9,1,1,1,32,7,9,10,1,1,1,32,7,10,11,1,1,1,32,7,11,12,1,1,1,32,7,12,13,1,1,1,32,14,15,16,2,2,2,32,15,14,17,2,2,2,32,18,19,20,3,3,3,32,19,18,21,3,3,3,32,21,18,22,3,3,3,32,21,22,23,3,3,3,32,21,23,24,3,3,3,32,21,24,25,3,3,3,32,26,27,28,4,4,4,32,27,26,29,4,4,4,32,30,31,32,5,5,5,32,31,30,33,5,5,5,32,34,35,36,5,5,5,32,35,34,37,5,5,5,32,37,34,38,5,5,5,32,37,38,39,5,5,5,32,38,34,40,5,5,5,32,40,34,41,5,5,5,32,40,41,42,5,5,5,32,41,34,43,5,5,5,32,43,34,44,5,5,5,32,43,44,45,5,5,5,32,44,34,46,5,5,5,32,46,34,47,5,5,5,32,46,47,48,5,5,5,32,47,34,49,5,5,5,32,49,34,50,5,5,5,32,49,50,51,5,5,5,32,50,34,52,5,5,5,32,52,34,53,5,5,5,32,52,53,54,5,5,5,32,53,34,55,5,5,5,32,55,34,56,5,5,5,32,55,56,57,5,5,5,32,56,34,58,5,5,5,32,58,34,59,5,5,5,32,58,59,60,5,5,5,32,59,34,61,5,5,5,32,61,34,62,5,5,5,32,61,62,63,5,5,5,32,62,34,64,5,5,5,32,64,34,65,5,5,5,32,64,65,66,5,5,5,32,65,34,67,5,5,5,32,67,34,68,5,5,5,32,67,68,69,5,5,5,32,68,34,70,5,5,5,32,70,34,71,5,5,5,32,70,71,72,5,5,5,32,71,34,73,5,5,5,32,73,34,74,5,5,5,32,73,74,75,5,5,5,32,74,34,76,5,5,5,32,76,34,77,5,5,5,32,76,77,78,5,5,5,32,77,34,79,5,5,5,32,79,34,80,5,5,5,32,79,80,81,5,5,5,32,80,34,82,5,5,5,32,82,34,83,5,5,5,32,82,83,84,5,5,5,32,83,34,85,5,5,5,32,85,34,86,5,5,5,32,85,86,87,5,5,5,32,86,34,88,5,5,5,32,88,34,89,5,5,5,32,90,91,92,5,5,5,32,91,90,93,5,5,5,32,93,90,94,5,5,5,32,94,90,95,5,5,5,32,95,90,96,5,5,5,32,96,90,97,5,5,5,32,97,90,98,5,5,5,32,98,90,99,5,5,5,32,99,90,100,5,5,5,32,100,90,101,5,5,5,32,101,90,102,5,5,5,32,102,90,103,5,5,5,32,103,90,104,5,5,5,32,104,90,105,5,5,5,32,105,90,106,5,5,5,32,106,90,107,5,5,5,32,107,90,108,5,5,5,32,108,90,109,5,5,5,32,109,90,110,5,5,5,32,110,90,111,5,5,5,32,111,90,112,5,5,5,32,112,90,113,5,5,5,32,113,90,114,5,5,5,32,114,90,115,5,5,5,32,115,90,116,5,5,5,32,116,90,117,5,5,5,32,117,90,118,5,5,5,32,118,90,119,5,5,5,32,119,90,120,5,5,5,32,120,90,121,5,5,5,32,121,90,122,5,5,5,32,122,90,123,5,5,5,32,123,90,124,5,5,5,32,124,90,125,5,5,5,32,125,90,126,5,5,5,32,126,90,127,5,5,5,32,127,90,128,5,5,5,32,128,90,129,5,5,5,32,129,90,130,5,5,5,32,130,90,131,5,5,5,32,131,90,132,5,5,5,32,132,90,133,5,5,5,32,133,90,134,5,5,5,32,134,90,135,5,5,5,32,135,90,136,5,5,5,32,136,90,137,5,5,5,32,137,90,138,5,5,5,32,138,90,139,5,5,5,32,139,90,34,5,5,5,32,34,90,140,5,5,5,32,141,142,140,5,5,5,32,142,141,36,5,5,5,32,36,141,143,5,5,5,32,142,36,35,5,5,5,32,140,142,39,5,5,5,32,140,39,144,5,5,5,32,144,39,38,5,5,5,32,140,144,42,5,5,5,32,140,42,145,5,5,5,32,145,42,41,5,5,5,32,140,145,45,5,5,5,32,140,45,146,5,5,5,32,146,45,44,5,5,5,32,140,146,48,5,5,5,32,140,48,147,5,5,5,32,147,48,47,5,5,5,32,140,147,51,5,5,5,32,140,51,148,5,5,5,32,148,51,50,5,5,5,32,140,148,54,5,5,5,32,140,54,149,5,5,5,32,149,54,53,5,5,5,32,140,149,57,5,5,5,32,140,57,150,5,5,5,32,150,57,56,5,5,5,32,140,150,60,5,5,5,32,140,60,151,5,5,5,32,151,60,59,5,5,5,32,140,151,63,5,5,5,32,140,63,152,5,5,5,32,152,63,62,5,5,5,32,140,152,66,5,5,5,32,140,66,153,5,5,5,32,153,66,65,5,5,5,32,140,153,69,5,5,5,32,140,69,154,5,5,5,32,154,69,68,5,5,5,32,140,154,72,5,5,5,32,140,72,155,5,5,5,32,155,72,71,5,5,5,32,140,155,75,5,5,5,32,140,75,156,5,5,5,32,156,75,74,5,5,5,32,140,156,78,5,5,5,32,140,78,157,5,5,5,32,157,78,77,5,5,5,32,140,157,81,5,5,5,32,140,81,158,5,5,5,32,158,81,80,5,5,5,32,140,158,84,5,5,5,32,140,84,159,5,5,5,32,159,84,83,5,5,5,32,140,159,87,5,5,5,32,140,87,160,5,5,5,32,160,87,86,5,5,5,32,140,160,89,5,5,5,32,140,89,34,5,5,5,32,161,143,141,5,5,5,32,143,161,162,5,5,5,32,143,162,163,5,5,5,32,143,163,139,5,5,5,32,163,162,164,5,5,5,32,163,164,165,5,5,5,32,163,165,166,5,5,5,32,163,166,167,5,5,5,32,163,167,168,5,5,5,32,163,168,169,5,5,5,32,163,169,170,5,5,5,32,163,170,171,5,5,5,32,163,171,172,5,5,5,32,163,172,173,5,5,5,32,163,173,174,5,5,5,32,163,174,175,5,5,5,32,163,175,176,5,5,5,32,163,176,177,5,5,5,32,163,177,178,5,5,5,32,163,178,179,5,5,5,32,163,179,180,5,5,5,32,163,180,181,5,5,5,32,163,181,182,5,5,5,32,163,182,183,5,5,5,32,163,183,184,5,5,5,32,163,184,185,5,5,5,32,163,185,186,5,5,5,32,163,186,187,5,5,5,32,163,187,188,5,5,5,32,163,188,189,5,5,5,32,163,189,190,5,5,5,32,163,190,191,5,5,5,32,163,191,192,5,5,5,32,163,192,193,5,5,5,32,163,193,194,5,5,5,32,163,194,195,5,5,5,32,163,195,196,5,5,5,32,163,196,197,5,5,5,32,163,197,198,5,5,5,32,163,198,199,5,5,5,32,163,199,200,5,5,5,32,163,200,201,5,5,5,32,163,201,202,5,5,5,32,163,202,203,5,5,5,32,163,203,204,5,5,5,32,163,204,205,5,5,5,32,163,205,206,5,5,5,32,163,206,207,5,5,5,32,163,207,208,5,5,5,32,163,208,209,5,5,5,32,139,163,138,5,5,5,32,136,209,208,5,5,5,32,209,136,137,5,5,5,32,134,207,206,5,5,5,32,207,134,135,5,5,5,32,132,205,204,5,5,5,32,205,132,133,5,5,5,32,130,203,202,5,5,5,32,203,130,131,5,5,5,32,128,201,200,5,5,5,32,201,128,129,5,5,5,32,126,199,198,5,5,5,32,199,126,127,5,5,5,32,124,197,196,5,5,5,32,197,124,125,5,5,5,32,122,195,194,5,5,5,32,195,122,123,5,5,5,32,120,193,192,5,5,5,32,193,120,121,5,5,5,32,118,191,190,5,5,5,32,191,118,119,5,5,5,32,116,189,188,5,5,5,32,189,116,117,5,5,5,32,114,187,186,5,5,5,32,187,114,115,5,5,5,32,112,185,184,5,5,5,32,185,112,113,5,5,5,32,110,183,182,5,5,5,32,183,110,111,5,5,5,32,108,181,180,5,5,5,32,181,108,109,5,5,5,32,106,179,178,5,5,5,32,179,106,107,5,5,5,32,104,177,176,5,5,5,32,177,104,105,5,5,5,32,102,175,174,5,5,5,32,175,102,103,5,5,5,32,100,173,172,5,5,5,32,173,100,101,5,5,5,32,98,171,170,5,5,5,32,171,98,99,5,5,5,32,96,169,168,5,5,5,32,169,96,97,5,5,5,32,94,167,166,5,5,5,32,167,94,95,5,5,5,32,91,165,164,5,5,5,32,165,91,93,5,5,5,32,210,211,212,5,5,5,32,211,210,213,5,5,5]
			}
		},
		{
			"uuid": "CF3722E5-CE9C-40E1-81ED-6208B1A9B1E0",
			"type": "Geometry",
			"data": {
				"vertices": [69.68504,-157.4803,0,50,-39.37008,0,50,-157.4803,0,69.68504,-39.37008,0],
				"normals": [0,0,1],
				"faces": [32,0,1,2,0,0,0,32,1,0,3,0,0,0]
			}
		},
		{
			"uuid": "95ABAAD0-91FC-4D81-B5E6-5C6FC65BFFE2",
			"type": "Geometry",
			"data": {
				"vertices": [109.0551,-157.4803,0,89.37008,-39.37008,0,89.37008,-157.4803,0,109.0551,-39.37008,0],
				"normals": [0,0,1],
				"faces": [32,0,1,2,0,0,0,32,1,0,3,0,0,0]
			}
		},
		{
			"uuid": "8FABC17C-B079-4DE0-B961-BEEB98B0CAB8",
			"type": "Geometry",
			"data": {
				"vertices": [148.4252,-157.4803,0,128.7402,-39.37008,0,128.7402,-157.4803,0,148.4252,-39.37008,0],
				"normals": [0,0,1],
				"faces": [32,0,1,2,0,0,0,32,1,0,3,0,0,0]
			}
		},
		{
			"uuid": "3698F56E-6180-4B83-B793-BF9658D4EE81",
			"type": "Geometry",
			"data": {
				"vertices": [187.7953,-157.4803,0,168.1102,-39.37008,0,168.1102,-157.4803,0,187.7953,-39.37008,0],
				"normals": [0,0,1],
				"faces": [32,0,1,2,0,0,0,32,1,0,3,0,0,0]
			}
		},
		{
			"uuid": "22B48F07-34B2-4C32-A9D8-E96BB8567D2C",
			"type": "Geometry",
			"data": {
				"vertices": [227.1654,-157.4803,0,207.4803,-39.37008,0,207.4803,-157.4803,0,227.1654,-39.37008,0],
				"normals": [0,0,1],
				"faces": [32,0,1,2,0,0,0,32,1,0,3,0,0,0]
			}
		},
		{
			"uuid": "7A095CCF-3BF8-4843-8EDF-3D9C92351F0F",
			"type": "Geometry",
			"data": {
				"vertices": [266.5354,-157.4803,0,246.8504,-39.37008,0,246.8504,-157.4803,0,266.5354,-39.37008,0],
				"normals": [0,0,1],
				"faces": [32,0,1,2,0,0,0,32,1,0,3,0,0,0]
			}
		},
		{
			"uuid": "8D6BA9A5-9FEF-4CAE-B51E-2860A0FA5903",
			"type": "Geometry",
			"data": {
				"vertices": [305.9055,-157.4803,0,286.2205,-39.37008,0,286.2205,-157.4803,0,305.9055,-39.37008,0],
				"normals": [0,0,1],
				"faces": [32,0,1,2,0,0,0,32,1,0,3,0,0,0]
			}
		},
		{
			"uuid": "7EE28995-D56C-43B8-B27B-EB3603B69DA9",
			"type": "Geometry",
			"data": {
				"vertices": [345.2756,-157.4803,0,325.5906,-39.37008,0,325.5906,-157.4803,0,345.2756,-39.37008,0],
				"normals": [0,0,1],
				"faces": [32,0,1,2,0,0,0,32,1,0,3,0,0,0]
			}
		},
		{
			"uuid": "33F29361-F2F2-47D0-BE56-53C091397AE6",
			"type": "Geometry",
			"data": {
				"vertices": [384.6457,-157.4803,0,364.9606,-39.37008,0,364.9606,-157.4803,0,384.6457,-39.37008,0],
				"normals": [0,0,1],
				"faces": [32,0,1,2,0,0,0,32,1,0,3,0,0,0]
			}
		},
		{
			"uuid": "5AFA4F81-E114-4E37-9BCC-A3C3CC06A126",
			"type": "Geometry",
			"data": {
				"vertices": [424.0157,-157.4803,0,404.3307,-39.37008,0,404.3307,-157.4803,0,424.0157,-39.37008,0],
				"normals": [0,0,1],
				"faces": [32,0,1,2,0,0,0,32,1,0,3,0,0,0]
			}
		},
		{
			"uuid": "9219D21D-604A-4EE8-8B78-DB23DFCFDAE8",
			"type": "Geometry",
			"data": {
				"vertices": [463.3858,-157.4803,0,443.7008,-39.37008,0,443.7008,-157.4803,0,463.3858,-39.37008,0],
				"normals": [0,0,1],
				"faces": [32,0,1,2,0,0,0,32,1,0,3,0,0,0]
			}
		},
		{
			"uuid": "30D80496-02D0-4E48-8FF0-A5AF001FBD6C",
			"type": "Geometry",
			"data": {
				"vertices": [502.7559,-157.4803,0,483.0709,-39.37008,0,483.0709,-157.4803,0,502.7559,-39.37008,0],
				"normals": [0,0,1],
				"faces": [32,0,1,2,0,0,0,32,1,0,3,0,0,0]
			}
		},
		{
			"uuid": "2006DB84-7884-4AB2-8E80-914F07B2B434",
			"type": "Geometry",
			"data": {
				"vertices": [542.126,-157.4803,0,522.4409,-39.37008,0,522.4409,-157.4803,0,542.126,-39.37008,0],
				"normals": [0,0,1],
				"faces": [32,0,1,2,0,0,0,32,1,0,3,0,0,0]
			}
		},
		{
			"uuid": "AE9F6E89-F968-4C3B-9BEC-112901E7D952",
			"type": "Geometry",
			"data": {
				"vertices": [581.4961,-157.4803,0,561.811,-39.37008,0,561.811,-157.4803,0,581.4961,-39.37008,0],
				"normals": [0,0,1],
				"faces": [32,0,1,2,0,0,0,32,1,0,3,0,0,0]
			}
		},
		{
			"uuid": "38DD33B3-7D15-464E-A9A3-1EA31C1E874E",
			"type": "Geometry",
			"data": {
				"vertices": [620.8661,-157.4803,0,601.1811,-39.37008,0,601.1811,-157.4803,0,620.8661,-39.37008,0],
				"normals": [0,0,1],
				"faces": [32,0,1,2,0,0,0,32,1,0,3,0,0,0]
			}
		},
		{
			"uuid": "E82022F8-D698-402C-917F-A3AA1DF5407D",
			"type": "Geometry",
			"data": {
				"vertices": [660.2362,-157.4803,0,640.5512,-39.37008,0,640.5512,-157.4803,0,660.2362,-39.37008,0],
				"normals": [0,0,1],
				"faces": [32,0,1,2,0,0,0,32,1,0,3,0,0,0]
			}
		},
		{
			"uuid": "9CFC6954-2BDE-4A37-B16E-4B1307FFB95F",
			"type": "Geometry",
			"data": {
				"vertices": [699.6063,-157.4803,0,679.9213,-39.37008,0,679.9213,-157.4803,0,699.6063,-39.37008,0],
				"normals": [0,0,1],
				"faces": [32,0,1,2,0,0,0,32,1,0,3,0,0,0]
			}
		},
		{
			"uuid": "867EDB42-E796-4DED-8253-28D241EAB5A6",
			"type": "Geometry",
			"data": {
				"vertices": [738.9764,-157.4803,0,719.2913,-39.37008,0,719.2913,-157.4803,0,738.9764,-39.37008,0],
				"normals": [0,0,1],
				"faces": [32,0,1,2,0,0,0,32,1,0,3,0,0,0]
			}
		},
		{
			"uuid": "D6F6B832-507C-45C9-AB76-08A57826531E",
			"type": "Geometry",
			"data": {
				"vertices": [15.74803,-3937.008,0,23.62205,0,0,15.74803,0,0,23.62205,-3937.008,0],
				"normals": [0,0,1],
				"faces": [32,0,1,2,0,0,0,32,1,0,3,0,0,0]
			}
		},
		{
			"uuid": "DA593E71-2A56-475F-BCAB-112720482E5E",
			"type": "Geometry",
			"data": {
				"vertices": [748.0315,-216.5354,0,39.37008,-196.8504,0,39.37008,-216.5354,0,748.0315,-196.8504,0],
				"normals": [0,0,1],
				"faces": [32,0,1,2,0,0,0,32,1,0,3,0,0,0]
			}
		},
		{
			"uuid": "47ED744D-301A-4DA2-8878-61B5CC3A46AD",
			"type": "Geometry",
			"data": {
				"vertices": [763.4484,-3937.008,0,771.3225,-4.547474e-13,0,763.4484,-4.547474e-13,0,771.3225,-3937.008,0],
				"normals": [0,0,1],
				"faces": [32,0,1,2,0,0,0,32,1,0,3,0,0,0]
			}
		},
		{
			"uuid": "2D112B79-4817-4F65-B2ED-E4C2690E80CC",
			"type": "Geometry",
			"data": {
				"vertices": [403.5433,-354.3307,0,383.8583,-236.2205,0,383.8583,-354.3307,0,403.5433,-236.2205,0],
				"normals": [0,0,1],
				"faces": [32,0,1,2,0,0,0,32,1,0,3,0,0,0]
			}
		},
		{
			"uuid": "C805116D-7B40-46F7-BA4A-65F0AEFE74D5",
			"type": "Geometry",
			"data": {
				"vertices": [403.5433,-511.811,0,383.8583,-393.7008,0,383.8583,-511.811,0,403.5433,-393.7008,0],
				"normals": [0,0,1],
				"faces": [32,0,1,2,0,0,0,32,1,0,3,0,0,0]
			}
		},
		{
			"uuid": "10075B29-D98E-4721-863E-1A7C0A6A9B94",
			"type": "Geometry",
			"data": {
				"vertices": [403.5433,-669.2913,0,383.8583,-551.1811,0,383.8583,-669.2913,0,403.5433,-551.1811,0],
				"normals": [0,0,1],
				"faces": [32,0,1,2,0,0,0,32,1,0,3,0,0,0]
			}
		},
		{
			"uuid": "55900E0B-3ABD-4142-AC5A-ED14763D9815",
			"type": "Geometry",
			"data": {
				"vertices": [403.5433,-983.454,0,383.8583,-865.3437,0,383.8583,-983.454,0,403.5433,-865.3437,0],
				"normals": [0,0,1],
				"faces": [32,0,1,2,0,0,0,32,1,0,3,0,0,0]
			}
		},
		{
			"uuid": "F531B3C3-82BE-4CA0-BBFF-863981B09F7D",
			"type": "Geometry",
			"data": {
				"vertices": [403.5433,-1140.934,0,383.8583,-1022.824,0,383.8583,-1140.934,0,403.5433,-1022.824,0],
				"normals": [0,0,1],
				"faces": [32,0,1,2,0,0,0,32,1,0,3,0,0,0]
			}
		},
		{
			"uuid": "77987EC8-9C1F-4262-80C3-C6BD944FC942",
			"type": "Geometry",
			"data": {
				"vertices": [403.5433,-825.9736,0,383.8583,-707.8634,0,383.8583,-825.9736,0,403.5433,-707.8634,0],
				"normals": [0,0,1],
				"faces": [32,0,1,2,0,0,0,32,1,0,3,0,0,0]
			}
		},
		{
			"uuid": "6AECF69B-CB25-4EF0-B046-0165A0DE8701",
			"type": "Geometry",
			"data": {
				"vertices": [403.5433,-1615.687,0,383.8583,-1497.576,0,383.8583,-1615.687,0,403.5433,-1497.576,0],
				"normals": [0,0,1],
				"faces": [32,0,1,2,0,0,0,32,1,0,3,0,0,0]
			}
		},
		{
			"uuid": "6288307A-CAEA-4A75-A2BC-AF3F45B2E382",
			"type": "Geometry",
			"data": {
				"vertices": [403.5433,-1930.647,0,383.8583,-1812.537,0,383.8583,-1930.647,0,403.5433,-1812.537,0],
				"normals": [0,0,1],
				"faces": [32,0,1,2,0,0,0,32,1,0,3,0,0,0]
			}
		},
		{
			"uuid": "2507A9FC-897A-46AA-8945-C51FAF2D4B2D",
			"type": "Geometry",
			"data": {
				"vertices": [403.5433,-1459.004,0,383.8583,-1340.894,0,383.8583,-1459.004,0,403.5433,-1340.894,0],
				"normals": [0,0,1],
				"faces": [32,0,1,2,0,0,0,32,1,0,3,0,0,0]
			}
		},
		{
			"uuid": "5CA1E45F-EAD8-411D-A016-50A6B5FFD3E5",
			"type": "Geometry",
			"data": {
				"vertices": [403.5433,-1773.167,0,383.8583,-1655.057,0,383.8583,-1773.167,0,403.5433,-1655.057,0],
				"normals": [0,0,1],
				"faces": [32,0,1,2,0,0,0,32,1,0,3,0,0,0]
			}
		},
		{
			"uuid": "F50CB805-C35B-4B06-81C0-C4060792D218",
			"type": "Geometry",
			"data": {
				"vertices": [403.5433,-1301.524,0,383.8583,-1183.414,0,383.8583,-1301.524,0,403.5433,-1183.414,0],
				"normals": [0,0,1],
				"faces": [32,0,1,2,0,0,0,32,1,0,3,0,0,0]
			}
		},
		{
			"uuid": "AB4E4775-4CF3-4F77-8868-F0C54907C1DD",
			"type": "Geometry",
			"data": {
				"vertices": [403.5433,-2246.435,0,383.8583,-2128.325,0,383.8583,-2246.435,0,403.5433,-2128.325,0],
				"normals": [0,0,1],
				"faces": [32,0,1,2,0,0,0,32,1,0,3,0,0,0]
			}
		},
		{
			"uuid": "26F3B1FF-7599-4DA7-88E7-01490B1566A7",
			"type": "Geometry",
			"data": {
				"vertices": [403.5433,-2088.955,0,383.8583,-1970.845,0,383.8583,-2088.955,0,403.5433,-1970.845,0],
				"normals": [0,0,1],
				"faces": [32,0,1,2,0,0,0,32,1,0,3,0,0,0]
			}
		},
		{
			"uuid": "F1A6B08F-D780-4C01-A846-140977309EB1",
			"type": "Geometry",
			"data": {
				"vertices": [403.5433,-2403.117,0,383.8583,-2285.007,0,383.8583,-2403.117,0,403.5433,-2285.007,0],
				"normals": [0,0,1],
				"faces": [32,0,1,2,0,0,0,32,1,0,3,0,0,0]
			}
		},
		{
			"uuid": "961710BA-C567-4DD3-AF52-49939E6D26FD",
			"type": "Geometry",
			"data": {
				"vertices": [403.5433,-2718.078,0,383.8583,-2599.968,0,383.8583,-2718.078,0,403.5433,-2599.968,0],
				"normals": [0,0,1],
				"faces": [32,0,1,2,0,0,0,32,1,0,3,0,0,0]
			}
		},
		{
			"uuid": "00B97E0B-903F-44D1-B9A2-80366C5424C5",
			"type": "Geometry",
			"data": {
				"vertices": [403.5433,-2560.598,0,383.8583,-2442.488,0,383.8583,-2560.598,0,403.5433,-2442.488,0],
				"normals": [0,0,1],
				"faces": [32,0,1,2,0,0,0,32,1,0,3,0,0,0]
			}
		},
		{
			"uuid": "286D0443-EC61-45A3-BD83-0E4E219A5D76",
			"type": "Geometry",
			"data": {
				"vertices": [403.5433,-3348.505,0,383.8583,-3230.394,0,383.8583,-3348.505,0,403.5433,-3230.394,0],
				"normals": [0,0,1],
				"faces": [32,0,1,2,0,0,0,32,1,0,3,0,0,0]
			}
		},
		{
			"uuid": "0D06820C-5502-4781-A2C4-6C87163065C3",
			"type": "Geometry",
			"data": {
				"vertices": [403.5433,-2876.862,0,383.8583,-2758.752,0,383.8583,-2876.862,0,403.5433,-2758.752,0],
				"normals": [0,0,1],
				"faces": [32,0,1,2,0,0,0,32,1,0,3,0,0,0]
			}
		},
		{
			"uuid": "82D45F95-50F3-49F1-9FC5-9B9F71A119C7",
			"type": "Geometry",
			"data": {
				"vertices": [403.5433,-3034.342,0,383.8583,-2916.232,0,383.8583,-3034.342,0,403.5433,-2916.232,0],
				"normals": [0,0,1],
				"faces": [32,0,1,2,0,0,0,32,1,0,3,0,0,0]
			}
		},
		{
			"uuid": "E6E9CB99-90B1-4494-BE3F-3F7FCDE3E324",
			"type": "Geometry",
			"data": {
				"vertices": [403.5433,-3505.985,0,383.8583,-3387.875,0,383.8583,-3505.985,0,403.5433,-3387.875,0],
				"normals": [0,0,1],
				"faces": [32,0,1,2,0,0,0,32,1,0,3,0,0,0]
			}
		},
		{
			"uuid": "380CDD58-9148-438E-96AF-1419F45FC981",
			"type": "Geometry",
			"data": {
				"vertices": [403.5433,-3191.024,0,383.8583,-3072.914,0,383.8583,-3191.024,0,403.5433,-3072.914,0],
				"normals": [0,0,1],
				"faces": [32,0,1,2,0,0,0,32,1,0,3,0,0,0]
			}
		},
		{
			"uuid": "72D3AB91-8FE0-4954-B8BC-AC92C6DEB97E",
			"type": "Geometry",
			"data": {
				"vertices": [403.5433,-3820.765,0,383.8583,-3702.655,0,383.8583,-3820.765,0,403.5433,-3702.655,0],
				"normals": [0,0,1],
				"faces": [32,0,1,2,0,0,0,32,1,0,3,0,0,0]
			}
		},
		{
			"uuid": "17125BC8-A9B9-415C-8C20-9BD0244D3B14",
			"type": "Geometry",
			"data": {
				"vertices": [403.5433,-3663.285,0,383.8583,-3545.175,0,383.8583,-3663.285,0,403.5433,-3545.175,0],
				"normals": [0,0,1],
				"faces": [32,0,1,2,0,0,0,32,1,0,3,0,0,0]
			}
		},
		{
			"uuid": "EEBFB59C-6259-48A9-AEDB-AF709B59E697",
			"type": "Geometry",
			"data": {
				"vertices": [403.5433,-3937.008,0,383.8583,-3859.337,0,383.8583,-3937.008,0,403.5433,-3859.337,0],
				"normals": [0,0,1],
				"faces": [32,0,1,2,0,0,0,32,1,0,3,0,0,0]
			}
		}],
	"materials": [
		{
			"uuid": "17EFA7E2-0004-4F6B-B94A-5A09FFDF34DB",
			"type": "MeshLambertMaterial",
			"name": "Color_007",
			"color": 3815994,
			"emissive": 0
		},
		{
			"uuid": "682AA616-0D6E-435F-A17A-088E6C5B6A51",
			"type": "MeshLambertMaterial",
			"name": "Color_000",
			"color": 16777215,
			"emissive": 0
		},
		{
			"uuid": "AD54BBC1-DAE7-43EB-9FE1-33F4187764B8",
			"type": "MeshLambertMaterial",
			"name": "Color_D01",
			"color": 16760320,
			"emissive": 0
		},
		{
			"uuid": "1504B1E0-138D-4451-8F9D-41B0CB5AC7AA",
			"type": "MeshLambertMaterial",
			"name": "material",
			"color": 16777215,
			"emissive": 0
		}]
}