{
	"object": {
		"uuid": "28762167-7A83-4304-9CC4-03440B08CB7D",
		"type": "Group",
		"name": "asfalto_DOWN.dae",
		"matrix": [0.029999999329447746,0,0,0,0,-0.000006110195954533992,-0.029999999329447746,0,0,0.029999999329447746,-0.000006110195954533992,0,0,0,0,1],
		"children": [
			{
				"uuid": "48B981C9-7866-4574-8338-4B1D3656F5BD",
				"type": "Object3D",
				"name": "SketchUp",
				"matrix": [1,0,0,0,0,1,0,0,0,0,1,0,0,0,0,1],
				"children": [
					{
						"uuid": "9BF0BA24-B81C-4331-8551-27DC1310303D",
						"type": "Object3D",
						"name": "group_0",
						"matrix": [1,0,0,0,0,1,0,0,0,0,1,0,0,-3937.008056640625,0,1],
						"children": [
							{
								"uuid": "EA639F7B-5CE7-4728-A2C6-B28E5B85F16B",
								"type": "Mesh",
								"matrix": [1,0,0,0,0,1,0,0,0,0,1,0,0,0,0,1],
								"geometry": "49B9F049-2EC2-4A04-AABF-770BF1DAF68F",
								"material": "8B870B18-F4D6-4028-BE9F-2C1BDA476CE9"
							},
							{
								"uuid": "D76B39C0-75AE-422B-8DB7-A5D62CC8A13E",
								"type": "Mesh",
								"matrix": [1,0,0,0,0,1,0,0,0,0,1,0,0,0,0,1],
								"geometry": "0D7C18AE-9663-48A2-8C13-938B26157FB7",
								"material": "8B790DB6-4E28-486E-A69E-881AD011C53C"
							},
							{
								"uuid": "784D4A01-7D08-42EE-813A-3D4B990D011E",
								"type": "Mesh",
								"matrix": [1,0,0,0,0,1,0,0,0,0,1,0,0,0,0,1],
								"geometry": "BD203D70-9A53-4438-91F6-FAC2A5486579",
								"material": "8B790DB6-4E28-486E-A69E-881AD011C53C"
							},
							{
								"uuid": "F07E91D7-949F-4A2C-8D8F-979DE18C2C41",
								"type": "Mesh",
								"matrix": [1,0,0,0,0,1,0,0,0,0,1,0,0,0,0,1],
								"geometry": "EB574663-3816-49D3-8F41-D3B0BFC30D7B",
								"material": "8B790DB6-4E28-486E-A69E-881AD011C53C"
							},
							{
								"uuid": "1F22D35C-5544-460E-85BA-541E3E0398F8",
								"type": "Mesh",
								"matrix": [1,0,0,0,0,1,0,0,0,0,1,0,0,0,0,1],
								"geometry": "D4D5B781-5592-45B3-99AC-89B7AF80850F",
								"material": "8B790DB6-4E28-486E-A69E-881AD011C53C"
							},
							{
								"uuid": "F9DFB878-7B06-490E-8797-2070BDAB4E77",
								"type": "Mesh",
								"matrix": [1,0,0,0,0,1,0,0,0,0,1,0,0,0,0,1],
								"geometry": "881B7BF1-14AC-4F96-A94E-F5DE8BE791C0",
								"material": "8B790DB6-4E28-486E-A69E-881AD011C53C"
							},
							{
								"uuid": "13342086-4E8D-496F-91ED-1C489E406F19",
								"type": "Mesh",
								"matrix": [1,0,0,0,0,1,0,0,0,0,1,0,0,0,0,1],
								"geometry": "49F49424-1D39-4C33-B7BE-8CB7B075C2C1",
								"material": "8B790DB6-4E28-486E-A69E-881AD011C53C"
							},
							{
								"uuid": "436C4115-AC5B-4576-A912-8B21F48A48F1",
								"type": "Mesh",
								"matrix": [1,0,0,0,0,1,0,0,0,0,1,0,0,0,0,1],
								"geometry": "C5605598-DD1E-45AF-A5C5-B8E7FE051E3E",
								"material": "8B790DB6-4E28-486E-A69E-881AD011C53C"
							},
							{
								"uuid": "63A35929-2C46-40D5-8DE0-33B18767C839",
								"type": "Mesh",
								"matrix": [1,0,0,0,0,1,0,0,0,0,1,0,0,0,0,1],
								"geometry": "B88FC56F-3CFA-4963-8C8A-983A6216B99C",
								"material": "8B790DB6-4E28-486E-A69E-881AD011C53C"
							},
							{
								"uuid": "51151576-15B1-4537-A05C-59A64E46D94F",
								"type": "Mesh",
								"matrix": [1,0,0,0,0,1,0,0,0,0,1,0,0,0,0,1],
								"geometry": "764BCEC8-008D-4D6A-9D03-B5A7C2B1BBC7",
								"material": "8B790DB6-4E28-486E-A69E-881AD011C53C"
							},
							{
								"uuid": "6B6998CC-9EAA-40AF-90FB-BB9D6062CDFC",
								"type": "Mesh",
								"matrix": [1,0,0,0,0,1,0,0,0,0,1,0,0,0,0,1],
								"geometry": "34C09843-9468-44B5-A842-A9FC826CF1D1",
								"material": "8B790DB6-4E28-486E-A69E-881AD011C53C"
							},
							{
								"uuid": "64DB13DA-ECF0-41C6-A45F-289ED34374F0",
								"type": "Mesh",
								"matrix": [1,0,0,0,0,1,0,0,0,0,1,0,0,0,0,1],
								"geometry": "6A37602C-49B7-4E1D-B6B1-4FF56A8ABF5C",
								"material": "8B790DB6-4E28-486E-A69E-881AD011C53C"
							},
							{
								"uuid": "A42A6290-4253-4F63-9078-41E6D187CD57",
								"type": "Mesh",
								"matrix": [1,0,0,0,0,1,0,0,0,0,1,0,0,0,0,1],
								"geometry": "7002BB60-28A8-40F0-855A-A0F927F49920",
								"material": "8B790DB6-4E28-486E-A69E-881AD011C53C"
							},
							{
								"uuid": "BB81A2DB-542F-4105-8BAD-F63B159A3333",
								"type": "Mesh",
								"matrix": [1,0,0,0,0,1,0,0,0,0,1,0,0,0,0,1],
								"geometry": "86D17AFE-B1E5-40B3-8AF3-8C02B08D4F35",
								"material": "8B790DB6-4E28-486E-A69E-881AD011C53C"
							},
							{
								"uuid": "785C680C-4875-42C8-85FA-430D53954957",
								"type": "Mesh",
								"matrix": [1,0,0,0,0,1,0,0,0,0,1,0,0,0,0,1],
								"geometry": "B83EE513-D6C6-47A4-B8C4-4BDFEB7101E7",
								"material": "8B790DB6-4E28-486E-A69E-881AD011C53C"
							},
							{
								"uuid": "F3CFB463-D922-46EF-86D3-C432508FC16D",
								"type": "Mesh",
								"matrix": [1,0,0,0,0,1,0,0,0,0,1,0,0,0,0,1],
								"geometry": "94B2DB5B-250E-4211-9AA7-36EB9DC3B93C",
								"material": "8B790DB6-4E28-486E-A69E-881AD011C53C"
							},
							{
								"uuid": "6509232D-7730-418D-84EE-5E8D67877684",
								"type": "Mesh",
								"matrix": [1,0,0,0,0,1,0,0,0,0,1,0,0,0,0,1],
								"geometry": "E55BFBA3-D7C6-4A4A-BB1C-163579E6592C",
								"material": "8B790DB6-4E28-486E-A69E-881AD011C53C"
							},
							{
								"uuid": "2EBE1F02-9CBC-4F99-B45B-AA2FE334E808",
								"type": "Mesh",
								"matrix": [1,0,0,0,0,1,0,0,0,0,1,0,0,0,0,1],
								"geometry": "401054CF-2A47-4917-A756-51DACFCDECB8",
								"material": "8B790DB6-4E28-486E-A69E-881AD011C53C"
							},
							{
								"uuid": "CA9EA26E-D512-4624-BA47-E6E316D6A8CA",
								"type": "Mesh",
								"matrix": [1,0,0,0,0,1,0,0,0,0,1,0,0,0,0,1],
								"geometry": "D6FCA06A-CFB4-4A0A-9154-1C37F1878524",
								"material": "8B790DB6-4E28-486E-A69E-881AD011C53C"
							},
							{
								"uuid": "8B9A964C-4C3A-402D-9A4C-40C2DEAD44C6",
								"type": "Mesh",
								"matrix": [1,0,0,0,0,1,0,0,0,0,1,0,0,0,0,1],
								"geometry": "15C44338-CF1D-4763-B7C5-CB66C205D3EB",
								"material": "DD1E8E6F-3BE5-4EE5-BCA8-E8448B7B2A57"
							},
							{
								"uuid": "26390188-C668-4474-BD59-E7ACECC70743",
								"type": "Mesh",
								"matrix": [1,0,0,0,0,1,0,0,0,0,1,0,0,0,0,1],
								"geometry": "F94E6E3C-6F67-4846-ADD7-CB03C17F7B48",
								"material": "8B790DB6-4E28-486E-A69E-881AD011C53C"
							},
							{
								"uuid": "3F48B6BD-D370-4882-896D-942B3D789348",
								"type": "Mesh",
								"matrix": [1,0,0,0,0,1,0,0,0,0,1,0,0,0,0,1],
								"geometry": "586AADAF-3A58-4A08-9992-FBA8A2002176",
								"material": "8B790DB6-4E28-486E-A69E-881AD011C53C"
							},
							{
								"uuid": "4B26D990-BD14-43FB-9480-22AB8B815BD6",
								"type": "Mesh",
								"matrix": [1,0,0,0,0,1,0,0,0,0,1,0,0,0,0,1],
								"geometry": "7F05D200-6A73-4106-B956-9C65B01FB5BC",
								"material": "8B790DB6-4E28-486E-A69E-881AD011C53C"
							},
							{
								"uuid": "165FE8C1-BB03-4C66-9F15-7FE681FC96D6",
								"type": "Mesh",
								"matrix": [1,0,0,0,0,1,0,0,0,0,1,0,0,0,0,1],
								"geometry": "09A334B0-7DCB-4D49-98CF-D3DC93A51FE4",
								"material": "8B790DB6-4E28-486E-A69E-881AD011C53C"
							},
							{
								"uuid": "0146CD7B-76AE-4887-BF25-DF25A6934A3E",
								"type": "Mesh",
								"matrix": [1,0,0,0,0,1,0,0,0,0,1,0,0,0,0,1],
								"geometry": "FB300F7E-8B8D-4221-953F-65D2E2F77B1B",
								"material": "8B790DB6-4E28-486E-A69E-881AD011C53C"
							},
							{
								"uuid": "CAA3E743-9A39-470F-A42E-1E04B7681F4C",
								"type": "Mesh",
								"matrix": [1,0,0,0,0,1,0,0,0,0,1,0,0,0,0,1],
								"geometry": "3739C399-27F8-40DC-B5E6-48A68CA5095B",
								"material": "8B790DB6-4E28-486E-A69E-881AD011C53C"
							},
							{
								"uuid": "4D66E47D-51C5-4D0A-967A-574D29B40BA2",
								"type": "Mesh",
								"matrix": [1,0,0,0,0,1,0,0,0,0,1,0,0,0,0,1],
								"geometry": "2FB29991-7575-4DA8-A8A7-5A75563ED7F1",
								"material": "DD1E8E6F-3BE5-4EE5-BCA8-E8448B7B2A57"
							},
							{
								"uuid": "CF4B370D-390C-433F-9B7F-9C9868D9E61D",
								"type": "Mesh",
								"matrix": [1,0,0,0,0,1,0,0,0,0,1,0,0,0,0,1],
								"geometry": "6D103EA8-A542-4C40-BB69-17EA6F7E4852",
								"material": "8B790DB6-4E28-486E-A69E-881AD011C53C"
							},
							{
								"uuid": "FA25D5A5-CBEC-4A9F-8E87-FA9521679C36",
								"type": "Mesh",
								"matrix": [1,0,0,0,0,1,0,0,0,0,1,0,0,0,0,1],
								"geometry": "A844A80E-2011-4589-A163-04D48DFFF070",
								"material": "8B790DB6-4E28-486E-A69E-881AD011C53C"
							},
							{
								"uuid": "F6138CFD-1863-4F56-94B7-994F2751D115",
								"type": "Mesh",
								"matrix": [1,0,0,0,0,1,0,0,0,0,1,0,0,0,0,1],
								"geometry": "45E3E6B1-02BB-4E80-ACC8-EB4A61BCB674",
								"material": "8B790DB6-4E28-486E-A69E-881AD011C53C"
							},
							{
								"uuid": "E350F74C-9609-4F22-8E43-468BF5941C2B",
								"type": "Mesh",
								"matrix": [1,0,0,0,0,1,0,0,0,0,1,0,0,0,0,1],
								"geometry": "E055551F-BD7C-4036-8CF2-3261AE83BC4B",
								"material": "8B790DB6-4E28-486E-A69E-881AD011C53C"
							},
							{
								"uuid": "094F79EE-1914-40B7-987F-D1D210A81F9B",
								"type": "Mesh",
								"matrix": [1,0,0,0,0,1,0,0,0,0,1,0,0,0,0,1],
								"geometry": "56207EA5-ABBC-4246-ABD5-6E82CD1B5E43",
								"material": "0BC88A84-C433-4625-A70A-D4CA3E948892"
							},
							{
								"uuid": "C567405C-D198-4FE2-AB35-B29E3B8FFEFA",
								"type": "Mesh",
								"matrix": [1,0,0,0,0,1,0,0,0,0,1,0,0,0,0,1],
								"geometry": "BCD2C0D3-3C57-467F-A176-918911E71305",
								"material": "8B790DB6-4E28-486E-A69E-881AD011C53C"
							},
							{
								"uuid": "08EB519B-D68D-4002-96C1-7201EF455BE6",
								"type": "Mesh",
								"matrix": [1,0,0,0,0,1,0,0,0,0,1,0,0,0,0,1],
								"geometry": "18169844-2C6F-46B5-AED4-A2301F446457",
								"material": "0BC88A84-C433-4625-A70A-D4CA3E948892"
							},
							{
								"uuid": "2253CB17-FCBB-4C38-9D4C-8D6850C29EDC",
								"type": "Mesh",
								"matrix": [1,0,0,0,0,1,0,0,0,0,1,0,0,0,0,1],
								"geometry": "E0C986B5-4C5B-4844-9585-BD99802C30CE",
								"material": "0BC88A84-C433-4625-A70A-D4CA3E948892"
							},
							{
								"uuid": "9C7A92BE-6BBE-4AB2-8FDC-5EE7E41EEE3C",
								"type": "Mesh",
								"matrix": [1,0,0,0,0,1,0,0,0,0,1,0,0,0,0,1],
								"geometry": "9D7ECBD7-97D0-4117-8E74-1E477D45D3F9",
								"material": "0BC88A84-C433-4625-A70A-D4CA3E948892"
							},
							{
								"uuid": "D612ADB2-1367-48CC-AF7D-B8DB912B951F",
								"type": "Mesh",
								"matrix": [1,0,0,0,0,1,0,0,0,0,1,0,0,0,0,1],
								"geometry": "544A87D5-CA22-4814-B503-A13C7FC94B43",
								"material": "0BC88A84-C433-4625-A70A-D4CA3E948892"
							},
							{
								"uuid": "983A4EBE-62A1-4A72-A1AA-B07499506456",
								"type": "Mesh",
								"matrix": [1,0,0,0,0,1,0,0,0,0,1,0,0,0,0,1],
								"geometry": "19584361-0E34-4069-BC68-7983A991765F",
								"material": "0BC88A84-C433-4625-A70A-D4CA3E948892"
							},
							{
								"uuid": "9C769332-072A-42D1-95E6-66A7A7FE3615",
								"type": "Mesh",
								"matrix": [1,0,0,0,0,1,0,0,0,0,1,0,0,0,0,1],
								"geometry": "AAC1CE4D-97A1-46B9-A738-CD7D92C15AC6",
								"material": "0BC88A84-C433-4625-A70A-D4CA3E948892"
							},
							{
								"uuid": "33652C8E-7BF3-4BFA-BDA3-DA7D400E9C3D",
								"type": "Mesh",
								"matrix": [1,0,0,0,0,1,0,0,0,0,1,0,0,0,0,1],
								"geometry": "90AFDD1E-A37D-4A5C-BEAC-32BECA5E8FD1",
								"material": "0BC88A84-C433-4625-A70A-D4CA3E948892"
							},
							{
								"uuid": "A4ABD658-2A1E-4E93-B9B2-7637C3C56B23",
								"type": "Mesh",
								"matrix": [1,0,0,0,0,1,0,0,0,0,1,0,0,0,0,1],
								"geometry": "4D79A024-C548-4DC5-9F2D-A0C25F4F28CC",
								"material": "0BC88A84-C433-4625-A70A-D4CA3E948892"
							},
							{
								"uuid": "3B4991D4-8248-41FA-9C78-5D86603ADF67",
								"type": "Mesh",
								"matrix": [1,0,0,0,0,1,0,0,0,0,1,0,0,0,0,1],
								"geometry": "AFBF7742-4E86-4C17-9979-4FF08C65622A",
								"material": "0BC88A84-C433-4625-A70A-D4CA3E948892"
							},
							{
								"uuid": "926EC644-7429-4D93-8958-B91130250B5F",
								"type": "Mesh",
								"matrix": [1,0,0,0,0,1,0,0,0,0,1,0,0,0,0,1],
								"geometry": "2AEDFC45-5D78-4416-B4B1-FE1FB04281B7",
								"material": "0BC88A84-C433-4625-A70A-D4CA3E948892"
							},
							{
								"uuid": "0890F166-4EE8-4352-B85F-BEB682AFE796",
								"type": "Mesh",
								"matrix": [1,0,0,0,0,1,0,0,0,0,1,0,0,0,0,1],
								"geometry": "F07CF2E5-C274-41E1-9714-1BD40EBD19E0",
								"material": "8B790DB6-4E28-486E-A69E-881AD011C53C"
							},
							{
								"uuid": "B1DF8019-3F73-4E98-9DCB-5FC7E1501498",
								"type": "Mesh",
								"matrix": [1,0,0,0,0,1,0,0,0,0,1,0,0,0,0,1],
								"geometry": "C8F9E237-6EB9-488F-9155-5036C40A312A",
								"material": "0BC88A84-C433-4625-A70A-D4CA3E948892"
							},
							{
								"uuid": "6BAC448C-7F6E-4095-A5C7-4D0ECBD33A79",
								"type": "Mesh",
								"matrix": [1,0,0,0,0,1,0,0,0,0,1,0,0,0,0,1],
								"geometry": "2B649779-B199-4381-B67E-EAFE9FAE1A2E",
								"material": "0BC88A84-C433-4625-A70A-D4CA3E948892"
							}]
					}]
			}]
	},
	"metadata": {
		"version": 4.4,
		"type": "Object",
		"generator": "Object3D.toJSON"
	},
	"geometries": [
		{
			"uuid": "49B9F049-2EC2-4A04-AABF-770BF1DAF68F",
			"type": "Geometry",
			"data": {
				"vertices": [0,3937.008,33.46457,787.4016,3937.008,0,0,3937.008,0,787.4016,3937.008,33.46457,15.74803,3937.008,33.46457,23.62205,3937.008,33.46457,763.4484,3937.008,33.46457,771.3225,3937.008,33.46457,15.74803,4.547474e-13,33.46457,0,3937.008,33.46457,0,0,33.46457,15.74803,3937.008,33.46457,748.0315,3740.157,33.46457,50,3779.528,33.46457,39.37008,3740.157,33.46457,69.68504,3779.528,33.46457,89.37008,3779.528,33.46457,69.68504,3897.638,33.46457,109.0551,3779.528,33.46457,128.7402,3779.528,33.46457,109.0551,3897.638,33.46457,148.4252,3779.528,33.46457,168.1102,3779.528,33.46457,148.4252,3897.638,33.46457,187.7953,3779.528,33.46457,207.4803,3779.528,33.46457,187.7953,3897.638,33.46457,227.1654,3779.528,33.46457,246.8504,3779.528,33.46457,227.1654,3897.638,33.46457,266.5354,3779.528,33.46457,286.2205,3779.528,33.46457,266.5354,3897.638,33.46457,305.9055,3779.528,33.46457,325.5906,3779.528,33.46457,305.9055,3897.638,33.46457,345.2756,3779.528,33.46457,364.9606,3779.528,33.46457,345.2756,3897.638,33.46457,384.6457,3779.528,33.46457,404.3307,3779.528,33.46457,384.6457,3897.638,33.46457,424.0157,3779.528,33.46457,443.7008,3779.528,33.46457,424.0157,3897.638,33.46457,463.3858,3779.528,33.46457,483.0709,3779.528,33.46457,463.3858,3897.638,33.46457,502.7559,3779.528,33.46457,522.4409,3779.528,33.46457,502.7559,3897.638,33.46457,542.126,3779.528,33.46457,561.811,3779.528,33.46457,542.126,3897.638,33.46457,581.4961,3779.528,33.46457,601.1811,3779.528,33.46457,581.4961,3897.638,33.46457,620.8661,3779.528,33.46457,640.5512,3779.528,33.46457,620.8661,3897.638,33.46457,660.2362,3779.528,33.46457,679.9213,3779.528,33.46457,660.2362,3897.638,33.46457,699.6063,3779.528,33.46457,719.2913,3779.528,33.46457,699.6063,3897.638,33.46457,738.9764,3779.528,33.46457,738.9764,3897.638,33.46457,763.4484,0,33.46457,403.5433,77.67043,33.46457,403.5433,0,33.46457,403.5433,116.2425,33.46457,403.5433,234.3527,33.46457,403.5433,273.7228,33.46457,403.5433,391.8331,33.46457,403.5433,431.0228,33.46457,403.5433,549.1331,33.46457,403.5433,588.5032,33.46457,403.5433,706.6134,33.46457,403.5433,745.9835,33.46457,403.5433,864.0937,33.46457,403.5433,902.6658,33.46457,403.5433,1020.776,33.46457,403.5433,1060.146,33.46457,403.5433,1178.256,33.46457,403.5433,1218.93,33.46457,403.5433,1337.04,33.46457,403.5433,1376.41,33.46457,403.5433,1494.52,33.46457,403.5433,1533.89,33.46457,403.5433,1652.001,33.46457,403.5433,1690.573,33.46457,403.5433,1808.683,33.46457,403.5433,1848.053,33.46457,403.5433,1966.163,33.46457,403.5433,2006.361,33.46457,403.5433,2124.471,33.46457,403.5433,2163.841,33.46457,403.5433,2281.951,33.46457,403.5433,2321.321,33.46457,403.5433,2439.431,33.46457,403.5433,2478.003,33.46457,403.5433,2596.114,33.46457,403.5433,2635.484,33.46457,403.5433,2753.594,33.46457,403.5433,2796.074,33.46457,403.5433,2914.184,33.46457,403.5433,2953.554,33.46457,403.5433,3071.664,33.46457,403.5433,3111.034,33.46457,403.5433,3229.144,33.46457,403.5433,3267.717,33.46457,403.5433,3385.827,33.46457,403.5433,3425.197,33.46457,403.5433,3543.307,33.46457,403.5433,3582.677,33.46457,403.5433,3700.787,33.46457,748.0315,3720.472,33.46457,763.4484,3937.008,33.46457,23.62205,3937.008,33.46457,50,3897.638,33.46457,39.37008,3720.472,33.46457,89.37008,3897.638,33.46457,128.7402,3897.638,33.46457,168.1102,3897.638,33.46457,207.4803,3897.638,33.46457,246.8504,3897.638,33.46457,286.2205,3897.638,33.46457,325.5906,3897.638,33.46457,364.9606,3897.638,33.46457,404.3307,3897.638,33.46457,443.7008,3897.638,33.46457,483.0709,3897.638,33.46457,522.4409,3897.638,33.46457,561.811,3897.638,33.46457,601.1811,3897.638,33.46457,640.5512,3897.638,33.46457,679.9213,3897.638,33.46457,719.2913,3897.638,33.46457,23.62205,4.547474e-13,33.46457,383.8583,4.547474e-13,33.46457,383.8583,3700.787,33.46457,383.8583,77.67043,33.46457,383.8583,116.2425,33.46457,383.8583,234.3527,33.46457,383.8583,273.7228,33.46457,383.8583,391.8331,33.46457,383.8583,431.0228,33.46457,383.8583,549.1331,33.46457,383.8583,588.5032,33.46457,383.8583,706.6134,33.46457,383.8583,745.9835,33.46457,383.8583,864.0937,33.46457,383.8583,902.6658,33.46457,383.8583,1020.776,33.46457,383.8583,1060.146,33.46457,383.8583,1178.256,33.46457,383.8583,1218.93,33.46457,383.8583,1337.04,33.46457,383.8583,1376.41,33.46457,383.8583,1494.52,33.46457,383.8583,1533.89,33.46457,383.8583,1652.001,33.46457,383.8583,1690.573,33.46457,383.8583,1808.683,33.46457,383.8583,1848.053,33.46457,383.8583,1966.163,33.46457,383.8583,2006.361,33.46457,383.8583,2124.471,33.46457,383.8583,2163.841,33.46457,383.8583,2281.951,33.46457,383.8583,2321.321,33.46457,383.8583,2439.431,33.46457,383.8583,2478.003,33.46457,383.8583,2596.114,33.46457,383.8583,2635.484,33.46457,383.8583,2753.594,33.46457,383.8583,2796.074,33.46457,383.8583,2914.184,33.46457,383.8583,2953.554,33.46457,383.8583,3071.664,33.46457,383.8583,3111.034,33.46457,383.8583,3229.144,33.46457,383.8583,3267.717,33.46457,383.8583,3385.827,33.46457,383.8583,3425.197,33.46457,383.8583,3543.307,33.46457,383.8583,3582.677,33.46457,787.4016,0,33.46457,771.3225,3937.008,33.46457,771.3225,0,33.46457,787.4016,3937.008,33.46457,787.4016,3937.008,0,787.4016,0,33.46457,787.4016,0,0,787.4016,3937.008,33.46457,787.4016,3937.008,0,0,0,0,0,3937.008,0,787.4016,0,0,0,3937.008,33.46457,0,0,0,0,0,33.46457,0,3937.008,0,787.4016,0,33.46457,0,0,0,787.4016,0,0,0,0,33.46457,771.3225,0,33.46457,763.4484,0,33.46457,403.5433,0,33.46457,383.8583,4.547474e-13,33.46457,23.62205,4.547474e-13,33.46457,15.74803,4.547474e-13,33.46457],
				"normals": [2.883208e-16,1,4.530591e-15,0,0,1,1,3.356153e-17,4.158097e-15,0,0,-1,-1,0,0,-2.921432e-16,-1,5.095123e-15],
				"faces": [32,0,1,2,0,0,0,32,1,0,3,0,0,0,32,3,0,4,0,0,0,32,3,4,5,0,0,0,32,3,5,6,0,0,0,32,3,6,7,0,0,0,32,8,9,10,1,1,1,32,9,8,11,1,1,1,32,12,13,14,1,1,1,32,13,12,15,1,1,1,32,15,12,16,1,1,1,32,15,16,17,1,1,1,32,16,12,18,1,1,1,32,18,12,19,1,1,1,32,18,19,20,1,1,1,32,19,12,21,1,1,1,32,21,12,22,1,1,1,32,21,22,23,1,1,1,32,22,12,24,1,1,1,32,24,12,25,1,1,1,32,24,25,26,1,1,1,32,25,12,27,1,1,1,32,27,12,28,1,1,1,32,27,28,29,1,1,1,32,28,12,30,1,1,1,32,30,12,31,1,1,1,32,30,31,32,1,1,1,32,31,12,33,1,1,1,32,33,12,34,1,1,1,32,33,34,35,1,1,1,32,34,12,36,1,1,1,32,36,12,37,1,1,1,32,36,37,38,1,1,1,32,37,12,39,1,1,1,32,39,12,40,1,1,1,32,39,40,41,1,1,1,32,40,12,42,1,1,1,32,42,12,43,1,1,1,32,42,43,44,1,1,1,32,43,12,45,1,1,1,32,45,12,46,1,1,1,32,45,46,47,1,1,1,32,46,12,48,1,1,1,32,48,12,49,1,1,1,32,48,49,50,1,1,1,32,49,12,51,1,1,1,32,51,12,52,1,1,1,32,51,52,53,1,1,1,32,52,12,54,1,1,1,32,54,12,55,1,1,1,32,54,55,56,1,1,1,32,55,12,57,1,1,1,32,57,12,58,1,1,1,32,57,58,59,1,1,1,32,58,12,60,1,1,1,32,60,12,61,1,1,1,32,60,61,62,1,1,1,32,61,12,63,1,1,1,32,63,12,64,1,1,1,32,63,64,65,1,1,1,32,64,12,66,1,1,1,32,66,12,67,1,1,1,32,68,69,70,1,1,1,32,69,68,71,1,1,1,32,71,68,72,1,1,1,32,72,68,73,1,1,1,32,73,68,74,1,1,1,32,74,68,75,1,1,1,32,75,68,76,1,1,1,32,76,68,77,1,1,1,32,77,68,78,1,1,1,32,78,68,79,1,1,1,32,79,68,80,1,1,1,32,80,68,81,1,1,1,32,81,68,82,1,1,1,32,82,68,83,1,1,1,32,83,68,84,1,1,1,32,84,68,85,1,1,1,32,85,68,86,1,1,1,32,86,68,87,1,1,1,32,87,68,88,1,1,1,32,88,68,89,1,1,1,32,89,68,90,1,1,1,32,90,68,91,1,1,1,32,91,68,92,1,1,1,32,92,68,93,1,1,1,32,93,68,94,1,1,1,32,94,68,95,1,1,1,32,95,68,96,1,1,1,32,96,68,97,1,1,1,32,97,68,98,1,1,1,32,98,68,99,1,1,1,32,99,68,100,1,1,1,32,100,68,101,1,1,1,32,101,68,102,1,1,1,32,102,68,103,1,1,1,32,103,68,104,1,1,1,32,104,68,105,1,1,1,32,105,68,106,1,1,1,32,106,68,107,1,1,1,32,107,68,108,1,1,1,32,108,68,109,1,1,1,32,109,68,110,1,1,1,32,110,68,111,1,1,1,32,111,68,112,1,1,1,32,112,68,113,1,1,1,32,113,68,114,1,1,1,32,114,68,115,1,1,1,32,115,68,116,1,1,1,32,116,68,117,1,1,1,32,117,68,12,1,1,1,32,12,68,118,1,1,1,32,119,120,118,1,1,1,32,120,119,14,1,1,1,32,14,119,121,1,1,1,32,120,14,13,1,1,1,32,118,120,17,1,1,1,32,118,17,122,1,1,1,32,122,17,16,1,1,1,32,118,122,20,1,1,1,32,118,20,123,1,1,1,32,123,20,19,1,1,1,32,118,123,23,1,1,1,32,118,23,124,1,1,1,32,124,23,22,1,1,1,32,118,124,26,1,1,1,32,118,26,125,1,1,1,32,125,26,25,1,1,1,32,118,125,29,1,1,1,32,118,29,126,1,1,1,32,126,29,28,1,1,1,32,118,126,32,1,1,1,32,118,32,127,1,1,1,32,127,32,31,1,1,1,32,118,127,35,1,1,1,32,118,35,128,1,1,1,32,128,35,34,1,1,1,32,118,128,38,1,1,1,32,118,38,129,1,1,1,32,129,38,37,1,1,1,32,118,129,41,1,1,1,32,118,41,130,1,1,1,32,130,41,40,1,1,1,32,118,130,44,1,1,1,32,118,44,131,1,1,1,32,131,44,43,1,1,1,32,118,131,47,1,1,1,32,118,47,132,1,1,1,32,132,47,46,1,1,1,32,118,132,50,1,1,1,32,118,50,133,1,1,1,32,133,50,49,1,1,1,32,118,133,53,1,1,1,32,118,53,134,1,1,1,32,134,53,52,1,1,1,32,118,134,56,1,1,1,32,118,56,135,1,1,1,32,135,56,55,1,1,1,32,118,135,59,1,1,1,32,118,59,136,1,1,1,32,136,59,58,1,1,1,32,118,136,62,1,1,1,32,118,62,137,1,1,1,32,137,62,61,1,1,1,32,118,137,65,1,1,1,32,118,65,138,1,1,1,32,138,65,64,1,1,1,32,118,138,67,1,1,1,32,118,67,12,1,1,1,32,139,121,119,1,1,1,32,121,139,140,1,1,1,32,121,140,141,1,1,1,32,121,141,117,1,1,1,32,141,140,142,1,1,1,32,141,142,143,1,1,1,32,141,143,144,1,1,1,32,141,144,145,1,1,1,32,141,145,146,1,1,1,32,141,146,147,1,1,1,32,141,147,148,1,1,1,32,141,148,149,1,1,1,32,141,149,150,1,1,1,32,141,150,151,1,1,1,32,141,151,152,1,1,1,32,141,152,153,1,1,1,32,141,153,154,1,1,1,32,141,154,155,1,1,1,32,141,155,156,1,1,1,32,141,156,157,1,1,1,32,141,157,158,1,1,1,32,141,158,159,1,1,1,32,141,159,160,1,1,1,32,141,160,161,1,1,1,32,141,161,162,1,1,1,32,141,162,163,1,1,1,32,141,163,164,1,1,1,32,141,164,165,1,1,1,32,141,165,166,1,1,1,32,141,166,167,1,1,1,32,141,167,168,1,1,1,32,141,168,169,1,1,1,32,141,169,170,1,1,1,32,141,170,171,1,1,1,32,141,171,172,1,1,1,32,141,172,173,1,1,1,32,141,173,174,1,1,1,32,141,174,175,1,1,1,32,141,175,176,1,1,1,32,141,176,177,1,1,1,32,141,177,178,1,1,1,32,141,178,179,1,1,1,32,141,179,180,1,1,1,32,141,180,181,1,1,1,32,141,181,182,1,1,1,32,141,182,183,1,1,1,32,141,183,184,1,1,1,32,141,184,185,1,1,1,32,141,185,186,1,1,1,32,141,186,187,1,1,1,32,117,141,116,1,1,1,32,114,187,186,1,1,1,32,187,114,115,1,1,1,32,112,185,184,1,1,1,32,185,112,113,1,1,1,32,110,183,182,1,1,1,32,183,110,111,1,1,1,32,108,181,180,1,1,1,32,181,108,109,1,1,1,32,106,179,178,1,1,1,32,179,106,107,1,1,1,32,104,177,176,1,1,1,32,177,104,105,1,1,1,32,102,175,174,1,1,1,32,175,102,103,1,1,1,32,100,173,172,1,1,1,32,173,100,101,1,1,1,32,98,171,170,1,1,1,32,171,98,99,1,1,1,32,96,169,168,1,1,1,32,169,96,97,1,1,1,32,94,167,166,1,1,1,32,167,94,95,1,1,1,32,92,165,164,1,1,1,32,165,92,93,1,1,1,32,90,163,162,1,1,1,32,163,90,91,1,1,1,32,88,161,160,1,1,1,32,161,88,89,1,1,1,32,86,159,158,1,1,1,32,159,86,87,1,1,1,32,84,157,156,1,1,1,32,157,84,85,1,1,1,32,82,155,154,1,1,1,32,155,82,83,1,1,1,32,80,153,152,1,1,1,32,153,80,81,1,1,1,32,78,151,150,1,1,1,32,151,78,79,1,1,1,32,76,149,148,1,1,1,32,149,76,77,1,1,1,32,74,147,146,1,1,1,32,147,74,75,1,1,1,32,72,145,144,1,1,1,32,145,72,73,1,1,1,32,69,143,142,1,1,1,32,143,69,71,1,1,1,32,188,189,190,1,1,1,32,189,188,191,1,1,1,32,192,193,194,2,2,2,32,193,192,195,2,2,2,32,196,197,198,3,3,3,32,197,196,199,3,3,3,32,200,201,202,4,4,4,32,201,200,203,4,4,4,32,204,205,206,5,5,5,32,205,204,207,5,5,5,32,207,204,208,5,5,5,32,207,208,209,5,5,5,32,207,209,210,5,5,5,32,207,210,211,5,5,5,32,207,211,212,5,5,5,32,207,212,213,5,5,5]
			}
		},
		{
			"uuid": "0D7C18AE-9663-48A2-8C13-938B26157FB7",
			"type": "Geometry",
			"data": {
				"vertices": [69.68504,3779.528,33.46457,50,3897.638,33.46457,50,3779.528,33.46457,69.68504,3897.638,33.46457],
				"normals": [0,0,1],
				"faces": [32,0,1,2,0,0,0,32,1,0,3,0,0,0]
			}
		},
		{
			"uuid": "BD203D70-9A53-4438-91F6-FAC2A5486579",
			"type": "Geometry",
			"data": {
				"vertices": [109.0551,3779.528,33.46457,89.37008,3897.638,33.46457,89.37008,3779.528,33.46457,109.0551,3897.638,33.46457],
				"normals": [0,0,1],
				"faces": [32,0,1,2,0,0,0,32,1,0,3,0,0,0]
			}
		},
		{
			"uuid": "EB574663-3816-49D3-8F41-D3B0BFC30D7B",
			"type": "Geometry",
			"data": {
				"vertices": [148.4252,3779.528,33.46457,128.7402,3897.638,33.46457,128.7402,3779.528,33.46457,148.4252,3897.638,33.46457],
				"normals": [0,0,1],
				"faces": [32,0,1,2,0,0,0,32,1,0,3,0,0,0]
			}
		},
		{
			"uuid": "D4D5B781-5592-45B3-99AC-89B7AF80850F",
			"type": "Geometry",
			"data": {
				"vertices": [187.7953,3779.528,33.46457,168.1102,3897.638,33.46457,168.1102,3779.528,33.46457,187.7953,3897.638,33.46457],
				"normals": [0,0,1],
				"faces": [32,0,1,2,0,0,0,32,1,0,3,0,0,0]
			}
		},
		{
			"uuid": "881B7BF1-14AC-4F96-A94E-F5DE8BE791C0",
			"type": "Geometry",
			"data": {
				"vertices": [227.1654,3779.528,33.46457,207.4803,3897.638,33.46457,207.4803,3779.528,33.46457,227.1654,3897.638,33.46457],
				"normals": [0,0,1],
				"faces": [32,0,1,2,0,0,0,32,1,0,3,0,0,0]
			}
		},
		{
			"uuid": "49F49424-1D39-4C33-B7BE-8CB7B075C2C1",
			"type": "Geometry",
			"data": {
				"vertices": [266.5354,3779.528,33.46457,246.8504,3897.638,33.46457,246.8504,3779.528,33.46457,266.5354,3897.638,33.46457],
				"normals": [0,0,1],
				"faces": [32,0,1,2,0,0,0,32,1,0,3,0,0,0]
			}
		},
		{
			"uuid": "C5605598-DD1E-45AF-A5C5-B8E7FE051E3E",
			"type": "Geometry",
			"data": {
				"vertices": [305.9055,3779.528,33.46457,286.2205,3897.638,33.46457,286.2205,3779.528,33.46457,305.9055,3897.638,33.46457],
				"normals": [0,0,1],
				"faces": [32,0,1,2,0,0,0,32,1,0,3,0,0,0]
			}
		},
		{
			"uuid": "B88FC56F-3CFA-4963-8C8A-983A6216B99C",
			"type": "Geometry",
			"data": {
				"vertices": [345.2756,3779.528,33.46457,325.5906,3897.638,33.46457,325.5906,3779.528,33.46457,345.2756,3897.638,33.46457],
				"normals": [0,0,1],
				"faces": [32,0,1,2,0,0,0,32,1,0,3,0,0,0]
			}
		},
		{
			"uuid": "764BCEC8-008D-4D6A-9D03-B5A7C2B1BBC7",
			"type": "Geometry",
			"data": {
				"vertices": [384.6457,3779.528,33.46457,364.9606,3897.638,33.46457,364.9606,3779.528,33.46457,384.6457,3897.638,33.46457],
				"normals": [0,0,1],
				"faces": [32,0,1,2,0,0,0,32,1,0,3,0,0,0]
			}
		},
		{
			"uuid": "34C09843-9468-44B5-A842-A9FC826CF1D1",
			"type": "Geometry",
			"data": {
				"vertices": [424.0157,3779.528,33.46457,404.3307,3897.638,33.46457,404.3307,3779.528,33.46457,424.0157,3897.638,33.46457],
				"normals": [0,0,1],
				"faces": [32,0,1,2,0,0,0,32,1,0,3,0,0,0]
			}
		},
		{
			"uuid": "6A37602C-49B7-4E1D-B6B1-4FF56A8ABF5C",
			"type": "Geometry",
			"data": {
				"vertices": [463.3858,3779.528,33.46457,443.7008,3897.638,33.46457,443.7008,3779.528,33.46457,463.3858,3897.638,33.46457],
				"normals": [0,0,1],
				"faces": [32,0,1,2,0,0,0,32,1,0,3,0,0,0]
			}
		},
		{
			"uuid": "7002BB60-28A8-40F0-855A-A0F927F49920",
			"type": "Geometry",
			"data": {
				"vertices": [502.7559,3779.528,33.46457,483.0709,3897.638,33.46457,483.0709,3779.528,33.46457,502.7559,3897.638,33.46457],
				"normals": [0,0,1],
				"faces": [32,0,1,2,0,0,0,32,1,0,3,0,0,0]
			}
		},
		{
			"uuid": "86D17AFE-B1E5-40B3-8AF3-8C02B08D4F35",
			"type": "Geometry",
			"data": {
				"vertices": [542.126,3779.528,33.46457,522.4409,3897.638,33.46457,522.4409,3779.528,33.46457,542.126,3897.638,33.46457],
				"normals": [0,0,1],
				"faces": [32,0,1,2,0,0,0,32,1,0,3,0,0,0]
			}
		},
		{
			"uuid": "B83EE513-D6C6-47A4-B8C4-4BDFEB7101E7",
			"type": "Geometry",
			"data": {
				"vertices": [581.4961,3779.528,33.46457,561.811,3897.638,33.46457,561.811,3779.528,33.46457,581.4961,3897.638,33.46457],
				"normals": [0,0,1],
				"faces": [32,0,1,2,0,0,0,32,1,0,3,0,0,0]
			}
		},
		{
			"uuid": "94B2DB5B-250E-4211-9AA7-36EB9DC3B93C",
			"type": "Geometry",
			"data": {
				"vertices": [620.8661,3779.528,33.46457,601.1811,3897.638,33.46457,601.1811,3779.528,33.46457,620.8661,3897.638,33.46457],
				"normals": [0,0,1],
				"faces": [32,0,1,2,0,0,0,32,1,0,3,0,0,0]
			}
		},
		{
			"uuid": "E55BFBA3-D7C6-4A4A-BB1C-163579E6592C",
			"type": "Geometry",
			"data": {
				"vertices": [660.2362,3779.528,33.46457,640.5512,3897.638,33.46457,640.5512,3779.528,33.46457,660.2362,3897.638,33.46457],
				"normals": [0,0,1],
				"faces": [32,0,1,2,0,0,0,32,1,0,3,0,0,0]
			}
		},
		{
			"uuid": "401054CF-2A47-4917-A756-51DACFCDECB8",
			"type": "Geometry",
			"data": {
				"vertices": [699.6063,3779.528,33.46457,679.9213,3897.638,33.46457,679.9213,3779.528,33.46457,699.6063,3897.638,33.46457],
				"normals": [0,0,1],
				"faces": [32,0,1,2,0,0,0,32,1,0,3,0,0,0]
			}
		},
		{
			"uuid": "D6FCA06A-CFB4-4A0A-9154-1C37F1878524",
			"type": "Geometry",
			"data": {
				"vertices": [738.9764,3779.528,33.46457,719.2913,3897.638,33.46457,719.2913,3779.528,33.46457,738.9764,3897.638,33.46457],
				"normals": [0,0,1],
				"faces": [32,0,1,2,0,0,0,32,1,0,3,0,0,0]
			}
		},
		{
			"uuid": "15C44338-CF1D-4763-B7C5-CB66C205D3EB",
			"type": "Geometry",
			"data": {
				"vertices": [15.74803,4.547474e-13,33.46457,23.62205,3937.008,33.46457,15.74803,3937.008,33.46457,23.62205,4.547474e-13,33.46457],
				"normals": [0,0,1],
				"faces": [32,0,1,2,0,0,0,32,1,0,3,0,0,0]
			}
		},
		{
			"uuid": "F94E6E3C-6F67-4846-ADD7-CB03C17F7B48",
			"type": "Geometry",
			"data": {
				"vertices": [748.0315,3720.472,33.46457,39.37008,3740.157,33.46457,39.37008,3720.472,33.46457,748.0315,3740.157,33.46457],
				"normals": [0,0,1],
				"faces": [32,0,1,2,0,0,0,32,1,0,3,0,0,0]
			}
		},
		{
			"uuid": "586AADAF-3A58-4A08-9992-FBA8A2002176",
			"type": "Geometry",
			"data": {
				"vertices": [403.5433,431.0228,33.46457,383.8583,549.1331,33.46457,383.8583,431.0228,33.46457,403.5433,549.1331,33.46457],
				"normals": [0,0,1],
				"faces": [32,0,1,2,0,0,0,32,1,0,3,0,0,0]
			}
		},
		{
			"uuid": "7F05D200-6A73-4106-B956-9C65B01FB5BC",
			"type": "Geometry",
			"data": {
				"vertices": [403.5433,745.9835,33.46457,383.8583,864.0937,33.46457,383.8583,745.9835,33.46457,403.5433,864.0937,33.46457],
				"normals": [0,0,1],
				"faces": [32,0,1,2,0,0,0,32,1,0,3,0,0,0]
			}
		},
		{
			"uuid": "09A334B0-7DCB-4D49-98CF-D3DC93A51FE4",
			"type": "Geometry",
			"data": {
				"vertices": [403.5433,116.2425,33.46457,383.8583,234.3527,33.46457,383.8583,116.2425,33.46457,403.5433,234.3527,33.46457],
				"normals": [0,0,1],
				"faces": [32,0,1,2,0,0,0,32,1,0,3,0,0,0]
			}
		},
		{
			"uuid": "FB300F7E-8B8D-4221-953F-65D2E2F77B1B",
			"type": "Geometry",
			"data": {
				"vertices": [403.5433,273.7228,33.46457,383.8583,391.8331,33.46457,383.8583,273.7228,33.46457,403.5433,391.8331,33.46457],
				"normals": [0,0,1],
				"faces": [32,0,1,2,0,0,0,32,1,0,3,0,0,0]
			}
		},
		{
			"uuid": "3739C399-27F8-40DC-B5E6-48A68CA5095B",
			"type": "Geometry",
			"data": {
				"vertices": [403.5433,0,33.46457,383.8583,77.67043,33.46457,383.8583,4.547474e-13,33.46457,403.5433,77.67043,33.46457],
				"normals": [0,0,1],
				"faces": [32,0,1,2,0,0,0,32,1,0,3,0,0,0]
			}
		},
		{
			"uuid": "2FB29991-7575-4DA8-A8A7-5A75563ED7F1",
			"type": "Geometry",
			"data": {
				"vertices": [763.4484,0,33.46457,771.3225,3937.008,33.46457,763.4484,3937.008,33.46457,771.3225,0,33.46457],
				"normals": [0,0,1],
				"faces": [32,0,1,2,0,0,0,32,1,0,3,0,0,0]
			}
		},
		{
			"uuid": "6D103EA8-A542-4C40-BB69-17EA6F7E4852",
			"type": "Geometry",
			"data": {
				"vertices": [403.5433,3582.677,33.46457,383.8583,3700.787,33.46457,383.8583,3582.677,33.46457,403.5433,3700.787,33.46457],
				"normals": [0,0,1],
				"faces": [32,0,1,2,0,0,0,32,1,0,3,0,0,0]
			}
		},
		{
			"uuid": "A844A80E-2011-4589-A163-04D48DFFF070",
			"type": "Geometry",
			"data": {
				"vertices": [403.5433,3425.197,33.46457,383.8583,3543.307,33.46457,383.8583,3425.197,33.46457,403.5433,3543.307,33.46457],
				"normals": [0,0,1],
				"faces": [32,0,1,2,0,0,0,32,1,0,3,0,0,0]
			}
		},
		{
			"uuid": "45E3E6B1-02BB-4E80-ACC8-EB4A61BCB674",
			"type": "Geometry",
			"data": {
				"vertices": [403.5433,3267.717,33.46457,383.8583,3385.827,33.46457,383.8583,3267.717,33.46457,403.5433,3385.827,33.46457],
				"normals": [0,0,1],
				"faces": [32,0,1,2,0,0,0,32,1,0,3,0,0,0]
			}
		},
		{
			"uuid": "E055551F-BD7C-4036-8CF2-3261AE83BC4B",
			"type": "Geometry",
			"data": {
				"vertices": [403.5433,2953.554,33.46457,383.8583,3071.664,33.46457,383.8583,2953.554,33.46457,403.5433,3071.664,33.46457],
				"normals": [0,0,1],
				"faces": [32,0,1,2,0,0,0,32,1,0,3,0,0,0]
			}
		},
		{
			"uuid": "56207EA5-ABBC-4246-ABD5-6E82CD1B5E43",
			"type": "Geometry",
			"data": {
				"vertices": [403.5433,2796.074,33.46457,383.8583,2914.184,33.46457,383.8583,2796.074,33.46457,403.5433,2914.184,33.46457],
				"normals": [0,0,1],
				"faces": [32,0,1,2,0,0,0,32,1,0,3,0,0,0]
			}
		},
		{
			"uuid": "BCD2C0D3-3C57-467F-A176-918911E71305",
			"type": "Geometry",
			"data": {
				"vertices": [403.5433,3111.034,33.46457,383.8583,3229.144,33.46457,383.8583,3111.034,33.46457,403.5433,3229.144,33.46457],
				"normals": [0,0,1],
				"faces": [32,0,1,2,0,0,0,32,1,0,3,0,0,0]
			}
		},
		{
			"uuid": "18169844-2C6F-46B5-AED4-A2301F446457",
			"type": "Geometry",
			"data": {
				"vertices": [403.5433,2321.321,33.46457,383.8583,2439.431,33.46457,383.8583,2321.321,33.46457,403.5433,2439.431,33.46457],
				"normals": [0,0,1],
				"faces": [32,0,1,2,0,0,0,32,1,0,3,0,0,0]
			}
		},
		{
			"uuid": "E0C986B5-4C5B-4844-9585-BD99802C30CE",
			"type": "Geometry",
			"data": {
				"vertices": [403.5433,2006.361,33.46457,383.8583,2124.471,33.46457,383.8583,2006.361,33.46457,403.5433,2124.471,33.46457],
				"normals": [0,0,1],
				"faces": [32,0,1,2,0,0,0,32,1,0,3,0,0,0]
			}
		},
		{
			"uuid": "9D7ECBD7-97D0-4117-8E74-1E477D45D3F9",
			"type": "Geometry",
			"data": {
				"vertices": [403.5433,2478.003,33.46457,383.8583,2596.114,33.46457,383.8583,2478.003,33.46457,403.5433,2596.114,33.46457],
				"normals": [0,0,1],
				"faces": [32,0,1,2,0,0,0,32,1,0,3,0,0,0]
			}
		},
		{
			"uuid": "544A87D5-CA22-4814-B503-A13C7FC94B43",
			"type": "Geometry",
			"data": {
				"vertices": [403.5433,2163.841,33.46457,383.8583,2281.951,33.46457,383.8583,2163.841,33.46457,403.5433,2281.951,33.46457],
				"normals": [0,0,1],
				"faces": [32,0,1,2,0,0,0,32,1,0,3,0,0,0]
			}
		},
		{
			"uuid": "19584361-0E34-4069-BC68-7983A991765F",
			"type": "Geometry",
			"data": {
				"vertices": [403.5433,2635.484,33.46457,383.8583,2753.594,33.46457,383.8583,2635.484,33.46457,403.5433,2753.594,33.46457],
				"normals": [0,0,1],
				"faces": [32,0,1,2,0,0,0,32,1,0,3,0,0,0]
			}
		},
		{
			"uuid": "AAC1CE4D-97A1-46B9-A738-CD7D92C15AC6",
			"type": "Geometry",
			"data": {
				"vertices": [403.5433,1690.573,33.46457,383.8583,1808.683,33.46457,383.8583,1690.573,33.46457,403.5433,1808.683,33.46457],
				"normals": [0,0,1],
				"faces": [32,0,1,2,0,0,0,32,1,0,3,0,0,0]
			}
		},
		{
			"uuid": "90AFDD1E-A37D-4A5C-BEAC-32BECA5E8FD1",
			"type": "Geometry",
			"data": {
				"vertices": [403.5433,1848.053,33.46457,383.8583,1966.163,33.46457,383.8583,1848.053,33.46457,403.5433,1966.163,33.46457],
				"normals": [0,0,1],
				"faces": [32,0,1,2,0,0,0,32,1,0,3,0,0,0]
			}
		},
		{
			"uuid": "4D79A024-C548-4DC5-9F2D-A0C25F4F28CC",
			"type": "Geometry",
			"data": {
				"vertices": [403.5433,1533.89,33.46457,383.8583,1652.001,33.46457,383.8583,1533.89,33.46457,403.5433,1652.001,33.46457],
				"normals": [0,0,1],
				"faces": [32,0,1,2,0,0,0,32,1,0,3,0,0,0]
			}
		},
		{
			"uuid": "AFBF7742-4E86-4C17-9979-4FF08C65622A",
			"type": "Geometry",
			"data": {
				"vertices": [403.5433,1218.93,33.46457,383.8583,1337.04,33.46457,383.8583,1218.93,33.46457,403.5433,1337.04,33.46457],
				"normals": [0,0,1],
				"faces": [32,0,1,2,0,0,0,32,1,0,3,0,0,0]
			}
		},
		{
			"uuid": "2AEDFC45-5D78-4416-B4B1-FE1FB04281B7",
			"type": "Geometry",
			"data": {
				"vertices": [403.5433,1376.41,33.46457,383.8583,1494.52,33.46457,383.8583,1376.41,33.46457,403.5433,1494.52,33.46457],
				"normals": [0,0,1],
				"faces": [32,0,1,2,0,0,0,32,1,0,3,0,0,0]
			}
		},
		{
			"uuid": "F07CF2E5-C274-41E1-9714-1BD40EBD19E0",
			"type": "Geometry",
			"data": {
				"vertices": [403.5433,588.5032,33.46457,383.8583,706.6134,33.46457,383.8583,588.5032,33.46457,403.5433,706.6134,33.46457],
				"normals": [0,0,1],
				"faces": [32,0,1,2,0,0,0,32,1,0,3,0,0,0]
			}
		},
		{
			"uuid": "C8F9E237-6EB9-488F-9155-5036C40A312A",
			"type": "Geometry",
			"data": {
				"vertices": [403.5433,1060.146,33.46457,383.8583,1178.256,33.46457,383.8583,1060.146,33.46457,403.5433,1178.256,33.46457],
				"normals": [0,0,1],
				"faces": [32,0,1,2,0,0,0,32,1,0,3,0,0,0]
			}
		},
		{
			"uuid": "2B649779-B199-4381-B67E-EAFE9FAE1A2E",
			"type": "Geometry",
			"data": {
				"vertices": [403.5433,902.6658,33.46457,383.8583,1020.776,33.46457,383.8583,902.6658,33.46457,403.5433,1020.776,33.46457],
				"normals": [0,0,1],
				"faces": [32,0,1,2,0,0,0,32,1,0,3,0,0,0]
			}
		}],
	"materials": [
		{
			"uuid": "8B870B18-F4D6-4028-BE9F-2C1BDA476CE9",
			"type": "MeshLambertMaterial",
			"name": "Color_007",
			"color": 3815994,
			"emissive": 0
		},
		{
			"uuid": "8B790DB6-4E28-486E-A69E-881AD011C53C",
			"type": "MeshLambertMaterial",
			"name": "Color_000",
			"color": 16777215,
			"emissive": 0
		},
		{
			"uuid": "DD1E8E6F-3BE5-4EE5-BCA8-E8448B7B2A57",
			"type": "MeshLambertMaterial",
			"name": "Color_D01",
			"color": 16760320,
			"emissive": 0
		},
		{
			"uuid": "0BC88A84-C433-4625-A70A-D4CA3E948892",
			"type": "MeshLambertMaterial",
			"name": "material",
			"color": 16777215,
			"emissive": 0
		}]
}