{
	"object": {
		"uuid": "4863FD38-C8F5-4A7D-AF0A-C72652618D4C",
		"type": "Group",
		"name": "Casita1.dae",
		"matrix": [0.029999999329447746,0,0,0,0,-0.000006110195954533992,-0.029999999329447746,0,0,0.029999999329447746,-0.000006110195954533992,0,0,0,0,1],
		"children": [
			{
				"uuid": "8E724BD2-2C14-49EB-B3B3-B625D9D46CCD",
				"type": "Object3D",
				"name": "SketchUp",
				"matrix": [1,0,0,0,0,1,0,0,0,0,1,0,0,0,0,1],
				"children": [
					{
						"uuid": "7349D0B5-B7E1-4FED-9FEB-B279062183BA",
						"type": "Object3D",
						"name": "group_0",
						"matrix": [1,0,0,0,0,1,0,0,0,0,1,0,55.34033966064453,-19.685039520263672,-1.77635700880684e-14,1],
						"children": [
							{
								"uuid": "BE0BBE61-87F3-4B5C-9071-EE1A14E26A0F",
								"type": "Mesh",
								"matrix": [1,0,0,0,0,1,0,0,0,0,1,0,0,0,0,1],
								"geometry": "960D2FA0-C793-4444-9D73-7565F56CAB19",
								"material": "318F67F1-FDAD-43E7-B821-C9D63E92CEE1"
							},
							{
								"uuid": "CD7D9934-7638-4282-AB28-5B7D6EE4DD24",
								"type": "Mesh",
								"matrix": [1,0,0,0,0,1,0,0,0,0,1,0,0,0,0,1],
								"geometry": "96006AFE-E387-4863-8EE5-E94D984758D1",
								"material": "690F6E19-D49A-4BF3-8D42-117D681C6107"
							},
							{
								"uuid": "69B0F512-06E6-4890-B5DE-78206438DE47",
								"type": "Mesh",
								"matrix": [1,0,0,0,0,1,0,0,0,0,1,0,0,0,0,1],
								"geometry": "BF27A439-4557-4CE3-B8A0-4B85DA63B5F3",
								"material": "3D749EBC-CEB0-4A5F-9CAB-8EEB2424EA41"
							},
							{
								"uuid": "1182B0BC-2E80-4FD7-8461-9863CA549573",
								"type": "Mesh",
								"matrix": [1,0,0,0,0,1,0,0,0,0,1,0,0,0,0,1],
								"geometry": "B411C6D8-BEAA-4F89-A365-4DC11BB6AC16",
								"material": "CD298A2B-9E94-4E32-A40B-7CDB032C22E5"
							},
							{
								"uuid": "817B6605-0F8F-432B-908F-57B6584ADC01",
								"type": "Mesh",
								"matrix": [1,0,0,0,0,1,0,0,0,0,1,0,0,0,0,1],
								"geometry": "BF320620-AFCF-4FCE-8FA5-E506B9634107",
								"material": "3309C702-0DF6-4529-8D53-2D0C6728C653"
							},
							{
								"uuid": "A5D484A5-0493-4E8E-8B5E-324565235C4D",
								"type": "Mesh",
								"matrix": [1,0,0,0,0,1,0,0,0,0,1,0,0,0,0,1],
								"geometry": "0D6EBAC2-9009-46B2-9279-D470BDDA07AD",
								"material": "555D2B15-2E68-43D1-843B-990C30E33038"
							},
							{
								"uuid": "31BDA831-1D7D-402E-8C12-77F5D3ECF213",
								"type": "Mesh",
								"matrix": [1,0,0,0,0,1,0,0,0,0,1,0,0,0,0,1],
								"geometry": "9D1221EB-AD55-4BED-8454-3F202B245027",
								"material": "54115965-C8C1-40D9-A49B-5A6E1A37D410"
							},
							{
								"uuid": "6126A99E-3FDD-4383-8F45-53746B6A2C8D",
								"type": "Mesh",
								"matrix": [1,0,0,0,0,1,0,0,0,0,1,0,0,0,0,1],
								"geometry": "E2E214C8-4ACE-4BEC-8054-A2CA8C0779CC",
								"material": "516E9B6C-38D8-4725-B2BF-74CA6CE8C771"
							},
							{
								"uuid": "91F7FD40-E496-417C-AE05-742A495DDC54",
								"type": "Mesh",
								"matrix": [1,0,0,0,0,1,0,0,0,0,1,0,0,0,0,1],
								"geometry": "76E68834-016D-462E-972D-A0C543DCB374",
								"material": "295EC963-A163-46EB-AAB2-3F19E7C8AB31"
							},
							{
								"uuid": "EE5CFDE0-8083-4083-822C-90148AD26281",
								"type": "Mesh",
								"matrix": [1,0,0,0,0,1,0,0,0,0,1,0,0,0,0,1],
								"geometry": "33A4F8C5-464A-4201-8ABE-50BADFCA08D6",
								"material": "32888E30-611F-4ACA-B564-33C242E086B3"
							},
							{
								"uuid": "B3972AC7-E3B8-4835-9429-776E429CE6C6",
								"type": "Mesh",
								"matrix": [1,0,0,0,0,1,0,0,0,0,1,0,0,0,0,1],
								"geometry": "F266A606-9576-4006-B066-E40723278893",
								"material": "086369D9-B78C-40D8-8132-F1E4F8B54011"
							},
							{
								"uuid": "FE8C7316-4671-477F-A3C0-961BB32836C0",
								"type": "Mesh",
								"matrix": [1,0,0,0,0,1,0,0,0,0,1,0,0,0,0,1],
								"geometry": "8DB695A3-3163-4047-989E-27631EA8CCA4",
								"material": "FF05EF2D-FCA8-4E5F-97A5-A12879BC5486"
							},
							{
								"uuid": "5612356E-463A-4B40-AEB2-BE0DAAA5CDFD",
								"type": "Mesh",
								"matrix": [1,0,0,0,0,1,0,0,0,0,1,0,0,0,0,1],
								"geometry": "44383D63-E20D-4DD8-BE33-2F2541F0D48C",
								"material": "1434D554-54F5-456F-B032-C4430F72FE35"
							},
							{
								"uuid": "246A74E2-3DC4-4371-8B6C-77FDED56B174",
								"type": "Mesh",
								"matrix": [1,0,0,0,0,1,0,0,0,0,1,0,0,0,0,1],
								"geometry": "0D6ED4F4-1DCE-48F3-9071-299A756108C4",
								"material": "3D4D9A53-EDF5-4704-9975-F55B76449FC9"
							},
							{
								"uuid": "7AE5A080-0BE5-41CA-A5EA-46F6D173E45C",
								"type": "Mesh",
								"matrix": [1,0,0,0,0,1,0,0,0,0,1,0,0,0,0,1],
								"geometry": "C19D0870-91FA-4C76-8676-9398E26C5640",
								"material": "9762E380-4FCF-42F6-AAA5-7C6283EE87F3"
							},
							{
								"uuid": "3C75BD95-993C-4133-87C7-839AB91A1029",
								"type": "Mesh",
								"matrix": [1,0,0,0,0,1,0,0,0,0,1,0,0,0,0,1],
								"geometry": "DB5B93A0-A1D7-4261-BE47-811B9B7A741B",
								"material": "87D5A0D2-7848-416B-895A-BE0A374D2ABB"
							},
							{
								"uuid": "1E47747E-F990-439A-8B59-1F2A042B1998",
								"type": "Mesh",
								"matrix": [1,0,0,0,0,1,0,0,0,0,1,0,0,0,0,1],
								"geometry": "AF2FC7DB-D33C-4A7D-8E14-7A5BA447F78A",
								"material": "49ACC549-1E78-4789-BE86-DCE959306F79"
							},
							{
								"uuid": "4E476839-2A9B-4689-9BC2-CF21B66DD4B4",
								"type": "Mesh",
								"matrix": [1,0,0,0,0,1,0,0,0,0,1,0,0,0,0,1],
								"geometry": "F9BC7E07-D478-47DD-9B56-8A04072B6250",
								"material": "6C278F55-3547-4220-9805-3A042DBE01A1"
							},
							{
								"uuid": "3D4EC1B0-57AE-4F3F-AEC8-A3351E7034F1",
								"type": "Mesh",
								"matrix": [1,0,0,0,0,1,0,0,0,0,1,0,0,0,0,1],
								"geometry": "6988D548-FF22-475D-98D1-67D1234EA548",
								"material": "6C278F55-3547-4220-9805-3A042DBE01A1"
							},
							{
								"uuid": "D9BFF44C-C558-444A-9CDE-56A33B35C837",
								"type": "Mesh",
								"matrix": [1,0,0,0,0,1,0,0,0,0,1,0,0,0,0,1],
								"geometry": "2BC460DD-211F-4965-9E9E-F56FC3FF1BB6",
								"material": "7F977947-307B-473F-A0E5-268DDAD3A382"
							},
							{
								"uuid": "1486078B-B7B2-4426-8A1C-8890E0618CA1",
								"type": "Mesh",
								"matrix": [1,0,0,0,0,1,0,0,0,0,1,0,0,0,0,1],
								"geometry": "88D4591D-B135-4D50-AD6B-9425AA63DE40",
								"material": "204B8223-941B-444D-8B61-7DC96EED3D0B"
							},
							{
								"uuid": "D422F871-9176-42AD-9760-8FF8F5591C8C",
								"type": "Mesh",
								"matrix": [1,0,0,0,0,1,0,0,0,0,1,0,0,0,0,1],
								"geometry": "06C6CA53-3DC2-48A1-9218-FB9A07BE4896",
								"material": "0F51992F-8AF8-44B2-8647-C387AC3F48CF"
							},
							{
								"uuid": "52E9AD64-074F-4FFA-9484-254F9A4EAC62",
								"type": "Mesh",
								"matrix": [1,0,0,0,0,1,0,0,0,0,1,0,0,0,0,1],
								"geometry": "3BDB0F7B-02A1-49DF-BD77-7EF615B8DF37",
								"material": "C160A450-0FD4-4AA6-B7BF-9F10112C5C55"
							},
							{
								"uuid": "79FF8276-AA77-48F5-BAB6-59CBC2878B88",
								"type": "Mesh",
								"matrix": [1,0,0,0,0,1,0,0,0,0,1,0,0,0,0,1],
								"geometry": "B5258137-C66D-413F-9AB4-084864257110",
								"material": "C160A450-0FD4-4AA6-B7BF-9F10112C5C55"
							},
							{
								"uuid": "4622913E-B8B7-45EF-A03D-2CFB25B09E4B",
								"type": "Mesh",
								"matrix": [1,0,0,0,0,1,0,0,0,0,1,0,0,0,0,1],
								"geometry": "2483DA39-3F07-45A3-AC8C-4ACEFCAE72BE",
								"material": "C160A450-0FD4-4AA6-B7BF-9F10112C5C55"
							},
							{
								"uuid": "5FFAD7F4-8FCA-408B-9015-9A3AD39F0E04",
								"type": "Mesh",
								"matrix": [1,0,0,0,0,1,0,0,0,0,1,0,0,0,0,1],
								"geometry": "7EE38747-BD3A-4A7B-97B1-9F29F189DEA5",
								"material": "C160A450-0FD4-4AA6-B7BF-9F10112C5C55"
							}]
					}]
			}]
	},
	"metadata": {
		"version": 4.4,
		"type": "Object",
		"generator": "Object3D.toJSON"
	},
	"geometries": [
		{
			"uuid": "960D2FA0-C793-4444-9D73-7565F56CAB19",
			"type": "Geometry",
			"data": {
				"vertices": [237.13,310.7319,107.9824,243.65,0,119.8184,237.13,0,107.9824,243.65,354.3307,119.8184,237.13,354.3307,107.9824],
				"normals": [0.8758959,-1.206371e-18,-0.4825001],
				"faces": [32,0,1,2,0,0,0,32,1,0,3,0,0,0,32,3,0,4,0,0,0]
			}
		},
		{
			"uuid": "96006AFE-E387-4863-8EE5-E94D984758D1",
			"type": "Geometry",
			"data": {
				"vertices": [243.65,0,119.8184,121.825,0,177.1654,237.13,0,107.9824,121.825,0,192.9134,0,0,119.8184,6.520038,0,107.9824,121.825,0,192.9134,0,354.3307,119.8184,0,0,119.8184,121.825,354.3307,192.9134,0,354.3307,119.8184,6.520038,0,107.9824,0,0,119.8184,6.520038,354.3307,107.9824,243.65,0,119.8184,121.825,354.3307,192.9134,121.825,0,192.9134,243.65,354.3307,119.8184,0,354.3307,119.8184,121.825,354.3307,177.1654,6.520038,354.3307,107.9824,121.825,354.3307,192.9134,243.65,354.3307,119.8184,237.13,354.3307,107.9824],
				"normals": [0,-1,0,-0.5144958,0,0.8574929,-0.8758959,0,-0.4825001,0.5144958,0,0.8574929,0,1,0],
				"faces": [32,0,1,2,0,0,0,32,1,0,3,0,0,0,32,1,4,5,0,0,0,32,4,1,3,0,0,0,32,6,7,8,1,1,1,32,7,6,9,1,1,1,32,10,11,12,2,2,2,32,11,10,13,2,2,2,32,14,15,16,3,3,3,32,15,14,17,3,3,3,32,18,19,20,4,4,4,32,19,18,21,4,4,4,32,19,22,23,4,4,4,32,22,19,21,4,4,4]
			}
		},
		{
			"uuid": "BF27A439-4557-4CE3-B8A0-4B85DA63B5F3",
			"type": "Geometry",
			"data": {
				"vertices": [43.08486,334.6457,3.552714e-15,38.86701,19.68504,25.30708,43.08486,19.68504,3.552714e-15,38.86701,334.6457,25.30708,38.86701,334.6457,25.30708,43.08486,334.6457,3.552714e-15,38.86701,19.68504,25.30708,43.08486,19.68504,3.552714e-15,38.86701,334.6457,25.30708,200.5652,334.6457,3.552714e-15,43.08486,334.6457,3.552714e-15,204.783,334.6457,25.30708,43.08486,19.68504,3.552714e-15,88.4613,19.68504,25.30708,92.67914,19.68504,2.43388e-15,38.86701,19.68504,25.30708,38.86701,19.68504,25.30708,43.08486,19.68504,3.552714e-15,88.4613,19.68504,25.30708,92.67914,19.68504,2.43388e-15,200.5652,334.6457,3.552714e-15,204.783,19.68504,25.30708,200.5652,19.68504,1.421085e-14,204.783,334.6457,25.30708,155.1887,19.68504,25.30708,200.5652,19.68504,1.421085e-14,150.9709,19.68504,8.537356e-16,204.783,19.68504,25.30708,204.783,19.68504,25.30708,155.1887,19.68504,25.30708,200.5652,19.68504,1.421085e-14,150.9709,19.68504,8.537356e-16],
				"normals": [0.9863939,3.768138e-18,0.164399,0,1,0,-0.9863939,-3.768138e-18,-0.164399,0,-1,0,0.9863939,-6.405834e-18,-0.164399],
				"faces": [32,0,1,2,0,0,0,32,1,0,3,0,0,0,32,12,13,14,1,1,1,32,13,12,15,1,1,1,32,24,25,26,1,1,1,32,25,24,27,1,1,1,32,4,5,6,2,2,2,32,7,6,5,2,2,2,32,8,9,10,1,1,1,32,9,8,11,1,1,1,32,16,17,18,3,3,3,32,19,18,17,3,3,3,32,20,21,22,4,4,4,32,21,20,23,4,4,4,32,28,29,30,3,3,3,32,31,30,29,3,3,3]
			}
		},
		{
			"uuid": "B411C6D8-BEAA-4F89-A365-4DC11BB6AC16",
			"type": "Geometry",
			"data": {
				"vertices": [23.39982,19.68504,118.1102,88.4613,19.68504,25.30708,38.86701,19.68504,25.30708,76.37235,19.68504,97.84074,167.2777,19.68504,97.84074,204.783,19.68504,25.30708,155.1887,19.68504,25.30708,220.2502,19.68504,118.1102,121.825,19.68504,177.1654,121.825,19.68504,177.1654,23.39982,19.68504,118.1102,220.2502,19.68504,118.1102,167.2777,19.68504,97.84074,204.783,19.68504,25.30708,155.1887,19.68504,25.30708,76.37235,19.68504,97.84074,88.4613,19.68504,25.30708,38.86701,19.68504,25.30708,38.86701,19.68504,25.30708,36.34462,108.4872,40.44142,23.39982,19.68504,118.1102,38.86701,334.6457,25.30708,27.57741,99.26594,93.04468,36.34462,245.8435,40.44142,27.57741,255.0648,93.04468,23.39982,334.6457,118.1102,38.86701,334.6457,25.30708,27.57741,255.0648,93.04468,23.39982,334.6457,118.1102,27.57741,99.26594,93.04468,23.39982,19.68504,118.1102,36.34462,245.8435,40.44142,36.34462,108.4872,40.44142,38.86701,19.68504,25.30708,204.783,19.68504,25.30708,207.0921,107.1324,39.16141,220.2502,19.68504,118.1102,204.783,334.6457,25.30708,215.8593,97.91111,91.76467,207.0921,244.4887,39.16141,215.8593,253.71,91.76467,220.2502,334.6457,118.1102,23.39982,334.6457,118.1102,204.783,334.6457,25.30708,38.86701,334.6457,25.30708,220.2502,334.6457,118.1102,121.825,334.6457,177.1654],
				"normals": [0,1,0,0.9863939,-9.926316e-18,0.164399,0,-1,0,-0.9863939,9.926316e-18,-0.164399,0.9863939,-3.01451e-18,-0.164399],
				"faces": [32,0,1,2,0,0,0,32,1,0,3,0,0,0,32,3,0,4,0,0,0,32,4,5,6,0,0,0,32,5,4,7,0,0,0,32,7,4,0,0,0,0,32,7,0,8,0,0,0,32,18,19,20,1,1,1,32,19,18,21,1,1,1,32,20,19,22,1,1,1,32,19,21,23,1,1,1,32,23,21,24,1,1,1,32,22,25,20,1,1,1,32,25,22,24,1,1,1,32,25,24,21,1,1,1,32,9,10,11,2,2,2,32,10,12,11,2,2,2,32,11,12,13,2,2,2,32,14,13,12,2,2,2,32,12,10,15,2,2,2,32,15,10,16,2,2,2,32,17,16,10,2,2,2,32,26,27,28,3,3,3,32,27,29,28,3,3,3,32,30,28,29,3,3,3,32,27,26,31,3,3,3,32,31,26,32,3,3,3,32,29,32,30,3,3,3,32,26,33,32,3,3,3,32,30,32,33,3,3,3,32,34,35,36,4,4,4,32,35,34,37,4,4,4,32,36,35,38,4,4,4,32,35,37,39,4,4,4,32,39,37,40,4,4,4,32,38,41,36,4,4,4,32,41,38,40,4,4,4,32,41,40,37,4,4,4,32,42,43,44,0,0,0,32,43,42,45,0,0,0,32,45,42,46,0,0,0]
			}
		},
		{
			"uuid": "BF320620-AFCF-4FCE-8FA5-E506B9634107",
			"type": "Geometry",
			"data": {
				"vertices": [88.91382,19.68504,86.57312,121.0376,19.68504,58.23823,95.03077,19.68504,58.23823,121.0376,19.68504,60.78651,121.0376,19.68504,62.36131,121.0376,19.68504,86.57312,121.0376,19.68504,86.57312,88.91382,19.68504,86.57312,121.0376,19.68504,62.36131,121.0376,19.68504,60.78651,121.0376,19.68504,58.23823,95.03077,19.68504,58.23823],
				"normals": [0,1,0,0,-1,0],
				"faces": [32,0,1,2,0,0,0,32,1,0,3,0,0,0,32,3,0,4,0,0,0,32,4,0,5,0,0,0,32,6,7,8,1,1,1,32,8,7,9,1,1,1,32,9,7,10,1,1,1,32,11,10,7,1,1,1]
			}
		},
		{
			"uuid": "0D6EBAC2-9009-46B2-9279-D470BDDA07AD",
			"type": "Geometry",
			"data": {
				"vertices": [122.6124,19.68504,56.66343,141.5101,19.68504,25.30708,122.6124,19.68504,25.30708,148.2793,19.68504,56.66343,123.8425,19.68504,56.66343,123.8425,19.68504,56.66343,122.6124,19.68504,56.66343,148.2793,19.68504,56.66343,141.5101,19.68504,25.30708,122.6124,19.68504,25.30708],
				"normals": [0,1,0,0,-1,0],
				"faces": [32,0,1,2,0,0,0,32,1,0,3,0,0,0,32,3,0,4,0,0,0,32,5,6,7,1,1,1,32,7,6,8,1,1,1,32,9,8,6,1,1,1]
			}
		},
		{
			"uuid": "9D1221EB-AD55-4BED-8454-3F202B245027",
			"type": "Geometry",
			"data": {
				"vertices": [95.37074,19.68504,56.66343,121.0376,19.68504,25.30708,102.14,19.68504,25.30708,121.0376,19.68504,56.66343,121.0376,19.68504,56.66343,95.37074,19.68504,56.66343,121.0376,19.68504,25.30708,102.14,19.68504,25.30708],
				"normals": [0,1,0,0,-1,0],
				"faces": [32,0,1,2,0,0,0,32,1,0,3,0,0,0,32,4,5,6,1,1,1,32,7,6,5,1,1,1]
			}
		},
		{
			"uuid": "E2E214C8-4ACE-4BEC-8054-A2CA8C0779CC",
			"type": "Geometry",
			"data": {
				"vertices": [122.6124,19.68504,60.78651,123.8425,19.68504,58.23823,122.6124,19.68504,58.23823,148.6193,19.68504,58.23823,154.7362,19.68504,86.57312,122.6124,19.68504,62.36131,122.6124,19.68504,86.57312,122.6124,19.68504,86.57312,122.6124,19.68504,62.36131,154.7362,19.68504,86.57312,122.6124,19.68504,60.78651,148.6193,19.68504,58.23823,123.8425,19.68504,58.23823,122.6124,19.68504,58.23823],
				"normals": [0,1,0,0,-1,0],
				"faces": [32,0,1,2,0,0,0,32,1,0,3,0,0,0,32,3,0,4,0,0,0,32,4,0,5,0,0,0,32,4,5,6,0,0,0,32,7,8,9,1,1,1,32,8,10,9,1,1,1,32,9,10,11,1,1,1,32,11,10,12,1,1,1,32,13,12,10,1,1,1]
			}
		},
		{
			"uuid": "76E68834-016D-462E-972D-A0C543DCB374",
			"type": "Geometry",
			"data": {
				"vertices": [76.37235,19.68504,97.84074,102.14,19.68504,25.30708,88.4613,19.68504,25.30708,95.37074,19.68504,56.66343,95.03077,19.68504,58.23823,122.6124,19.68504,56.66343,123.8425,19.68504,56.66343,148.2793,19.68504,56.66343,88.91382,19.68504,86.57312,121.0376,19.68504,86.57312,122.6124,19.68504,86.57312,154.7362,19.68504,86.57312,92.67914,19.68504,2.43388e-15,150.9709,19.68504,8.537356e-16,121.825,19.68504,0,155.1887,19.68504,25.30708,121.0376,19.68504,25.30708,122.6124,19.68504,25.30708,141.5101,19.68504,25.30708,167.2777,19.68504,97.84074,148.6193,19.68504,58.23823,121.0376,19.68504,58.23823,122.6124,19.68504,58.23823,123.8425,19.68504,58.23823,121.0376,19.68504,60.78651,122.6124,19.68504,60.78651,121.0376,19.68504,62.36131,122.6124,19.68504,62.36131,121.0376,19.68504,56.66343,95.37074,19.68504,56.66343,121.0376,19.68504,56.66343,122.6124,19.68504,56.66343,122.6124,19.68504,25.30708,121.0376,19.68504,25.30708,122.6124,19.68504,86.57312,121.0376,19.68504,86.57312,122.6124,19.68504,62.36131,121.0376,19.68504,62.36131,122.6124,19.68504,60.78651,121.0376,19.68504,60.78651,122.6124,19.68504,58.23823,121.0376,19.68504,58.23823,76.37235,19.68504,97.84074,154.7362,19.68504,86.57312,167.2777,19.68504,97.84074,148.6193,19.68504,58.23823,123.8425,19.68504,58.23823,95.03077,19.68504,58.23823,148.2793,19.68504,56.66343,155.1887,19.68504,25.30708,141.5101,19.68504,25.30708,102.14,19.68504,25.30708,88.4613,19.68504,25.30708,92.67914,19.68504,2.43388e-15,150.9709,19.68504,8.537356e-16,121.825,19.68504,0,88.91382,19.68504,86.57312,123.8425,19.68504,56.66343],
				"normals": [0,1,0,0,-1,0],
				"faces": [32,0,1,2,0,0,0,32,1,0,3,0,0,0,32,3,0,4,0,0,0,32,3,4,5,0,0,0,32,5,4,6,0,0,0,32,6,4,7,0,0,0,32,4,0,8,0,0,0,32,8,0,9,0,0,0,32,9,0,10,0,0,0,32,10,0,11,0,0,0,32,12,13,14,0,0,0,32,13,12,15,0,0,0,32,15,12,2,0,0,0,32,15,2,1,0,0,0,32,15,1,16,0,0,0,32,15,16,17,0,0,0,32,15,17,18,0,0,0,32,15,18,7,0,0,0,32,15,7,19,0,0,0,32,19,7,20,0,0,0,32,20,7,4,0,0,0,32,20,4,21,0,0,0,32,20,21,22,0,0,0,32,20,22,23,0,0,0,32,19,20,11,0,0,0,32,19,11,0,0,0,0,32,24,22,21,0,0,0,32,22,24,25,0,0,0,32,25,24,26,0,0,0,32,25,26,27,0,0,0,32,27,26,9,0,0,0,32,27,9,10,0,0,0,32,28,17,16,0,0,0,32,17,28,5,0,0,0,32,5,28,3,0,0,0,32,29,30,31,1,1,1,32,31,30,32,1,1,1,32,33,32,30,1,1,1,32,34,35,36,1,1,1,32,35,37,36,1,1,1,32,36,37,38,1,1,1,32,37,39,38,1,1,1,32,38,39,40,1,1,1,32,41,40,39,1,1,1,32,42,43,44,1,1,1,32,43,45,44,1,1,1,32,46,40,45,1,1,1,32,40,41,45,1,1,1,32,41,47,45,1,1,1,32,47,48,45,1,1,1,32,45,48,44,1,1,1,32,44,48,49,1,1,1,32,48,50,49,1,1,1,32,50,32,49,1,1,1,32,32,33,49,1,1,1,32,33,51,49,1,1,1,32,51,52,49,1,1,1,32,52,53,49,1,1,1,32,49,53,54,1,1,1,32,55,54,53,1,1,1,32,43,42,34,1,1,1,32,34,42,35,1,1,1,32,35,42,56,1,1,1,32,56,42,47,1,1,1,32,48,47,57,1,1,1,32,57,47,31,1,1,1,32,31,47,29,1,1,1,32,47,42,29,1,1,1,32,29,42,51,1,1,1,32,52,51,42,1,1,1]
			}
		},
		{
			"uuid": "33A4F8C5-464A-4201-8ABE-50BADFCA08D6",
			"type": "Geometry",
			"data": {
				"vertices": [214.7807,247.033,85.29311,214.6512,176.5979,84.51642,214.7807,176.5979,85.29311,211.771,176.5979,67.2349,211.771,243.4418,67.2349,211.771,243.4418,67.2349,214.7807,247.033,85.29311,211.771,176.5979,67.2349,214.6512,176.5979,84.51642,214.7807,176.5979,85.29311],
				"normals": [-0.9863939,4.956934e-18,0.164399,0.9863939,-4.956934e-18,-0.164399],
				"faces": [32,0,1,2,0,0,0,32,1,0,3,0,0,0,32,3,0,4,0,0,0,32,5,6,7,1,1,1,32,7,6,8,1,1,1,32,9,8,6,1,1,1]
			}
		},
		{
			"uuid": "F266A606-9576-4006-B066-E40723278893",
			"type": "Geometry",
			"data": {
				"vertices": [208.5024,175.0231,47.62332,208.5024,111.7762,47.62332,208.6318,175.0231,48.4,211.5121,175.0231,65.68153,211.5121,108.2969,65.68153,208.6318,175.0231,48.4,211.5121,175.0231,65.68153,208.5024,111.7762,47.62332,211.5121,108.2969,65.68153,208.5024,175.0231,47.62332],
				"normals": [-0.9863939,-7.78923e-17,0.164399,0.9863939,7.78923e-17,-0.164399],
				"faces": [32,0,1,2,0,0,0,32,3,1,4,0,0,0,32,1,3,2,0,0,0,32,5,6,7,1,1,1,32,8,7,6,1,1,1,32,5,7,9,1,1,1]
			}
		},
		{
			"uuid": "8DB695A3-3163-4047-989E-27631EA8CCA4",
			"type": "Geometry",
			"data": {
				"vertices": [211.5121,176.5979,65.68153,208.5024,176.5979,47.62332,208.6318,176.5979,48.4,208.5024,239.5416,47.62332,211.5121,243.1329,65.68153,208.6318,239.6961,48.4,208.6318,239.6961,48.4,211.5121,243.1329,65.68153,208.5024,239.5416,47.62332,211.5121,176.5979,65.68153,208.5024,176.5979,47.62332,208.6318,176.5979,48.4],
				"normals": [-0.9863939,1.552856e-17,0.164399,0.9863939,-1.552856e-17,-0.164399],
				"faces": [32,0,1,2,0,0,0,32,1,0,3,0,0,0,32,3,0,4,0,0,0,32,3,4,5,0,0,0,32,6,7,8,1,1,1,32,7,9,8,1,1,1,32,8,9,10,1,1,1,32,11,10,9,1,1,1]
			}
		},
		{
			"uuid": "44383D63-E20D-4DD8-BE33-2F2541F0D48C",
			"type": "Geometry",
			"data": {
				"vertices": [36.34462,108.4872,40.44142,28.65601,105.9429,86.57312,27.57741,99.26594,93.04468,31.66571,109.5341,68.51491,34.93431,113.4342,48.90333,36.34462,245.8435,40.44142,31.9246,109.843,66.96153,34.80486,113.2798,49.68001,34.93431,176.378,48.90333,34.93431,177.9528,48.90333,34.80486,176.378,49.68001,31.9246,176.378,66.96153,31.66571,176.378,68.51491,28.78545,176.378,85.79643,28.65601,176.378,86.57312,34.93431,241.1996,48.90333,31.9246,244.679,66.96153,31.66571,244.9783,68.51491,28.65601,248.4576,86.57312,27.57741,255.0648,93.04468,28.65601,177.9528,86.57312,34.80486,177.9528,49.68001,31.9246,177.9528,66.96153,31.66571,177.9528,68.51491,28.78545,177.9528,85.79643,31.9246,176.378,66.96153,31.9246,109.843,66.96153,31.66571,176.378,68.51491,31.66571,109.5341,68.51491,31.66571,244.9783,68.51491,31.9246,244.679,66.96153,31.66571,177.9528,68.51491,31.9246,177.9528,66.96153,28.65601,248.4576,86.57312,28.65601,177.9528,86.57312,27.57741,255.0648,93.04468,28.78545,177.9528,85.79643,34.80486,177.9528,49.68001,34.93431,177.9528,48.90333,28.65601,176.378,86.57312,28.65601,105.9429,86.57312,27.57741,99.26594,93.04468,36.34462,245.8435,40.44142,34.93431,241.1996,48.90333,28.78545,176.378,85.79643,34.80486,176.378,49.68001,34.93431,176.378,48.90333,34.93431,113.4342,48.90333,34.80486,113.2798,49.68001,36.34462,108.4872,40.44142],
				"normals": [0.9863939,-4.938938e-17,0.164399,-0.9863939,4.938938e-17,-0.164399],
				"faces": [32,0,1,2,0,0,0,32,1,0,3,0,0,0,32,3,0,4,0,0,0,32,4,0,5,0,0,0,32,3,4,6,0,0,0,32,6,4,7,0,0,0,32,4,5,8,0,0,0,32,8,5,9,0,0,0,32,8,9,10,0,0,0,32,10,9,11,0,0,0,32,11,9,12,0,0,0,32,12,9,13,0,0,0,32,13,9,14,0,0,0,32,9,5,15,0,0,0,32,15,5,16,0,0,0,32,16,5,17,0,0,0,32,17,5,18,0,0,0,32,18,5,19,0,0,0,32,1,19,2,0,0,0,32,19,1,14,0,0,0,32,19,14,20,0,0,0,32,20,14,9,0,0,0,32,20,9,21,0,0,0,32,20,21,22,0,0,0,32,20,22,23,0,0,0,32,20,23,24,0,0,0,32,19,20,18,0,0,0,32,16,23,22,0,0,0,32,23,16,17,0,0,0,32,6,12,3,0,0,0,32,12,6,11,0,0,0,32,25,26,27,1,1,1,32,28,27,26,1,1,1,32,29,30,31,1,1,1,32,32,31,30,1,1,1,32,33,34,35,1,1,1,32,36,31,34,1,1,1,32,31,32,34,1,1,1,32,32,37,34,1,1,1,32,37,38,34,1,1,1,32,38,39,34,1,1,1,32,34,39,35,1,1,1,32,39,40,35,1,1,1,32,41,35,40,1,1,1,32,35,42,33,1,1,1,32,33,42,29,1,1,1,32,29,42,30,1,1,1,32,30,42,43,1,1,1,32,43,42,38,1,1,1,32,39,38,44,1,1,1,32,44,38,27,1,1,1,32,27,38,25,1,1,1,32,25,38,45,1,1,1,32,45,38,46,1,1,1,32,38,42,46,1,1,1,32,46,42,47,1,1,1,32,48,47,26,1,1,1,32,26,47,28,1,1,1,32,42,49,47,1,1,1,32,47,49,28,1,1,1,32,28,49,40,1,1,1,32,41,40,49,1,1,1]
			}
		},
		{
			"uuid": "0D6ED4F4-1DCE-48F3-9071-299A756108C4",
			"type": "Geometry",
			"data": {
				"vertices": [31.66571,244.9783,68.51491,28.78545,177.9528,85.79643,31.66571,177.9528,68.51491,28.65601,177.9528,86.57312,28.65601,248.4576,86.57312,28.65601,248.4576,86.57312,31.66571,244.9783,68.51491,28.65601,177.9528,86.57312,28.78545,177.9528,85.79643,31.66571,177.9528,68.51491],
				"normals": [0.9863939,-9.800828e-17,0.164399,-0.9863939,9.800828e-17,-0.164399],
				"faces": [32,0,1,2,0,0,0,32,1,0,3,0,0,0,32,3,0,4,0,0,0,32,5,6,7,1,1,1,32,7,6,8,1,1,1,32,9,8,6,1,1,1]
			}
		},
		{
			"uuid": "C19D0870-91FA-4C76-8676-9398E26C5640",
			"type": "Geometry",
			"data": {
				"vertices": [31.66571,109.5341,68.51491,28.65601,176.378,86.57312,28.65601,105.9429,86.57312,31.66571,176.378,68.51491,28.78545,176.378,85.79643,28.78545,176.378,85.79643,31.66571,176.378,68.51491,28.65601,176.378,86.57312,31.66571,109.5341,68.51491,28.65601,105.9429,86.57312],
				"normals": [0.9863939,-1.186874e-17,0.164399,-0.9863939,1.186874e-17,-0.164399],
				"faces": [32,0,1,2,0,0,0,32,1,0,3,0,0,0,32,1,3,4,0,0,0,32,5,6,7,1,1,1,32,6,8,7,1,1,1,32,9,7,8,1,1,1]
			}
		},
		{
			"uuid": "DB5B93A0-A1D7-4261-BE47-811B9B7A741B",
			"type": "Geometry",
			"data": {
				"vertices": [34.80486,113.2798,49.68001,31.9246,176.378,66.96153,31.9246,109.843,66.96153,34.93431,113.4342,48.90333,34.93431,176.378,48.90333,34.80486,176.378,49.68001,34.80486,176.378,49.68001,34.93431,176.378,48.90333,31.9246,176.378,66.96153,34.93431,113.4342,48.90333,34.80486,113.2798,49.68001,31.9246,109.843,66.96153],
				"normals": [0.9863939,-2.244037e-17,0.164399,-0.9863939,2.244037e-17,-0.164399],
				"faces": [32,0,1,2,0,0,0,32,1,0,3,0,0,0,32,1,3,4,0,0,0,32,1,4,5,0,0,0,32,6,7,8,1,1,1,32,7,9,8,1,1,1,32,9,10,8,1,1,1,32,11,8,10,1,1,1]
			}
		},
		{
			"uuid": "AF2FC7DB-D33C-4A7D-8E14-7A5BA447F78A",
			"type": "Geometry",
			"data": {
				"vertices": [34.93431,241.1996,48.90333,34.80486,177.9528,49.68001,34.93431,177.9528,48.90333,31.9246,177.9528,66.96153,31.9246,244.679,66.96153,31.9246,244.679,66.96153,34.93431,241.1996,48.90333,31.9246,177.9528,66.96153,34.80486,177.9528,49.68001,34.93431,177.9528,48.90333],
				"normals": [0.9863939,7.09805e-17,0.164399,-0.9863939,-7.09805e-17,-0.164399],
				"faces": [32,0,1,2,0,0,0,32,1,0,3,0,0,0,32,3,0,4,0,0,0,32,5,6,7,1,1,1,32,7,6,8,1,1,1,32,9,8,6,1,1,1]
			}
		},
		{
			"uuid": "F9BC7E07-D478-47DD-9B56-8A04072B6250",
			"type": "Geometry",
			"data": {
				"vertices": [121.825,334.6457,177.1654,23.39982,19.68504,118.1102,23.39982,334.6457,118.1102,121.825,19.68504,177.1654,220.2502,334.6457,118.1102,121.825,19.68504,177.1654,121.825,334.6457,177.1654,220.2502,19.68504,118.1102],
				"normals": [0.5144958,0,-0.8574929,-0.5144958,7.597793e-18,-0.8574929],
				"faces": [32,0,1,2,0,0,0,32,1,0,3,0,0,0,32,4,5,6,1,1,1,32,5,4,7,1,1,1]
			}
		},
		{
			"uuid": "6988D548-FF22-475D-98D1-67D1234EA548",
			"type": "Geometry",
			"data": {
				"vertices": [200.5652,334.6457,3.552714e-15,43.08486,19.68504,3.552714e-15,43.08486,334.6457,3.552714e-15,92.67914,19.68504,2.43388e-15,121.825,19.68504,0,150.9709,19.68504,8.537356e-16,200.5652,19.68504,1.421085e-14],
				"normals": [2.993202e-17,-2.087636e-18,-1],
				"faces": [32,0,1,2,0,0,0,32,1,0,3,0,0,0,32,3,0,4,0,0,0,32,4,0,5,0,0,0,32,5,0,6,0,0,0]
			}
		},
		{
			"uuid": "2BC460DD-211F-4965-9E9E-F56FC3FF1BB6",
			"type": "Geometry",
			"data": {
				"vertices": [6.520038,354.3307,107.9824,23.39982,334.6457,118.1102,6.520038,0,107.9824,121.825,354.3307,177.1654,121.825,334.6457,177.1654,23.39982,19.68504,118.1102,121.825,0,177.1654,121.825,19.68504,177.1654,237.13,354.3307,107.9824,121.825,334.6457,177.1654,121.825,354.3307,177.1654,220.2502,334.6457,118.1102,220.2502,19.68504,118.1102,121.825,0,177.1654,121.825,19.68504,177.1654,237.13,0,107.9824,237.13,310.7319,107.9824],
				"normals": [0.5144958,2.045399e-18,-0.8574929,-0.5144958,-7.754933e-18,-0.8574929],
				"faces": [32,0,1,2,0,0,0,32,1,0,3,0,0,0,32,1,3,4,0,0,0,32,2,5,6,0,0,0,32,5,2,1,0,0,0,32,6,5,7,0,0,0,32,8,9,10,1,1,1,32,9,8,11,1,1,1,32,11,8,12,1,1,1,32,12,13,14,1,1,1,32,13,12,15,1,1,1,32,15,12,8,1,1,1,32,15,8,16,1,1,1]
			}
		},
		{
			"uuid": "88D4591D-B135-4D50-AD6B-9425AA63DE40",
			"type": "Geometry",
			"data": {
				"vertices": [214.7807,175.0231,85.29311,211.771,107.9976,67.2349,214.7807,104.5183,85.29311,211.771,175.0231,67.2349,214.6512,175.0231,84.51642,214.6512,175.0231,84.51642,214.7807,175.0231,85.29311,211.771,175.0231,67.2349,211.771,107.9976,67.2349,214.7807,104.5183,85.29311],
				"normals": [-0.9863939,9.109648e-17,0.164399,0.9863939,-9.109648e-17,-0.164399],
				"faces": [32,0,1,2,0,0,0,32,1,0,3,0,0,0,32,3,0,4,0,0,0,32,5,6,7,1,1,1,32,7,6,8,1,1,1,32,9,8,6,1,1,1]
			}
		},
		{
			"uuid": "06C6CA53-3DC2-48A1-9218-FB9A07BE4896",
			"type": "Geometry",
			"data": {
				"vertices": [215.8593,253.71,91.76467,214.7807,104.5183,85.29311,215.8593,97.91111,91.76467,214.7807,175.0231,85.29311,214.7807,176.5979,85.29311,214.6512,175.0231,84.51642,211.771,175.0231,67.2349,211.5121,175.0231,65.68153,208.6318,176.5979,48.4,214.7807,247.033,85.29311,207.0921,107.1324,39.16141,211.771,107.9976,67.2349,211.5121,108.2969,65.68153,208.5024,111.7762,47.62332,207.0921,244.4887,39.16141,208.5024,175.0231,47.62332,208.5024,176.5979,47.62332,208.5024,239.5416,47.62332,208.6318,239.6961,48.4,211.5121,243.1329,65.68153,211.771,243.4418,67.2349,211.5121,176.5979,65.68153,214.6512,176.5979,84.51642,211.771,176.5979,67.2349,208.6318,175.0231,48.4,211.5121,175.0231,65.68153,211.771,175.0231,67.2349,211.5121,108.2969,65.68153,211.771,107.9976,67.2349,208.6318,176.5979,48.4,208.5024,176.5979,47.62332,208.5024,175.0231,47.62332,208.6318,175.0231,48.4,211.5121,243.1329,65.68153,211.771,243.4418,67.2349,211.5121,176.5979,65.68153,211.771,176.5979,67.2349,214.6512,176.5979,84.51642,214.7807,176.5979,85.29311,215.8593,253.71,91.76467,214.7807,247.033,85.29311,207.0921,244.4887,39.16141,208.6318,239.6961,48.4,208.5024,239.5416,47.62332,208.5024,111.7762,47.62332,207.0921,107.1324,39.16141,214.7807,104.5183,85.29311,215.8593,97.91111,91.76467,214.6512,175.0231,84.51642,214.7807,175.0231,85.29311],
				"normals": [-0.9863939,1.126424e-17,0.164399,0.9863939,-1.126424e-17,-0.164399],
				"faces": [32,0,1,2,0,0,0,32,1,0,3,0,0,0,32,3,0,4,0,0,0,32,3,4,5,0,0,0,32,5,4,6,0,0,0,32,6,4,7,0,0,0,32,7,4,8,0,0,0,32,4,0,9,0,0,0,32,1,10,2,0,0,0,32,10,1,11,0,0,0,32,10,11,12,0,0,0,32,10,12,13,0,0,0,32,10,13,14,0,0,0,32,14,13,15,0,0,0,32,14,15,16,0,0,0,32,14,16,17,0,0,0,32,14,17,18,0,0,0,32,14,18,19,0,0,0,32,14,19,20,0,0,0,32,14,20,9,0,0,0,32,14,9,0,0,0,0,32,4,21,8,0,0,0,32,21,4,22,0,0,0,32,21,22,23,0,0,0,32,21,23,20,0,0,0,32,21,20,19,0,0,0,32,7,15,24,0,0,0,32,15,7,16,0,0,0,32,16,7,8,0,0,0,32,6,12,11,0,0,0,32,12,6,7,0,0,0,32,25,26,27,1,1,1,32,28,27,26,1,1,1,32,29,25,30,1,1,1,32,30,25,31,1,1,1,32,32,31,25,1,1,1,32,33,34,35,1,1,1,32,34,36,35,1,1,1,32,36,37,35,1,1,1,32,37,38,35,1,1,1,32,29,35,38,1,1,1,32,39,40,41,1,1,1,32,40,34,41,1,1,1,32,34,33,41,1,1,1,32,33,42,41,1,1,1,32,42,43,41,1,1,1,32,43,30,41,1,1,1,32,30,31,41,1,1,1,32,31,44,41,1,1,1,32,41,44,45,1,1,1,32,44,27,45,1,1,1,32,27,28,45,1,1,1,32,28,46,45,1,1,1,32,47,45,46,1,1,1,32,40,39,38,1,1,1,32,29,38,25,1,1,1,32,25,38,26,1,1,1,32,26,38,48,1,1,1,32,48,38,49,1,1,1,32,38,39,49,1,1,1,32,49,39,46,1,1,1,32,47,46,39,1,1,1]
			}
		},
		{
			"uuid": "3BDB0F7B-02A1-49DF-BD77-7EF615B8DF37",
			"type": "Geometry",
			"data": {
				"vertices": [28.65601,176.378,86.57312,28.65601,177.9528,86.57312],
				"normals": [],
				"faces": []
			}
		},
		{
			"uuid": "B5258137-C66D-413F-9AB4-084864257110",
			"type": "Geometry",
			"data": {
				"vertices": [34.93431,176.378,48.90333,34.93431,177.9528,48.90333],
				"normals": [],
				"faces": []
			}
		},
		{
			"uuid": "2483DA39-3F07-45A3-AC8C-4ACEFCAE72BE",
			"type": "Geometry",
			"data": {
				"vertices": [31.9246,109.843,66.96153,31.66571,109.5341,68.51491],
				"normals": [],
				"faces": []
			}
		},
		{
			"uuid": "7EE38747-BD3A-4A7B-97B1-9F29F189DEA5",
			"type": "Geometry",
			"data": {
				"vertices": [31.9246,244.679,66.96153,31.66571,244.9783,68.51491],
				"normals": [],
				"faces": []
			}
		}],
	"materials": [
		{
			"uuid": "318F67F1-FDAD-43E7-B821-C9D63E92CEE1",
			"type": "MeshLambertMaterial",
			"name": "_0020_Red",
			"color": 16711680,
			"emissive": 0
		},
		{
			"uuid": "690F6E19-D49A-4BF3-8D42-117D681C6107",
			"type": "MeshLambertMaterial",
			"name": "Color_A01",
			"color": 16711680,
			"emissive": 0
		},
		{
			"uuid": "3D749EBC-CEB0-4A5F-9CAB-8EEB2424EA41",
			"type": "MultiMaterial",
			"materials": [
				{
					"metadata": {
						"version": 4.4,
						"type": "Material",
						"generator": "Material.toJSON"
					},
					"uuid": "6C278F55-3547-4220-9805-3A042DBE01A1",
					"type": "MeshLambertMaterial",
					"name": "material",
					"color": 16777215,
					"emissive": 0
				},
				{
					"metadata": {
						"version": 4.4,
						"type": "Material",
						"generator": "Material.toJSON"
					},
					"uuid": "7F977947-307B-473F-A0E5-268DDAD3A382",
					"type": "MeshLambertMaterial",
					"name": "_0100_SteelBlue",
					"color": 4555188,
					"emissive": 0
				}],
			"visible": true
		},
		{
			"uuid": "CD298A2B-9E94-4E32-A40B-7CDB032C22E5",
			"type": "MultiMaterial",
			"materials": [
				{
					"metadata": {
						"version": 4.4,
						"type": "Material",
						"generator": "Material.toJSON"
					},
					"uuid": "6C278F55-3547-4220-9805-3A042DBE01A1",
					"type": "MeshLambertMaterial",
					"name": "material",
					"color": 16777215,
					"emissive": 0
				},
				{
					"metadata": {
						"version": 4.4,
						"type": "Material",
						"generator": "Material.toJSON"
					},
					"uuid": "AD6A0513-FD70-400E-A008-4E3A8A056406",
					"type": "MeshLambertMaterial",
					"name": "Color_H10",
					"color": 10734796,
					"emissive": 0
				}],
			"visible": true
		},
		{
			"uuid": "3309C702-0DF6-4529-8D53-2D0C6728C653",
			"type": "MultiMaterial",
			"materials": [
				{
					"metadata": {
						"version": 4.4,
						"type": "Material",
						"generator": "Material.toJSON"
					},
					"uuid": "6C278F55-3547-4220-9805-3A042DBE01A1",
					"type": "MeshLambertMaterial",
					"name": "material",
					"color": 16777215,
					"emissive": 0
				},
				{
					"metadata": {
						"version": 4.4,
						"type": "Material",
						"generator": "Material.toJSON"
					},
					"uuid": "7513DE88-DF66-42B3-8189-00068A55354E",
					"type": "MeshLambertMaterial",
					"name": "_0091_MintCream",
					"color": 16056314,
					"emissive": 0
				}],
			"visible": true
		},
		{
			"uuid": "555D2B15-2E68-43D1-843B-990C30E33038",
			"type": "MultiMaterial",
			"materials": [
				{
					"metadata": {
						"version": 4.4,
						"type": "Material",
						"generator": "Material.toJSON"
					},
					"uuid": "6C278F55-3547-4220-9805-3A042DBE01A1",
					"type": "MeshLambertMaterial",
					"name": "material",
					"color": 16777215,
					"emissive": 0
				},
				{
					"metadata": {
						"version": 4.4,
						"type": "Material",
						"generator": "Material.toJSON"
					},
					"uuid": "7513DE88-DF66-42B3-8189-00068A55354E",
					"type": "MeshLambertMaterial",
					"name": "_0091_MintCream",
					"color": 16056314,
					"emissive": 0
				}],
			"visible": true
		},
		{
			"uuid": "54115965-C8C1-40D9-A49B-5A6E1A37D410",
			"type": "MultiMaterial",
			"materials": [
				{
					"metadata": {
						"version": 4.4,
						"type": "Material",
						"generator": "Material.toJSON"
					},
					"uuid": "6C278F55-3547-4220-9805-3A042DBE01A1",
					"type": "MeshLambertMaterial",
					"name": "material",
					"color": 16777215,
					"emissive": 0
				},
				{
					"metadata": {
						"version": 4.4,
						"type": "Material",
						"generator": "Material.toJSON"
					},
					"uuid": "7513DE88-DF66-42B3-8189-00068A55354E",
					"type": "MeshLambertMaterial",
					"name": "_0091_MintCream",
					"color": 16056314,
					"emissive": 0
				}],
			"visible": true
		},
		{
			"uuid": "516E9B6C-38D8-4725-B2BF-74CA6CE8C771",
			"type": "MultiMaterial",
			"materials": [
				{
					"metadata": {
						"version": 4.4,
						"type": "Material",
						"generator": "Material.toJSON"
					},
					"uuid": "6C278F55-3547-4220-9805-3A042DBE01A1",
					"type": "MeshLambertMaterial",
					"name": "material",
					"color": 16777215,
					"emissive": 0
				},
				{
					"metadata": {
						"version": 4.4,
						"type": "Material",
						"generator": "Material.toJSON"
					},
					"uuid": "7513DE88-DF66-42B3-8189-00068A55354E",
					"type": "MeshLambertMaterial",
					"name": "_0091_MintCream",
					"color": 16056314,
					"emissive": 0
				}],
			"visible": true
		},
		{
			"uuid": "295EC963-A163-46EB-AAB2-3F19E7C8AB31",
			"type": "MultiMaterial",
			"materials": [
				{
					"metadata": {
						"version": 4.4,
						"type": "Material",
						"generator": "Material.toJSON"
					},
					"uuid": "6C278F55-3547-4220-9805-3A042DBE01A1",
					"type": "MeshLambertMaterial",
					"name": "material",
					"color": 16777215,
					"emissive": 0
				},
				{
					"metadata": {
						"version": 4.4,
						"type": "Material",
						"generator": "Material.toJSON"
					},
					"uuid": "2B361109-F0F2-47B0-B03B-8DAA11E517F1",
					"type": "MeshLambertMaterial",
					"name": "Color_I18",
					"color": 2565990,
					"emissive": 0
				}],
			"visible": true
		},
		{
			"uuid": "32888E30-611F-4ACA-B564-33C242E086B3",
			"type": "MultiMaterial",
			"materials": [
				{
					"metadata": {
						"version": 4.4,
						"type": "Material",
						"generator": "Material.toJSON"
					},
					"uuid": "6C278F55-3547-4220-9805-3A042DBE01A1",
					"type": "MeshLambertMaterial",
					"name": "material",
					"color": 16777215,
					"emissive": 0
				},
				{
					"metadata": {
						"version": 4.4,
						"type": "Material",
						"generator": "Material.toJSON"
					},
					"uuid": "7513DE88-DF66-42B3-8189-00068A55354E",
					"type": "MeshLambertMaterial",
					"name": "_0091_MintCream",
					"color": 16056314,
					"emissive": 0
				}],
			"visible": true
		},
		{
			"uuid": "086369D9-B78C-40D8-8132-F1E4F8B54011",
			"type": "MultiMaterial",
			"materials": [
				{
					"metadata": {
						"version": 4.4,
						"type": "Material",
						"generator": "Material.toJSON"
					},
					"uuid": "6C278F55-3547-4220-9805-3A042DBE01A1",
					"type": "MeshLambertMaterial",
					"name": "material",
					"color": 16777215,
					"emissive": 0
				},
				{
					"metadata": {
						"version": 4.4,
						"type": "Material",
						"generator": "Material.toJSON"
					},
					"uuid": "7513DE88-DF66-42B3-8189-00068A55354E",
					"type": "MeshLambertMaterial",
					"name": "_0091_MintCream",
					"color": 16056314,
					"emissive": 0
				}],
			"visible": true
		},
		{
			"uuid": "FF05EF2D-FCA8-4E5F-97A5-A12879BC5486",
			"type": "MultiMaterial",
			"materials": [
				{
					"metadata": {
						"version": 4.4,
						"type": "Material",
						"generator": "Material.toJSON"
					},
					"uuid": "6C278F55-3547-4220-9805-3A042DBE01A1",
					"type": "MeshLambertMaterial",
					"name": "material",
					"color": 16777215,
					"emissive": 0
				},
				{
					"metadata": {
						"version": 4.4,
						"type": "Material",
						"generator": "Material.toJSON"
					},
					"uuid": "7513DE88-DF66-42B3-8189-00068A55354E",
					"type": "MeshLambertMaterial",
					"name": "_0091_MintCream",
					"color": 16056314,
					"emissive": 0
				}],
			"visible": true
		},
		{
			"uuid": "1434D554-54F5-456F-B032-C4430F72FE35",
			"type": "MultiMaterial",
			"materials": [
				{
					"metadata": {
						"version": 4.4,
						"type": "Material",
						"generator": "Material.toJSON"
					},
					"uuid": "6C278F55-3547-4220-9805-3A042DBE01A1",
					"type": "MeshLambertMaterial",
					"name": "material",
					"color": 16777215,
					"emissive": 0
				},
				{
					"metadata": {
						"version": 4.4,
						"type": "Material",
						"generator": "Material.toJSON"
					},
					"uuid": "2B361109-F0F2-47B0-B03B-8DAA11E517F1",
					"type": "MeshLambertMaterial",
					"name": "Color_I18",
					"color": 2565990,
					"emissive": 0
				}],
			"visible": true
		},
		{
			"uuid": "3D4D9A53-EDF5-4704-9975-F55B76449FC9",
			"type": "MultiMaterial",
			"materials": [
				{
					"metadata": {
						"version": 4.4,
						"type": "Material",
						"generator": "Material.toJSON"
					},
					"uuid": "6C278F55-3547-4220-9805-3A042DBE01A1",
					"type": "MeshLambertMaterial",
					"name": "material",
					"color": 16777215,
					"emissive": 0
				},
				{
					"metadata": {
						"version": 4.4,
						"type": "Material",
						"generator": "Material.toJSON"
					},
					"uuid": "7513DE88-DF66-42B3-8189-00068A55354E",
					"type": "MeshLambertMaterial",
					"name": "_0091_MintCream",
					"color": 16056314,
					"emissive": 0
				}],
			"visible": true
		},
		{
			"uuid": "9762E380-4FCF-42F6-AAA5-7C6283EE87F3",
			"type": "MultiMaterial",
			"materials": [
				{
					"metadata": {
						"version": 4.4,
						"type": "Material",
						"generator": "Material.toJSON"
					},
					"uuid": "6C278F55-3547-4220-9805-3A042DBE01A1",
					"type": "MeshLambertMaterial",
					"name": "material",
					"color": 16777215,
					"emissive": 0
				},
				{
					"metadata": {
						"version": 4.4,
						"type": "Material",
						"generator": "Material.toJSON"
					},
					"uuid": "7513DE88-DF66-42B3-8189-00068A55354E",
					"type": "MeshLambertMaterial",
					"name": "_0091_MintCream",
					"color": 16056314,
					"emissive": 0
				}],
			"visible": true
		},
		{
			"uuid": "87D5A0D2-7848-416B-895A-BE0A374D2ABB",
			"type": "MultiMaterial",
			"materials": [
				{
					"metadata": {
						"version": 4.4,
						"type": "Material",
						"generator": "Material.toJSON"
					},
					"uuid": "6C278F55-3547-4220-9805-3A042DBE01A1",
					"type": "MeshLambertMaterial",
					"name": "material",
					"color": 16777215,
					"emissive": 0
				},
				{
					"metadata": {
						"version": 4.4,
						"type": "Material",
						"generator": "Material.toJSON"
					},
					"uuid": "7513DE88-DF66-42B3-8189-00068A55354E",
					"type": "MeshLambertMaterial",
					"name": "_0091_MintCream",
					"color": 16056314,
					"emissive": 0
				}],
			"visible": true
		},
		{
			"uuid": "49ACC549-1E78-4789-BE86-DCE959306F79",
			"type": "MultiMaterial",
			"materials": [
				{
					"metadata": {
						"version": 4.4,
						"type": "Material",
						"generator": "Material.toJSON"
					},
					"uuid": "6C278F55-3547-4220-9805-3A042DBE01A1",
					"type": "MeshLambertMaterial",
					"name": "material",
					"color": 16777215,
					"emissive": 0
				},
				{
					"metadata": {
						"version": 4.4,
						"type": "Material",
						"generator": "Material.toJSON"
					},
					"uuid": "7513DE88-DF66-42B3-8189-00068A55354E",
					"type": "MeshLambertMaterial",
					"name": "_0091_MintCream",
					"color": 16056314,
					"emissive": 0
				}],
			"visible": true
		},
		{
			"uuid": "6C278F55-3547-4220-9805-3A042DBE01A1",
			"type": "MeshLambertMaterial",
			"name": "material",
			"color": 16777215,
			"emissive": 0
		},
		{
			"uuid": "7F977947-307B-473F-A0E5-268DDAD3A382",
			"type": "MeshLambertMaterial",
			"name": "_0100_SteelBlue",
			"color": 4555188,
			"emissive": 0
		},
		{
			"uuid": "204B8223-941B-444D-8B61-7DC96EED3D0B",
			"type": "MultiMaterial",
			"materials": [
				{
					"metadata": {
						"version": 4.4,
						"type": "Material",
						"generator": "Material.toJSON"
					},
					"uuid": "6C278F55-3547-4220-9805-3A042DBE01A1",
					"type": "MeshLambertMaterial",
					"name": "material",
					"color": 16777215,
					"emissive": 0
				},
				{
					"metadata": {
						"version": 4.4,
						"type": "Material",
						"generator": "Material.toJSON"
					},
					"uuid": "7513DE88-DF66-42B3-8189-00068A55354E",
					"type": "MeshLambertMaterial",
					"name": "_0091_MintCream",
					"color": 16056314,
					"emissive": 0
				}],
			"visible": true
		},
		{
			"uuid": "0F51992F-8AF8-44B2-8647-C387AC3F48CF",
			"type": "MultiMaterial",
			"materials": [
				{
					"metadata": {
						"version": 4.4,
						"type": "Material",
						"generator": "Material.toJSON"
					},
					"uuid": "6C278F55-3547-4220-9805-3A042DBE01A1",
					"type": "MeshLambertMaterial",
					"name": "material",
					"color": 16777215,
					"emissive": 0
				},
				{
					"metadata": {
						"version": 4.4,
						"type": "Material",
						"generator": "Material.toJSON"
					},
					"uuid": "2B361109-F0F2-47B0-B03B-8DAA11E517F1",
					"type": "MeshLambertMaterial",
					"name": "Color_I18",
					"color": 2565990,
					"emissive": 0
				}],
			"visible": true
		},
		{
			"uuid": "C160A450-0FD4-4AA6-B7BF-9F10112C5C55",
			"type": "MeshBasicMaterial",
			"name": "edge_color000255",
			"color": 16777215
		}]
}