<?xml version="1.0" encoding="UTF-8" standalone="no"?>
<!-- Created with Inkscape (http://www.inkscape.org/) -->

<svg
   xmlns:dc="http://purl.org/dc/elements/1.1/"
   xmlns:cc="http://creativecommons.org/ns#"
   xmlns:rdf="http://www.w3.org/1999/02/22-rdf-syntax-ns#"
   xmlns:svg="http://www.w3.org/2000/svg"
   xmlns="http://www.w3.org/2000/svg"
   xmlns:sodipodi="http://sodipodi.sourceforge.net/DTD/sodipodi-0.dtd"
   xmlns:inkscape="http://www.inkscape.org/namespaces/inkscape"
   width="1024"
   height="468"
   id="svg2"
   version="1.1"
   inkscape:version="0.48.5 r10040"
   sodipodi:docname="pantalla1.svg"
   inkscape:export-filename="D:\aldo\tesis\bienvenida.png"
   inkscape:export-xdpi="90"
   inkscape:export-ydpi="90">
  <defs
     id="defs4" />
  <sodipodi:namedview
     id="base"
     pagecolor="#ffffff"
     bordercolor="#666666"
     borderopacity="1.0"
     inkscape:pageopacity="0.0"
     inkscape:pageshadow="2"
     inkscape:zoom="1"
     inkscape:cx="457.38739"
     inkscape:cy="269.79927"
     inkscape:document-units="px"
     inkscape:current-layer="layer1"
     showgrid="false"
     width="1052.36px"
     inkscape:window-width="1920"
     inkscape:window-height="1018"
     inkscape:window-x="-8"
     inkscape:window-y="-8"
     inkscape:window-maximized="1" />
  <metadata
     id="metadata7">
    <rdf:RDF>
      <cc:Work
         rdf:about="">
        <dc:format>image/svg+xml</dc:format>
        <dc:type
           rdf:resource="http://purl.org/dc/dcmitype/StillImage" />
        <dc:title></dc:title>
      </cc:Work>
    </rdf:RDF>
  </metadata>
  <g
     inkscape:label="Layer 1"
     inkscape:groupmode="layer"
     id="layer1"
     transform="translate(0,-584.36218)">
    <rect
       style="fill:#0b5260;fill-rule:evenodd;stroke:none;stroke-width:1px;stroke-linecap:butt;stroke-linejoin:miter;stroke-opacity:1;fill-opacity:1"
       id="rect2985"
       width="1028.5714"
       height="469.28571"
       x="-1.4285715"
       y="0.85714239"
       transform="translate(0,584.36218)" />
    <rect
       style="fill:#0a928a;fill-opacity:1;stroke:none"
       id="rect3803"
       width="3.5355363"
       height="445"
       x="9.428091"
       y="596.75555" />
    <g
       id="g3831"
       transform="matrix(0.54954313,0,0,1.7600357,5.5637472,-591.57446)"
       style="fill:#0a928a;fill-opacity:1">
      <rect
         style="fill:#0a928a;fill-opacity:1;stroke:none"
         id="rect3827"
         width="30.833334"
         height="31.741747"
         x="9.6042719"
         y="781.98383"
         ry="9.8700323" />
      <rect
         style="fill:#0a928a;fill-opacity:1;stroke:none"
         id="rect3829"
         width="17.869709"
         height="31.741747"
         x="10.363267"
         y="781.98364"
         ry="0" />
    </g>
    <path
       sodipodi:type="star"
       style="fill:#ffcc00;fill-opacity:1;stroke:none"
       id="path3835"
       sodipodi:sides="3"
       sodipodi:cx="-85.559921"
       sodipodi:cy="110.20397"
       sodipodi:r1="32.626675"
       sodipodi:r2="16.313337"
       sodipodi:arg1="2.0926306"
       sodipodi:arg2="3.1398282"
       inkscape:flatsided="true"
       inkscape:rounded="0.09"
       inkscape:randomized="0"
       d="m -101.82338,138.48824 c -4.40908,-2.53522 -4.49982,-53.960203 -0.0997,-56.510968 4.400107,-2.550766 48.980818,23.083138 48.989793,28.169128 0.009,5.08599 -44.480998,30.87706 -48.890083,28.34184 z"
       transform="matrix(0.22851878,0,0,0.40311499,38.358916,767.29462)"
       inkscape:transform-center-x="-1.4864559"
       inkscape:transform-center-y="0.010980251" />
  </g>
</svg>
