%
M48
M72
T01C0.01969
T02C0.02362
T03C0.03543
T04C0.04000
T05C0.05118
T06C0.08661
%
T01
X130350Y211600
X134725Y211600
X139100Y211600
X155975Y215975
X160975Y215975
X223475Y217850
X237225Y210350
X227850Y202850
X234100Y193475
X238475Y193475
X243475Y191600
X267225Y191600
X276600Y185350
X280975Y185350
X279725Y198475
X279725Y202850
X279725Y207225
X269725Y222225
X249100Y222225
X229725Y235350
X225350Y235350
X134100Y169725
X135975Y165975
X140350Y165975
X131600Y165975
X129725Y169725
X167850Y155350
X169100Y150975
X197225Y143475
X197225Y139725
X209400Y135975
X213475Y143850
X199975Y151850
X210975Y156600
X214100Y157225
X218150Y167850
X230975Y155350
X230975Y150350
X241600Y162225
X245975Y162225
X250350Y162225
X215975Y129100
X231600Y128475
X230350Y106600
X218475Y107850
X214100Y107850
X206475Y100350
X214600Y95975
X194725Y90975
X194725Y85975
X187475Y81850
X179600Y81850
X187475Y74850
X181475Y69850
X201600Y74725
X206600Y74725
X211600Y74725
X200475Y80850
X236600Y83475
X242225Y83475
X253475Y80350
X257225Y80350
X197225Y122225
X197225Y126600
X161225Y80475
X156850Y80475
X137350Y78850
X137225Y57850
T02
X211275Y102850
X206900Y153475
X214400Y182850
X243475Y232850
X248475Y227850
X131275Y189725
T03
X194514Y215750
X211836Y215750
T04
X264725Y229100
X274725Y229100
X258525Y157750
X258525Y147750
X258525Y137750
X258525Y127750
X258525Y117750
X258525Y107750
X258525Y97750
X258525Y87750
X158475Y87650
X158475Y97650
X158475Y107650
X158475Y117650
X158475Y127650
X158475Y137650
X158475Y147650
X158475Y157650
T05
X148558Y222752
X168558Y222752
T06
X124500Y225650
X292625Y225650
X292625Y68150
X124500Y68150
M30
