<?xml version="1.0" encoding="utf-8"?>
<!DOCTYPE eagle SYSTEM "eagle.dtd">
<eagle version="7.2.0">
<drawing>
<settings>
<setting alwaysvectorfont="yes"/>
<setting verticaltext="up"/>
</settings>
<grid distance="8" unitdist="mil" unit="mil" style="lines" multiple="1" display="yes" altdistance="6.25" altunitdist="mil" altunit="mil"/>
<layers>
<layer number="1" name="Top" color="4" fill="1" visible="yes" active="yes"/>
<layer number="16" name="Bottom" color="1" fill="1" visible="yes" active="yes"/>
<layer number="17" name="Pads" color="2" fill="1" visible="yes" active="yes"/>
<layer number="18" name="Vias" color="2" fill="1" visible="yes" active="yes"/>
<layer number="19" name="Unrouted" color="6" fill="1" visible="yes" active="yes"/>
<layer number="20" name="Dimension" color="15" fill="1" visible="yes" active="yes"/>
<layer number="21" name="tPlace" color="7" fill="1" visible="yes" active="yes"/>
<layer number="22" name="bPlace" color="7" fill="1" visible="yes" active="yes"/>
<layer number="23" name="tOrigins" color="15" fill="1" visible="yes" active="yes"/>
<layer number="24" name="bOrigins" color="15" fill="1" visible="yes" active="yes"/>
<layer number="25" name="tNames" color="7" fill="1" visible="yes" active="yes"/>
<layer number="26" name="bNames" color="7" fill="1" visible="no" active="yes"/>
<layer number="27" name="tValues" color="7" fill="1" visible="no" active="yes"/>
<layer number="28" name="bValues" color="7" fill="1" visible="no" active="yes"/>
<layer number="29" name="tStop" color="7" fill="3" visible="no" active="yes"/>
<layer number="30" name="bStop" color="7" fill="6" visible="no" active="yes"/>
<layer number="31" name="tCream" color="7" fill="4" visible="no" active="yes"/>
<layer number="32" name="bCream" color="7" fill="5" visible="no" active="yes"/>
<layer number="33" name="tFinish" color="6" fill="3" visible="no" active="yes"/>
<layer number="34" name="bFinish" color="6" fill="6" visible="no" active="yes"/>
<layer number="35" name="tGlue" color="7" fill="4" visible="no" active="yes"/>
<layer number="36" name="bGlue" color="7" fill="5" visible="no" active="yes"/>
<layer number="37" name="tTest" color="7" fill="1" visible="no" active="yes"/>
<layer number="38" name="bTest" color="7" fill="1" visible="no" active="yes"/>
<layer number="39" name="tKeepout" color="4" fill="11" visible="no" active="yes"/>
<layer number="40" name="bKeepout" color="1" fill="11" visible="no" active="yes"/>
<layer number="41" name="tRestrict" color="4" fill="10" visible="no" active="yes"/>
<layer number="42" name="bRestrict" color="1" fill="10" visible="no" active="yes"/>
<layer number="43" name="vRestrict" color="2" fill="10" visible="no" active="yes"/>
<layer number="44" name="Drills" color="7" fill="1" visible="no" active="yes"/>
<layer number="45" name="Holes" color="7" fill="1" visible="no" active="yes"/>
<layer number="46" name="Milling" color="3" fill="1" visible="no" active="yes"/>
<layer number="47" name="Measures" color="7" fill="1" visible="no" active="yes"/>
<layer number="48" name="Document" color="7" fill="1" visible="no" active="yes"/>
<layer number="49" name="Reference" color="7" fill="1" visible="no" active="yes"/>
<layer number="51" name="tDocu" color="7" fill="1" visible="no" active="yes"/>
<layer number="52" name="bDocu" color="7" fill="1" visible="no" active="yes"/>
<layer number="90" name="Modules" color="5" fill="1" visible="no" active="no"/>
<layer number="91" name="Nets" color="2" fill="1" visible="no" active="no"/>
<layer number="92" name="Busses" color="1" fill="1" visible="no" active="no"/>
<layer number="93" name="Pins" color="2" fill="1" visible="no" active="no"/>
<layer number="94" name="Symbols" color="4" fill="1" visible="no" active="no"/>
<layer number="95" name="Names" color="7" fill="1" visible="no" active="no"/>
<layer number="96" name="Values" color="7" fill="1" visible="no" active="no"/>
<layer number="97" name="Info" color="7" fill="1" visible="no" active="no"/>
<layer number="98" name="Guide" color="6" fill="1" visible="no" active="no"/>
</layers>
<board>
<plain>
<wire x1="0" y1="21.2625" x2="0" y2="2.54" width="0" layer="20"/>
<wire x1="0" y1="2.54" x2="2.54" y2="0" width="0" layer="20" curve="90"/>
<wire x1="2.54" y1="0" x2="11.4175" y2="0" width="0" layer="20"/>
<wire x1="11.4175" y1="0" x2="13.9575" y2="2.54" width="0" layer="20" curve="90"/>
<wire x1="13.9575" y1="2.54" x2="13.9575" y2="21.2625" width="0" layer="20"/>
<wire x1="13.9575" y1="21.2625" x2="11.4175" y2="23.8025" width="0" layer="20" curve="90"/>
<wire x1="11.4175" y1="23.8025" x2="2.54" y2="23.8025" width="0" layer="20"/>
<wire x1="2.54" y1="23.8025" x2="0" y2="21.2625" width="0" layer="20" curve="90"/>
<text x="2.06375" y="23.01875" size="0.6096" layer="25" ratio="19">tiny7</text>
<text x="10.63625" y="23.01875" size="0.6096" layer="25" ratio="19">al1</text>
<text x="8.5725" y="9.8425" size="1.016" layer="26" ratio="10" rot="MR0">tiny7</text>
<text x="0.4318" y="13.5128" size="0.8128" layer="26" ratio="10" rot="MR90">al1 July2015</text>
<text x="13.0175" y="5.3975" size="0.8128" layer="26" ratio="10" rot="MR90">https://hackaday.io/al1</text>
<text x="13.0175" y="2.2225" size="0.8128" layer="26" ratio="10" rot="MR0">1</text>
<text x="11.0442375" y="4.17195" size="0.6096" layer="25" rot="R90">https://hackaday.io/al1</text>
<rectangle x1="1.7272" y1="7.8232" x2="7.2136" y2="8.0264" layer="25"/>
<rectangle x1="1.7272" y1="8.0264" x2="1.9304" y2="8.2296" layer="25"/>
<rectangle x1="3.3528" y1="8.0264" x2="3.556" y2="8.2296" layer="25"/>
<rectangle x1="3.7592" y1="8.0264" x2="4.1656" y2="8.2296" layer="25"/>
<rectangle x1="4.7752" y1="8.0264" x2="4.9784" y2="8.2296" layer="25"/>
<rectangle x1="5.588" y1="8.0264" x2="5.7912" y2="8.2296" layer="25"/>
<rectangle x1="5.9944" y1="8.0264" x2="6.604" y2="8.2296" layer="25"/>
<rectangle x1="7.0104" y1="8.0264" x2="7.2136" y2="8.2296" layer="25"/>
<rectangle x1="1.7272" y1="8.2296" x2="1.9304" y2="8.4328" layer="25"/>
<rectangle x1="2.1336" y1="8.2296" x2="3.1496" y2="8.4328" layer="25"/>
<rectangle x1="3.3528" y1="8.2296" x2="3.556" y2="8.4328" layer="25"/>
<rectangle x1="3.7592" y1="8.2296" x2="4.1656" y2="8.4328" layer="25"/>
<rectangle x1="4.3688" y1="8.2296" x2="4.572" y2="8.4328" layer="25"/>
<rectangle x1="4.7752" y1="8.2296" x2="4.9784" y2="8.4328" layer="25"/>
<rectangle x1="5.3848" y1="8.2296" x2="5.588" y2="8.4328" layer="25"/>
<rectangle x1="5.7912" y1="8.2296" x2="6.1976" y2="8.4328" layer="25"/>
<rectangle x1="6.4008" y1="8.2296" x2="7.2136" y2="8.4328" layer="25"/>
<rectangle x1="1.7272" y1="8.4328" x2="1.9304" y2="8.636" layer="25"/>
<rectangle x1="2.1336" y1="8.4328" x2="2.3368" y2="8.636" layer="25"/>
<rectangle x1="2.9464" y1="8.4328" x2="3.1496" y2="8.636" layer="25"/>
<rectangle x1="3.3528" y1="8.4328" x2="3.7592" y2="8.636" layer="25"/>
<rectangle x1="4.1656" y1="8.4328" x2="4.3688" y2="8.636" layer="25"/>
<rectangle x1="4.572" y1="8.4328" x2="5.7912" y2="8.636" layer="25"/>
<rectangle x1="6.1976" y1="8.4328" x2="6.4008" y2="8.636" layer="25"/>
<rectangle x1="6.604" y1="8.4328" x2="6.8072" y2="8.636" layer="25"/>
<rectangle x1="7.0104" y1="8.4328" x2="7.2136" y2="8.636" layer="25"/>
<rectangle x1="1.7272" y1="8.636" x2="1.9304" y2="8.8392" layer="25"/>
<rectangle x1="2.1336" y1="8.636" x2="2.3368" y2="8.8392" layer="25"/>
<rectangle x1="2.9464" y1="8.636" x2="3.1496" y2="8.8392" layer="25"/>
<rectangle x1="3.3528" y1="8.636" x2="3.556" y2="8.8392" layer="25"/>
<rectangle x1="3.9624" y1="8.636" x2="4.3688" y2="8.8392" layer="25"/>
<rectangle x1="4.572" y1="8.636" x2="5.7912" y2="8.8392" layer="25"/>
<rectangle x1="7.0104" y1="8.636" x2="7.2136" y2="8.8392" layer="25"/>
<rectangle x1="1.7272" y1="8.8392" x2="1.9304" y2="9.0424" layer="25"/>
<rectangle x1="2.1336" y1="8.8392" x2="2.3368" y2="9.0424" layer="25"/>
<rectangle x1="2.9464" y1="8.8392" x2="3.1496" y2="9.0424" layer="25"/>
<rectangle x1="3.3528" y1="8.8392" x2="3.7592" y2="9.0424" layer="25"/>
<rectangle x1="3.9624" y1="8.8392" x2="4.1656" y2="9.0424" layer="25"/>
<rectangle x1="4.9784" y1="8.8392" x2="5.1816" y2="9.0424" layer="25"/>
<rectangle x1="6.4008" y1="8.8392" x2="6.604" y2="9.0424" layer="25"/>
<rectangle x1="7.0104" y1="8.8392" x2="7.2136" y2="9.0424" layer="25"/>
<rectangle x1="1.7272" y1="9.0424" x2="1.9304" y2="9.2456" layer="25"/>
<rectangle x1="2.1336" y1="9.0424" x2="3.1496" y2="9.2456" layer="25"/>
<rectangle x1="3.3528" y1="9.0424" x2="3.7592" y2="9.2456" layer="25"/>
<rectangle x1="4.572" y1="9.0424" x2="5.1816" y2="9.2456" layer="25"/>
<rectangle x1="5.3848" y1="9.0424" x2="5.9944" y2="9.2456" layer="25"/>
<rectangle x1="6.8072" y1="9.0424" x2="7.2136" y2="9.2456" layer="25"/>
<rectangle x1="1.7272" y1="9.2456" x2="1.9304" y2="9.4488" layer="25"/>
<rectangle x1="3.3528" y1="9.2456" x2="3.556" y2="9.4488" layer="25"/>
<rectangle x1="3.9624" y1="9.2456" x2="4.572" y2="9.4488" layer="25"/>
<rectangle x1="5.3848" y1="9.2456" x2="5.588" y2="9.4488" layer="25"/>
<rectangle x1="5.7912" y1="9.2456" x2="5.9944" y2="9.4488" layer="25"/>
<rectangle x1="6.4008" y1="9.2456" x2="6.604" y2="9.4488" layer="25"/>
<rectangle x1="7.0104" y1="9.2456" x2="7.2136" y2="9.4488" layer="25"/>
<rectangle x1="1.7272" y1="9.4488" x2="3.556" y2="9.652" layer="25"/>
<rectangle x1="3.9624" y1="9.4488" x2="4.1656" y2="9.652" layer="25"/>
<rectangle x1="4.7752" y1="9.4488" x2="4.9784" y2="9.652" layer="25"/>
<rectangle x1="5.3848" y1="9.4488" x2="5.9944" y2="9.652" layer="25"/>
<rectangle x1="6.4008" y1="9.4488" x2="6.8072" y2="9.652" layer="25"/>
<rectangle x1="7.0104" y1="9.4488" x2="7.2136" y2="9.652" layer="25"/>
<rectangle x1="1.7272" y1="9.652" x2="1.9304" y2="9.8552" layer="25"/>
<rectangle x1="2.54" y1="9.652" x2="2.7432" y2="9.8552" layer="25"/>
<rectangle x1="2.9464" y1="9.652" x2="3.1496" y2="9.8552" layer="25"/>
<rectangle x1="3.3528" y1="9.652" x2="3.7592" y2="9.8552" layer="25"/>
<rectangle x1="4.1656" y1="9.652" x2="4.3688" y2="9.8552" layer="25"/>
<rectangle x1="4.572" y1="9.652" x2="5.1816" y2="9.8552" layer="25"/>
<rectangle x1="6.604" y1="9.652" x2="7.2136" y2="9.8552" layer="25"/>
<rectangle x1="1.7272" y1="9.8552" x2="2.1336" y2="10.0584" layer="25"/>
<rectangle x1="2.54" y1="9.8552" x2="2.9464" y2="10.0584" layer="25"/>
<rectangle x1="3.1496" y1="9.8552" x2="3.7592" y2="10.0584" layer="25"/>
<rectangle x1="4.1656" y1="9.8552" x2="4.572" y2="10.0584" layer="25"/>
<rectangle x1="4.7752" y1="9.8552" x2="4.9784" y2="10.0584" layer="25"/>
<rectangle x1="5.3848" y1="9.8552" x2="5.588" y2="10.0584" layer="25"/>
<rectangle x1="5.7912" y1="9.8552" x2="5.9944" y2="10.0584" layer="25"/>
<rectangle x1="6.1976" y1="9.8552" x2="6.604" y2="10.0584" layer="25"/>
<rectangle x1="6.8072" y1="9.8552" x2="7.2136" y2="10.0584" layer="25"/>
<rectangle x1="1.7272" y1="10.0584" x2="1.9304" y2="10.2616" layer="25"/>
<rectangle x1="2.1336" y1="10.0584" x2="2.7432" y2="10.2616" layer="25"/>
<rectangle x1="3.3528" y1="10.0584" x2="3.7592" y2="10.2616" layer="25"/>
<rectangle x1="3.9624" y1="10.0584" x2="4.1656" y2="10.2616" layer="25"/>
<rectangle x1="4.3688" y1="10.0584" x2="5.1816" y2="10.2616" layer="25"/>
<rectangle x1="6.1976" y1="10.0584" x2="6.4008" y2="10.2616" layer="25"/>
<rectangle x1="6.604" y1="10.0584" x2="6.8072" y2="10.2616" layer="25"/>
<rectangle x1="7.0104" y1="10.0584" x2="7.2136" y2="10.2616" layer="25"/>
<rectangle x1="1.7272" y1="10.2616" x2="2.1336" y2="10.4648" layer="25"/>
<rectangle x1="2.7432" y1="10.2616" x2="2.9464" y2="10.4648" layer="25"/>
<rectangle x1="3.1496" y1="10.2616" x2="3.556" y2="10.4648" layer="25"/>
<rectangle x1="3.7592" y1="10.2616" x2="3.9624" y2="10.4648" layer="25"/>
<rectangle x1="4.1656" y1="10.2616" x2="4.3688" y2="10.4648" layer="25"/>
<rectangle x1="4.572" y1="10.2616" x2="4.7752" y2="10.4648" layer="25"/>
<rectangle x1="4.9784" y1="10.2616" x2="5.3848" y2="10.4648" layer="25"/>
<rectangle x1="5.9944" y1="10.2616" x2="6.1976" y2="10.4648" layer="25"/>
<rectangle x1="6.604" y1="10.2616" x2="6.8072" y2="10.4648" layer="25"/>
<rectangle x1="7.0104" y1="10.2616" x2="7.2136" y2="10.4648" layer="25"/>
<rectangle x1="1.7272" y1="10.4648" x2="2.3368" y2="10.668" layer="25"/>
<rectangle x1="2.7432" y1="10.4648" x2="3.1496" y2="10.668" layer="25"/>
<rectangle x1="3.3528" y1="10.4648" x2="3.556" y2="10.668" layer="25"/>
<rectangle x1="3.7592" y1="10.4648" x2="3.9624" y2="10.668" layer="25"/>
<rectangle x1="4.1656" y1="10.4648" x2="4.572" y2="10.668" layer="25"/>
<rectangle x1="4.7752" y1="10.4648" x2="5.1816" y2="10.668" layer="25"/>
<rectangle x1="5.7912" y1="10.4648" x2="6.1976" y2="10.668" layer="25"/>
<rectangle x1="6.4008" y1="10.4648" x2="6.604" y2="10.668" layer="25"/>
<rectangle x1="7.0104" y1="10.4648" x2="7.2136" y2="10.668" layer="25"/>
<rectangle x1="1.7272" y1="10.668" x2="2.1336" y2="10.8712" layer="25"/>
<rectangle x1="2.7432" y1="10.668" x2="3.3528" y2="10.8712" layer="25"/>
<rectangle x1="3.9624" y1="10.668" x2="4.3688" y2="10.8712" layer="25"/>
<rectangle x1="4.7752" y1="10.668" x2="4.9784" y2="10.8712" layer="25"/>
<rectangle x1="5.1816" y1="10.668" x2="5.3848" y2="10.8712" layer="25"/>
<rectangle x1="5.588" y1="10.668" x2="5.7912" y2="10.8712" layer="25"/>
<rectangle x1="5.9944" y1="10.668" x2="7.2136" y2="10.8712" layer="25"/>
<rectangle x1="1.7272" y1="10.8712" x2="2.1336" y2="11.0744" layer="25"/>
<rectangle x1="2.3368" y1="10.8712" x2="2.54" y2="11.0744" layer="25"/>
<rectangle x1="2.7432" y1="10.8712" x2="3.1496" y2="11.0744" layer="25"/>
<rectangle x1="3.556" y1="10.8712" x2="4.3688" y2="11.0744" layer="25"/>
<rectangle x1="4.572" y1="10.8712" x2="5.1816" y2="11.0744" layer="25"/>
<rectangle x1="5.3848" y1="10.8712" x2="5.588" y2="11.0744" layer="25"/>
<rectangle x1="6.1976" y1="10.8712" x2="6.604" y2="11.0744" layer="25"/>
<rectangle x1="7.0104" y1="10.8712" x2="7.2136" y2="11.0744" layer="25"/>
<rectangle x1="1.7272" y1="11.0744" x2="2.1336" y2="11.2776" layer="25"/>
<rectangle x1="2.3368" y1="11.0744" x2="2.9464" y2="11.2776" layer="25"/>
<rectangle x1="3.1496" y1="11.0744" x2="3.556" y2="11.2776" layer="25"/>
<rectangle x1="3.7592" y1="11.0744" x2="3.9624" y2="11.2776" layer="25"/>
<rectangle x1="4.1656" y1="11.0744" x2="5.1816" y2="11.2776" layer="25"/>
<rectangle x1="5.7912" y1="11.0744" x2="6.8072" y2="11.2776" layer="25"/>
<rectangle x1="7.0104" y1="11.0744" x2="7.2136" y2="11.2776" layer="25"/>
<rectangle x1="1.7272" y1="11.2776" x2="1.9304" y2="11.4808" layer="25"/>
<rectangle x1="2.3368" y1="11.2776" x2="2.54" y2="11.4808" layer="25"/>
<rectangle x1="2.7432" y1="11.2776" x2="3.1496" y2="11.4808" layer="25"/>
<rectangle x1="3.556" y1="11.2776" x2="3.7592" y2="11.4808" layer="25"/>
<rectangle x1="4.1656" y1="11.2776" x2="4.3688" y2="11.4808" layer="25"/>
<rectangle x1="4.7752" y1="11.2776" x2="4.9784" y2="11.4808" layer="25"/>
<rectangle x1="5.1816" y1="11.2776" x2="5.588" y2="11.4808" layer="25"/>
<rectangle x1="6.1976" y1="11.2776" x2="6.4008" y2="11.4808" layer="25"/>
<rectangle x1="6.8072" y1="11.2776" x2="7.2136" y2="11.4808" layer="25"/>
<rectangle x1="1.7272" y1="11.4808" x2="3.556" y2="11.684" layer="25"/>
<rectangle x1="4.1656" y1="11.4808" x2="4.3688" y2="11.684" layer="25"/>
<rectangle x1="4.572" y1="11.4808" x2="4.7752" y2="11.684" layer="25"/>
<rectangle x1="5.3848" y1="11.4808" x2="7.2136" y2="11.684" layer="25"/>
<rectangle x1="1.7272" y1="11.684" x2="1.9304" y2="11.8872" layer="25"/>
<rectangle x1="3.3528" y1="11.684" x2="3.556" y2="11.8872" layer="25"/>
<rectangle x1="3.7592" y1="11.684" x2="3.9624" y2="11.8872" layer="25"/>
<rectangle x1="4.1656" y1="11.684" x2="4.3688" y2="11.8872" layer="25"/>
<rectangle x1="4.572" y1="11.684" x2="4.7752" y2="11.8872" layer="25"/>
<rectangle x1="4.9784" y1="11.684" x2="5.1816" y2="11.8872" layer="25"/>
<rectangle x1="5.3848" y1="11.684" x2="5.588" y2="11.8872" layer="25"/>
<rectangle x1="7.0104" y1="11.684" x2="7.2136" y2="11.8872" layer="25"/>
<rectangle x1="1.7272" y1="11.8872" x2="1.9304" y2="12.0904" layer="25"/>
<rectangle x1="2.1336" y1="11.8872" x2="3.1496" y2="12.0904" layer="25"/>
<rectangle x1="3.3528" y1="11.8872" x2="3.556" y2="12.0904" layer="25"/>
<rectangle x1="3.7592" y1="11.8872" x2="3.9624" y2="12.0904" layer="25"/>
<rectangle x1="4.1656" y1="11.8872" x2="4.3688" y2="12.0904" layer="25"/>
<rectangle x1="4.572" y1="11.8872" x2="4.9784" y2="12.0904" layer="25"/>
<rectangle x1="5.3848" y1="11.8872" x2="5.588" y2="12.0904" layer="25"/>
<rectangle x1="5.7912" y1="11.8872" x2="6.8072" y2="12.0904" layer="25"/>
<rectangle x1="7.0104" y1="11.8872" x2="7.2136" y2="12.0904" layer="25"/>
<rectangle x1="1.7272" y1="12.0904" x2="1.9304" y2="12.2936" layer="25"/>
<rectangle x1="2.1336" y1="12.0904" x2="2.3368" y2="12.2936" layer="25"/>
<rectangle x1="2.9464" y1="12.0904" x2="3.1496" y2="12.2936" layer="25"/>
<rectangle x1="3.3528" y1="12.0904" x2="3.556" y2="12.2936" layer="25"/>
<rectangle x1="3.7592" y1="12.0904" x2="3.9624" y2="12.2936" layer="25"/>
<rectangle x1="4.572" y1="12.0904" x2="4.7752" y2="12.2936" layer="25"/>
<rectangle x1="5.1816" y1="12.0904" x2="5.588" y2="12.2936" layer="25"/>
<rectangle x1="5.7912" y1="12.0904" x2="5.9944" y2="12.2936" layer="25"/>
<rectangle x1="6.604" y1="12.0904" x2="6.8072" y2="12.2936" layer="25"/>
<rectangle x1="7.0104" y1="12.0904" x2="7.2136" y2="12.2936" layer="25"/>
<rectangle x1="1.7272" y1="12.2936" x2="1.9304" y2="12.4968" layer="25"/>
<rectangle x1="2.1336" y1="12.2936" x2="2.3368" y2="12.4968" layer="25"/>
<rectangle x1="2.9464" y1="12.2936" x2="3.1496" y2="12.4968" layer="25"/>
<rectangle x1="3.3528" y1="12.2936" x2="4.1656" y2="12.4968" layer="25"/>
<rectangle x1="4.572" y1="12.2936" x2="4.7752" y2="12.4968" layer="25"/>
<rectangle x1="4.9784" y1="12.2936" x2="5.588" y2="12.4968" layer="25"/>
<rectangle x1="5.7912" y1="12.2936" x2="5.9944" y2="12.4968" layer="25"/>
<rectangle x1="6.604" y1="12.2936" x2="6.8072" y2="12.4968" layer="25"/>
<rectangle x1="7.0104" y1="12.2936" x2="7.2136" y2="12.4968" layer="25"/>
<rectangle x1="1.7272" y1="12.4968" x2="1.9304" y2="12.7" layer="25"/>
<rectangle x1="2.1336" y1="12.4968" x2="2.3368" y2="12.7" layer="25"/>
<rectangle x1="2.9464" y1="12.4968" x2="3.1496" y2="12.7" layer="25"/>
<rectangle x1="3.3528" y1="12.4968" x2="3.556" y2="12.7" layer="25"/>
<rectangle x1="3.7592" y1="12.4968" x2="4.7752" y2="12.7" layer="25"/>
<rectangle x1="5.1816" y1="12.4968" x2="5.588" y2="12.7" layer="25"/>
<rectangle x1="5.7912" y1="12.4968" x2="5.9944" y2="12.7" layer="25"/>
<rectangle x1="6.604" y1="12.4968" x2="6.8072" y2="12.7" layer="25"/>
<rectangle x1="7.0104" y1="12.4968" x2="7.2136" y2="12.7" layer="25"/>
<rectangle x1="1.7272" y1="12.7" x2="1.9304" y2="12.9032" layer="25"/>
<rectangle x1="2.1336" y1="12.7" x2="3.1496" y2="12.9032" layer="25"/>
<rectangle x1="3.3528" y1="12.7" x2="3.556" y2="12.9032" layer="25"/>
<rectangle x1="3.9624" y1="12.7" x2="4.1656" y2="12.9032" layer="25"/>
<rectangle x1="4.3688" y1="12.7" x2="4.9784" y2="12.9032" layer="25"/>
<rectangle x1="5.3848" y1="12.7" x2="5.588" y2="12.9032" layer="25"/>
<rectangle x1="5.7912" y1="12.7" x2="6.8072" y2="12.9032" layer="25"/>
<rectangle x1="7.0104" y1="12.7" x2="7.2136" y2="12.9032" layer="25"/>
<rectangle x1="1.7272" y1="12.9032" x2="1.9304" y2="13.1064" layer="25"/>
<rectangle x1="3.3528" y1="12.9032" x2="4.1656" y2="13.1064" layer="25"/>
<rectangle x1="5.1816" y1="12.9032" x2="5.588" y2="13.1064" layer="25"/>
<rectangle x1="7.0104" y1="12.9032" x2="7.2136" y2="13.1064" layer="25"/>
<rectangle x1="1.7272" y1="13.1064" x2="7.2136" y2="13.3096" layer="25"/>
</plain>
<libraries>
<library name="74xx-eu">
<description>&lt;b&gt;TTL Devices, 74xx Series with European Symbols&lt;/b&gt;&lt;p&gt;
Based on the following sources:
&lt;ul&gt;
&lt;li&gt;Texas Instruments &lt;i&gt;TTL Data Book&lt;/i&gt;&amp;nbsp;&amp;nbsp;&amp;nbsp;Volume 1, 1996.
&lt;li&gt;TTL Data Book, Volume 2 , 1993
&lt;li&gt;National Seminconductor Databook 1990, ALS/LS Logic
&lt;li&gt;ttl 74er digital data dictionary, ECA Electronic + Acustic GmbH, ISBN 3-88109-032-0
&lt;li&gt;http://icmaster.com/ViewCompare.asp
&lt;/ul&gt;
&lt;author&gt;Created by librarian@cadsoft.de&lt;/author&gt;</description>
<packages>
<package name="SO16">
<description>&lt;b&gt;Small Outline package&lt;/b&gt; 150 mil</description>
<wire x1="4.699" y1="1.9558" x2="-4.699" y2="1.9558" width="0.1524" layer="51"/>
<wire x1="4.699" y1="-1.9558" x2="5.08" y2="-1.5748" width="0.1524" layer="21" curve="90"/>
<wire x1="-5.08" y1="1.5748" x2="-4.699" y2="1.9558" width="0.1524" layer="21" curve="-90"/>
<wire x1="4.699" y1="1.9558" x2="5.08" y2="1.5748" width="0.1524" layer="21" curve="-90"/>
<wire x1="-5.08" y1="-1.5748" x2="-4.699" y2="-1.9558" width="0.1524" layer="21" curve="90"/>
<wire x1="-4.699" y1="-1.9558" x2="4.699" y2="-1.9558" width="0.1524" layer="51"/>
<wire x1="5.08" y1="-1.5748" x2="5.08" y2="1.5748" width="0.1524" layer="21"/>
<wire x1="-5.08" y1="1.5748" x2="-5.08" y2="0.508" width="0.1524" layer="21"/>
<wire x1="-5.08" y1="0.508" x2="-5.08" y2="-0.508" width="0.1524" layer="21"/>
<wire x1="-5.08" y1="-0.508" x2="-5.08" y2="-1.5748" width="0.1524" layer="21"/>
<wire x1="-5.08" y1="0.508" x2="-5.08" y2="-0.508" width="0.1524" layer="21" curve="-180"/>
<wire x1="-5.08" y1="-1.6002" x2="5.08" y2="-1.6002" width="0.0508" layer="21"/>
<smd name="1" x="-4.445" y="-3.0734" dx="0.6604" dy="2.032" layer="1"/>
<smd name="16" x="-4.445" y="3.0734" dx="0.6604" dy="2.032" layer="1"/>
<smd name="2" x="-3.175" y="-3.0734" dx="0.6604" dy="2.032" layer="1"/>
<smd name="3" x="-1.905" y="-3.0734" dx="0.6604" dy="2.032" layer="1"/>
<smd name="15" x="-3.175" y="3.0734" dx="0.6604" dy="2.032" layer="1"/>
<smd name="14" x="-1.905" y="3.0734" dx="0.6604" dy="2.032" layer="1"/>
<smd name="4" x="-0.635" y="-3.0734" dx="0.6604" dy="2.032" layer="1"/>
<smd name="13" x="-0.635" y="3.0734" dx="0.6604" dy="2.032" layer="1"/>
<smd name="5" x="0.635" y="-3.0734" dx="0.6604" dy="2.032" layer="1"/>
<smd name="12" x="0.635" y="3.0734" dx="0.6604" dy="2.032" layer="1"/>
<smd name="6" x="1.905" y="-3.0734" dx="0.6604" dy="2.032" layer="1"/>
<smd name="7" x="3.175" y="-3.0734" dx="0.6604" dy="2.032" layer="1"/>
<smd name="11" x="1.905" y="3.0734" dx="0.6604" dy="2.032" layer="1"/>
<smd name="10" x="3.175" y="3.0734" dx="0.6604" dy="2.032" layer="1"/>
<smd name="8" x="4.445" y="-3.0734" dx="0.6604" dy="2.032" layer="1"/>
<smd name="9" x="4.445" y="3.0734" dx="0.6604" dy="2.032" layer="1"/>
<text x="-3.81" y="-0.762" size="1.27" layer="27" ratio="10">&gt;VALUE</text>
<text x="-5.461" y="-1.905" size="1.27" layer="25" ratio="10" rot="R90">&gt;NAME</text>
<rectangle x1="-0.889" y1="1.9558" x2="-0.381" y2="3.0988" layer="51"/>
<rectangle x1="-4.699" y1="-3.0988" x2="-4.191" y2="-1.9558" layer="51"/>
<rectangle x1="-3.429" y1="-3.0988" x2="-2.921" y2="-1.9558" layer="51"/>
<rectangle x1="-2.159" y1="-3.0734" x2="-1.651" y2="-1.9304" layer="51"/>
<rectangle x1="-0.889" y1="-3.0988" x2="-0.381" y2="-1.9558" layer="51"/>
<rectangle x1="-2.159" y1="1.9558" x2="-1.651" y2="3.0988" layer="51"/>
<rectangle x1="-3.429" y1="1.9558" x2="-2.921" y2="3.0988" layer="51"/>
<rectangle x1="-4.699" y1="1.9558" x2="-4.191" y2="3.0988" layer="51"/>
<rectangle x1="0.381" y1="-3.0988" x2="0.889" y2="-1.9558" layer="51"/>
<rectangle x1="1.651" y1="-3.0988" x2="2.159" y2="-1.9558" layer="51"/>
<rectangle x1="2.921" y1="-3.0988" x2="3.429" y2="-1.9558" layer="51"/>
<rectangle x1="4.191" y1="-3.0988" x2="4.699" y2="-1.9558" layer="51"/>
<rectangle x1="0.381" y1="1.9558" x2="0.889" y2="3.0988" layer="51"/>
<rectangle x1="1.651" y1="1.9558" x2="2.159" y2="3.0988" layer="51"/>
<rectangle x1="2.921" y1="1.9558" x2="3.429" y2="3.0988" layer="51"/>
<rectangle x1="4.191" y1="1.9558" x2="4.699" y2="3.0988" layer="51"/>
</package>
</packages>
</library>
<library name="display-kingbright">
<description>&lt;b&gt;KINGBRIGHT Numeric Displays&lt;/b&gt;&lt;p&gt;
&lt;author&gt;librarian@cadsoft.de&lt;/author&gt;</description>
<packages>
<package name="SA56-11">
<description>&lt;b&gt;Kingbright 14.2mm (0.56 INCH) SINGLE DIGIT NUMERIC DUISPLAY&lt;/b&gt;&lt;p&gt;
Source: SA56-11EWA(Ver1189471036.pdf</description>
<wire x1="6.273" y1="-9.434" x2="6.273" y2="9.434" width="0.1524" layer="21"/>
<wire x1="-6.273" y1="9.434" x2="6.273" y2="9.434" width="0.1524" layer="21"/>
<wire x1="-6.273" y1="9.434" x2="-6.273" y2="-9.434" width="0.1524" layer="21"/>
<wire x1="6.273" y1="-9.434" x2="-6.273" y2="-9.434" width="0.1524" layer="21"/>
<wire x1="2.4372" y1="-6.5358" x2="2.107" y2="-6.866" width="0.4064" layer="51"/>
<circle x="4.572" y="-6.35" radius="0.381" width="0.762" layer="51"/>
<pad name="1" x="-5.08" y="-7.62" drill="0.8" shape="long" rot="R90"/>
<pad name="2" x="-2.54" y="-7.62" drill="0.8" shape="long" rot="R90"/>
<pad name="3" x="0" y="-7.62" drill="0.8" shape="long" rot="R90"/>
<pad name="4" x="2.54" y="-7.62" drill="0.8" shape="long" rot="R90"/>
<pad name="5" x="5.08" y="-7.62" drill="0.8" shape="long" rot="R90"/>
<pad name="6" x="5.08" y="7.62" drill="0.8" shape="long" rot="R90"/>
<pad name="7" x="2.54" y="7.62" drill="0.8" shape="long" rot="R90"/>
<pad name="8" x="0" y="7.62" drill="0.8" shape="long" rot="R90"/>
<pad name="9" x="-2.54" y="7.62" drill="0.8" shape="long" rot="R90"/>
<pad name="10" x="-5.08" y="7.62" drill="0.8" shape="long" rot="R90"/>
<text x="-6.35" y="10.16" size="1.27" layer="25" ratio="10">&gt;NAME</text>
<text x="-6.35" y="-11.43" size="1.27" layer="27" ratio="10">&gt;VALUE</text>
<polygon width="0.4064" layer="51">
<vertex x="-1.425" y="6.1"/>
<vertex x="-1.25" y="7.1"/>
<vertex x="3.675" y="7.1"/>
<vertex x="3.55" y="6.1"/>
</polygon>
<polygon width="0.4064" layer="51">
<vertex x="3.2565" y="1.0555"/>
<vertex x="4.3128" y="7.0544"/>
<vertex x="4.622" y="7.0626" curve="-104.72173"/>
<vertex x="5.2533" y="6.2038"/>
<vertex x="4.2" y="0.5"/>
<vertex x="3.725" y="0.5"/>
</polygon>
<polygon width="0.4064" layer="51">
<vertex x="-2.95" y="1.1"/>
<vertex x="-1.9" y="7.1"/>
<vertex x="-2.175" y="7.1" curve="77.708822"/>
<vertex x="-3.075" y="6.375"/>
<vertex x="-4.1" y="0.5"/>
<vertex x="-3.525" y="0.5"/>
</polygon>
<polygon width="0.4064" layer="51">
<vertex x="-3.05" y="0.025"/>
<vertex x="-2.425" y="0.65"/>
<vertex x="2.7" y="0.65"/>
<vertex x="3.075" y="0.125"/>
<vertex x="2.625" y="-0.35"/>
<vertex x="-2.675" y="-0.35"/>
</polygon>
<polygon width="0.4064" layer="51">
<vertex x="1.5" y="-5.825"/>
<vertex x="1.325" y="-6.825"/>
<vertex x="-3.6" y="-6.825"/>
<vertex x="-3.475" y="-5.825"/>
</polygon>
<polygon width="0.4064" layer="51">
<vertex x="-3.2565" y="-0.7305"/>
<vertex x="-4.2378" y="-6.7794"/>
<vertex x="-4.547" y="-6.7876" curve="-104.72173"/>
<vertex x="-5.1783" y="-5.9288"/>
<vertex x="-4.2" y="-0.175"/>
<vertex x="-3.725" y="-0.175"/>
</polygon>
<polygon width="0.4064" layer="51">
<vertex x="2.975" y="-0.975"/>
<vertex x="1.975" y="-6.825"/>
<vertex x="2.25" y="-6.825" curve="77.708822"/>
<vertex x="3.15" y="-6.1"/>
<vertex x="4.1" y="-0.425"/>
<vertex x="3.525" y="-0.425"/>
</polygon>
</package>
</packages>
</library>
<library name="rcl">
<description>&lt;b&gt;Resistors, Capacitors, Inductors&lt;/b&gt;&lt;p&gt;
Based on the previous libraries:
&lt;ul&gt;
&lt;li&gt;r.lbr
&lt;li&gt;cap.lbr 
&lt;li&gt;cap-fe.lbr
&lt;li&gt;captant.lbr
&lt;li&gt;polcap.lbr
&lt;li&gt;ipc-smd.lbr
&lt;/ul&gt;
All SMD packages are defined according to the IPC specifications and  CECC&lt;p&gt;
&lt;author&gt;Created by librarian@cadsoft.de&lt;/author&gt;&lt;p&gt;
&lt;p&gt;
for Electrolyt Capacitors see also :&lt;p&gt;
www.bccomponents.com &lt;p&gt;
www.panasonic.com&lt;p&gt;
www.kemet.com&lt;p&gt;
http://www.secc.co.jp/pdf/os_e/2004/e_os_all.pdf &lt;b&gt;(SANYO)&lt;/b&gt;
&lt;p&gt;
for trimmer refence see : &lt;u&gt;www.electrospec-inc.com/cross_references/trimpotcrossref.asp&lt;/u&gt;&lt;p&gt;

&lt;table border=0 cellspacing=0 cellpadding=0 width="100%" cellpaddding=0&gt;
&lt;tr valign="top"&gt;

&lt;! &lt;td width="10"&gt;&amp;nbsp;&lt;/td&gt;
&lt;td width="90%"&gt;

&lt;b&gt;&lt;font color="#0000FF" size="4"&gt;TRIM-POT CROSS REFERENCE&lt;/font&gt;&lt;/b&gt;
&lt;P&gt;
&lt;TABLE BORDER=0 CELLSPACING=1 CELLPADDING=2&gt;
  &lt;TR&gt;
    &lt;TD COLSPAN=8&gt;
      &lt;FONT SIZE=3 FACE=ARIAL&gt;&lt;B&gt;RECTANGULAR MULTI-TURN&lt;/B&gt;&lt;/FONT&gt;
    &lt;/TD&gt;
  &lt;/TR&gt;
  &lt;TR&gt;
    &lt;TD ALIGN=CENTER&gt;
      &lt;B&gt;
      &lt;FONT SIZE=3 FACE=ARIAL color="#FF0000"&gt;BOURNS&lt;/FONT&gt;
      &lt;/B&gt;
    &lt;/TD&gt;
    &lt;TD ALIGN=CENTER&gt;
      &lt;B&gt;
      &lt;FONT SIZE=3 FACE=ARIAL color="#FF0000"&gt;BI&amp;nbsp;TECH&lt;/FONT&gt;
      &lt;/B&gt;
    &lt;/TD&gt;
    &lt;TD ALIGN=CENTER&gt;
      &lt;B&gt;
      &lt;FONT SIZE=3 FACE=ARIAL color="#FF0000"&gt;DALE-VISHAY&lt;/FONT&gt;
      &lt;/B&gt;
    &lt;/TD&gt;
    &lt;TD ALIGN=CENTER&gt;
      &lt;B&gt;
      &lt;FONT SIZE=3 FACE=ARIAL color="#FF0000"&gt;PHILIPS/MEPCO&lt;/FONT&gt;
      &lt;/B&gt;
    &lt;/TD&gt;
    &lt;TD ALIGN=CENTER&gt;
      &lt;B&gt;
      &lt;FONT SIZE=3 FACE=ARIAL color="#FF0000"&gt;MURATA&lt;/FONT&gt;
      &lt;/B&gt;
    &lt;/TD&gt;
    &lt;TD ALIGN=CENTER&gt;
      &lt;B&gt;
      &lt;FONT SIZE=3 FACE=ARIAL color="#FF0000"&gt;PANASONIC&lt;/FONT&gt;
      &lt;/B&gt;
    &lt;/TD&gt;
    &lt;TD ALIGN=CENTER&gt;
      &lt;B&gt;
      &lt;FONT SIZE=3 FACE=ARIAL color="#FF0000"&gt;SPECTROL&lt;/FONT&gt;
      &lt;/B&gt;
    &lt;/TD&gt;
    &lt;TD ALIGN=CENTER&gt;
      &lt;B&gt;
      &lt;FONT SIZE=3 FACE=ARIAL color="#FF0000"&gt;MILSPEC&lt;/FONT&gt;
      &lt;/B&gt;
    &lt;/TD&gt;&lt;TD&gt;&amp;nbsp;&lt;/TD&gt;
  &lt;/TR&gt;
  &lt;TR&gt;
    &lt;TD BGCOLOR="#cccccc" ALIGN=CENTER&gt;&lt;FONT FACE=ARIAL SIZE=3 &gt;
      3005P&lt;BR&gt;
      3006P&lt;BR&gt;
      3006W&lt;BR&gt;
      3006Y&lt;BR&gt;
      3009P&lt;BR&gt;
      3009W&lt;BR&gt;
      3009Y&lt;BR&gt;
      3057J&lt;BR&gt;
      3057L&lt;BR&gt;
      3057P&lt;BR&gt;
      3057Y&lt;BR&gt;
      3059J&lt;BR&gt;
      3059L&lt;BR&gt;
      3059P&lt;BR&gt;
      3059Y&lt;BR&gt;&lt;/FONT&gt;
    &lt;/TD&gt;
    &lt;TD BGCOLOR="#cccccc" ALIGN=CENTER&gt;&lt;FONT FACE=ARIAL SIZE=3&gt;
      -&lt;BR&gt;
      89P&lt;BR&gt;
      89W&lt;BR&gt;
      89X&lt;BR&gt;
      89PH&lt;BR&gt;
      76P&lt;BR&gt;
      89XH&lt;BR&gt;
      78SLT&lt;BR&gt;
      78L&amp;nbsp;ALT&lt;BR&gt;
      56P&amp;nbsp;ALT&lt;BR&gt;
      78P&amp;nbsp;ALT&lt;BR&gt;
      T8S&lt;BR&gt;
      78L&lt;BR&gt;
      56P&lt;BR&gt;
      78P&lt;BR&gt;&lt;/FONT&gt;
    &lt;/TD&gt;
    &lt;TD BGCOLOR="#cccccc" ALIGN=CENTER&gt;&lt;FONT FACE=ARIAL SIZE=3&gt;
      -&lt;BR&gt;
      T18/784&lt;BR&gt;
      783&lt;BR&gt;
      781&lt;BR&gt;
      -&lt;BR&gt;
      -&lt;BR&gt;
      -&lt;BR&gt;
      2199&lt;BR&gt;
      1697/1897&lt;BR&gt;
      1680/1880&lt;BR&gt;
      2187&lt;BR&gt;
      -&lt;BR&gt;
      -&lt;BR&gt;
      -&lt;BR&gt;
      -&lt;BR&gt;&lt;/FONT&gt;
    &lt;/TD&gt;
    &lt;TD BGCOLOR="#cccccc" ALIGN=CENTER&gt;&lt;FONT FACE=ARIAL SIZE=3&gt;
      -&lt;BR&gt;
      8035EKP/CT20/RJ-20P&lt;BR&gt;
      -&lt;BR&gt;
      RJ-20X&lt;BR&gt;
      -&lt;BR&gt;
      -&lt;BR&gt;
      -&lt;BR&gt;
      1211L&lt;BR&gt;
      8012EKQ&amp;nbsp;ALT&lt;BR&gt;
      8012EKR&amp;nbsp;ALT&lt;BR&gt;
      1211P&lt;BR&gt;
      8012EKJ&lt;BR&gt;
      8012EKL&lt;BR&gt;
      8012EKQ&lt;BR&gt;
      8012EKR&lt;BR&gt;&lt;/FONT&gt;
    &lt;/TD&gt;
    &lt;TD BGCOLOR="#cccccc" ALIGN=CENTER&gt;&lt;FONT FACE=ARIAL SIZE=3&gt;
      -&lt;BR&gt;
      2101P&lt;BR&gt;
      2101W&lt;BR&gt;
      2101Y&lt;BR&gt;
      -&lt;BR&gt;
      -&lt;BR&gt;
      -&lt;BR&gt;
      -&lt;BR&gt;
      -&lt;BR&gt;
      -&lt;BR&gt;
      -&lt;BR&gt;
      -&lt;BR&gt;
      2102L&lt;BR&gt;
      2102S&lt;BR&gt;
      2102Y&lt;BR&gt;&lt;/FONT&gt;
    &lt;/TD&gt;
    &lt;TD BGCOLOR="#cccccc" ALIGN=CENTER&gt;&lt;FONT FACE=ARIAL SIZE=3&gt;
      -&lt;BR&gt;
      EVMCOG&lt;BR&gt;
      -&lt;BR&gt;
      -&lt;BR&gt;
      -&lt;BR&gt;
      -&lt;BR&gt;
      -&lt;BR&gt;
      -&lt;BR&gt;
      -&lt;BR&gt;
      -&lt;BR&gt;
      -&lt;BR&gt;
      -&lt;BR&gt;
      -&lt;BR&gt;
      -&lt;BR&gt;
      -&lt;BR&gt;&lt;/FONT&gt;
    &lt;/TD&gt;
    &lt;TD BGCOLOR="#cccccc" ALIGN=CENTER&gt;&lt;FONT FACE=ARIAL SIZE=3&gt;
      -&lt;BR&gt;
      43P&lt;BR&gt;
      43W&lt;BR&gt;
      43Y&lt;BR&gt;
      -&lt;BR&gt;
      -&lt;BR&gt;
      -&lt;BR&gt;
      -&lt;BR&gt;
      40L&lt;BR&gt;
      40P&lt;BR&gt;
      40Y&lt;BR&gt;
      70Y-T602&lt;BR&gt;
      70L&lt;BR&gt;
      70P&lt;BR&gt;
      70Y&lt;BR&gt;&lt;/FONT&gt;
    &lt;/TD&gt;
    &lt;TD BGCOLOR="#cccccc" ALIGN=CENTER&gt;&lt;FONT FACE=ARIAL SIZE=3&gt;
      -&lt;BR&gt;
      -&lt;BR&gt;
      -&lt;BR&gt;
      -&lt;BR&gt;
      -&lt;BR&gt;
      -&lt;BR&gt;
      -&lt;BR&gt;
      -&lt;BR&gt;
      RT/RTR12&lt;BR&gt;
      RT/RTR12&lt;BR&gt;
      RT/RTR12&lt;BR&gt;
      -&lt;BR&gt;
      RJ/RJR12&lt;BR&gt;
      RJ/RJR12&lt;BR&gt;
      RJ/RJR12&lt;BR&gt;&lt;/FONT&gt;
    &lt;/TD&gt;
  &lt;/TR&gt;
  &lt;TR&gt;
    &lt;TD COLSPAN=8&gt;&amp;nbsp;
    &lt;/TD&gt;
  &lt;/TR&gt;
  &lt;TR&gt;
    &lt;TD COLSPAN=8&gt;
      &lt;FONT SIZE=4 FACE=ARIAL&gt;&lt;B&gt;SQUARE MULTI-TURN&lt;/B&gt;&lt;/FONT&gt;
    &lt;/TD&gt;
  &lt;/TR&gt;
  &lt;TR&gt;
   &lt;TD ALIGN=CENTER&gt;
      &lt;FONT SIZE=3 FACE=ARIAL&gt;&lt;B&gt;BOURN&lt;/B&gt;&lt;/FONT&gt;
    &lt;/TD&gt;
    &lt;TD ALIGN=CENTER&gt;
      &lt;FONT SIZE=3 FACE=ARIAL&gt;&lt;B&gt;BI&amp;nbsp;TECH&lt;/B&gt;&lt;/FONT&gt;
    &lt;/TD&gt;
    &lt;TD ALIGN=CENTER&gt;
      &lt;FONT SIZE=3 FACE=ARIAL&gt;&lt;B&gt;DALE-VISHAY&lt;/B&gt;&lt;/FONT&gt;
    &lt;/TD&gt;
    &lt;TD ALIGN=CENTER&gt;
      &lt;FONT SIZE=3 FACE=ARIAL&gt;&lt;B&gt;PHILIPS/MEPCO&lt;/B&gt;&lt;/FONT&gt;
    &lt;/TD&gt;
    &lt;TD ALIGN=CENTER&gt;
      &lt;FONT SIZE=3 FACE=ARIAL&gt;&lt;B&gt;MURATA&lt;/B&gt;&lt;/FONT&gt;
    &lt;/TD&gt;
    &lt;TD ALIGN=CENTER&gt;
      &lt;FONT SIZE=3 FACE=ARIAL&gt;&lt;B&gt;PANASONIC&lt;/B&gt;&lt;/FONT&gt;
    &lt;/TD&gt;
    &lt;TD ALIGN=CENTER&gt;
      &lt;FONT SIZE=3 FACE=ARIAL&gt;&lt;B&gt;SPECTROL&lt;/B&gt;&lt;/FONT&gt;
    &lt;/TD&gt;
    &lt;TD ALIGN=CENTER&gt;
      &lt;FONT SIZE=3 FACE=ARIAL&gt;&lt;B&gt;MILSPEC&lt;/B&gt;&lt;/FONT&gt;
    &lt;/TD&gt;
  &lt;/TR&gt;
  &lt;TR&gt;
    &lt;TD BGCOLOR="#cccccc" ALIGN=CENTER&gt;&lt;FONT FACE=ARIAL SIZE=3&gt;
      3250L&lt;BR&gt;
      3250P&lt;BR&gt;
      3250W&lt;BR&gt;
      3250X&lt;BR&gt;
      3252P&lt;BR&gt;
      3252W&lt;BR&gt;
      3252X&lt;BR&gt;
      3260P&lt;BR&gt;
      3260W&lt;BR&gt;
      3260X&lt;BR&gt;
      3262P&lt;BR&gt;
      3262W&lt;BR&gt;
      3262X&lt;BR&gt;
      3266P&lt;BR&gt;
      3266W&lt;BR&gt;
      3266X&lt;BR&gt;
      3290H&lt;BR&gt;
      3290P&lt;BR&gt;
      3290W&lt;BR&gt;
      3292P&lt;BR&gt;
      3292W&lt;BR&gt;
      3292X&lt;BR&gt;
      3296P&lt;BR&gt;
      3296W&lt;BR&gt;
      3296X&lt;BR&gt;
      3296Y&lt;BR&gt;
      3296Z&lt;BR&gt;
      3299P&lt;BR&gt;
      3299W&lt;BR&gt;
      3299X&lt;BR&gt;
      3299Y&lt;BR&gt;
      3299Z&lt;BR&gt;&lt;/FONT&gt;
    &lt;/TD&gt;
    &lt;TD BGCOLOR="#cccccc" ALIGN=CENTER&gt;&lt;FONT FACE=ARIAL SIZE=3&gt;
      -&lt;BR&gt;
      66P&amp;nbsp;ALT&lt;BR&gt;
      66W&amp;nbsp;ALT&lt;BR&gt;
      66X&amp;nbsp;ALT&lt;BR&gt;
      66P&amp;nbsp;ALT&lt;BR&gt;
      66W&amp;nbsp;ALT&lt;BR&gt;
      66X&amp;nbsp;ALT&lt;BR&gt;
      -&lt;BR&gt;
      64W&amp;nbsp;ALT&lt;BR&gt;
      -&lt;BR&gt;
      64P&amp;nbsp;ALT&lt;BR&gt;
      64W&amp;nbsp;ALT&lt;BR&gt;
      64X&amp;nbsp;ALT&lt;BR&gt;
      64P&lt;BR&gt;
      64W&lt;BR&gt;
      64X&lt;BR&gt;
      66X&amp;nbsp;ALT&lt;BR&gt;
      66P&amp;nbsp;ALT&lt;BR&gt;
      66W&amp;nbsp;ALT&lt;BR&gt;
      66P&lt;BR&gt;
      66W&lt;BR&gt;
      66X&lt;BR&gt;
      67P&lt;BR&gt;
      67W&lt;BR&gt;
      67X&lt;BR&gt;
      67Y&lt;BR&gt;
      67Z&lt;BR&gt;
      68P&lt;BR&gt;
      68W&lt;BR&gt;
      68X&lt;BR&gt;
      67Y&amp;nbsp;ALT&lt;BR&gt;
      67Z&amp;nbsp;ALT&lt;BR&gt;&lt;/FONT&gt;
    &lt;/TD&gt;
    &lt;TD BGCOLOR="#cccccc" ALIGN=CENTER&gt;&lt;FONT FACE=ARIAL SIZE=3&gt;
      5050&lt;BR&gt;
      5091&lt;BR&gt;
      5080&lt;BR&gt;
      5087&lt;BR&gt;
      -&lt;BR&gt;
      -&lt;BR&gt;
      -&lt;BR&gt;
      -&lt;BR&gt;
      -&lt;BR&gt;
      -&lt;BR&gt;
      -&lt;BR&gt;
      T63YB&lt;BR&gt;
      T63XB&lt;BR&gt;
      -&lt;BR&gt;
      -&lt;BR&gt;
      -&lt;BR&gt;
      5887&lt;BR&gt;
      5891&lt;BR&gt;
      5880&lt;BR&gt;
      -&lt;BR&gt;
      -&lt;BR&gt;
      -&lt;BR&gt;
      T93Z&lt;BR&gt;
      T93YA&lt;BR&gt;
      T93XA&lt;BR&gt;
      T93YB&lt;BR&gt;
      T93XB&lt;BR&gt;
      -&lt;BR&gt;
      -&lt;BR&gt;
      -&lt;BR&gt;
      -&lt;BR&gt;
      -&lt;BR&gt;&lt;/FONT&gt;
    &lt;/TD&gt;
    &lt;TD BGCOLOR="#cccccc" ALIGN=CENTER&gt;&lt;FONT FACE=ARIAL SIZE=3&gt;
      -&lt;BR&gt;
      -&lt;BR&gt;
      -&lt;BR&gt;
      -&lt;BR&gt;
      -&lt;BR&gt;
      -&lt;BR&gt;
      -&lt;BR&gt;
      -&lt;BR&gt;
      -&lt;BR&gt;
      -&lt;BR&gt;
      8026EKP&lt;BR&gt;
      8026EKW&lt;BR&gt;
      8026EKM&lt;BR&gt;
      8026EKP&lt;BR&gt;
      8026EKB&lt;BR&gt;
      8026EKM&lt;BR&gt;
      1309X&lt;BR&gt;
      1309P&lt;BR&gt;
      1309W&lt;BR&gt;
      8024EKP&lt;BR&gt;
      8024EKW&lt;BR&gt;
      8024EKN&lt;BR&gt;
      RJ-9P/CT9P&lt;BR&gt;
      RJ-9W&lt;BR&gt;
      RJ-9X&lt;BR&gt;
      -&lt;BR&gt;
      -&lt;BR&gt;
      -&lt;BR&gt;
      -&lt;BR&gt;
      -&lt;BR&gt;
      -&lt;BR&gt;
      -&lt;BR&gt;&lt;/FONT&gt;
    &lt;/TD&gt;
    &lt;TD BGCOLOR="#cccccc" ALIGN=CENTER&gt;&lt;FONT FACE=ARIAL SIZE=3&gt;
      -&lt;BR&gt;
      -&lt;BR&gt;
      -&lt;BR&gt;
      -&lt;BR&gt;
      -&lt;BR&gt;
      -&lt;BR&gt;
      -&lt;BR&gt;
      -&lt;BR&gt;
      -&lt;BR&gt;
      -&lt;BR&gt;
      3103P&lt;BR&gt;
      3103Y&lt;BR&gt;
      3103Z&lt;BR&gt;
      3103P&lt;BR&gt;
      3103Y&lt;BR&gt;
      3103Z&lt;BR&gt;
      -&lt;BR&gt;
      -&lt;BR&gt;
      -&lt;BR&gt;
      -&lt;BR&gt;
      -&lt;BR&gt;
      -&lt;BR&gt;
      3105P/3106P&lt;BR&gt;
      3105W/3106W&lt;BR&gt;
      3105X/3106X&lt;BR&gt;
      3105Y/3106Y&lt;BR&gt;
      3105Z/3105Z&lt;BR&gt;
      3102P&lt;BR&gt;
      3102W&lt;BR&gt;
      3102X&lt;BR&gt;
      3102Y&lt;BR&gt;
      3102Z&lt;BR&gt;&lt;/FONT&gt;
    &lt;/TD&gt;
    &lt;TD BGCOLOR="#cccccc" ALIGN=CENTER&gt;&lt;FONT FACE=ARIAL SIZE=3&gt;
      -&lt;BR&gt;
      -&lt;BR&gt;
      -&lt;BR&gt;
      -&lt;BR&gt;
      -&lt;BR&gt;
      -&lt;BR&gt;
      -&lt;BR&gt;
      -&lt;BR&gt;
      -&lt;BR&gt;
      -&lt;BR&gt;
      -&lt;BR&gt;
      -&lt;BR&gt;
      -&lt;BR&gt;
      -&lt;BR&gt;
      -&lt;BR&gt;
      -&lt;BR&gt;
      -&lt;BR&gt;
      -&lt;BR&gt;
      -&lt;BR&gt;
      -&lt;BR&gt;
      -&lt;BR&gt;
      -&lt;BR&gt;
      EVMCBG&lt;BR&gt;
      EVMCCG&lt;BR&gt;
      -&lt;BR&gt;
      -&lt;BR&gt;
      -&lt;BR&gt;
      -&lt;BR&gt;
      -&lt;BR&gt;
      -&lt;BR&gt;
      -&lt;BR&gt;
      -&lt;BR&gt;&lt;/FONT&gt;
    &lt;/TD&gt;
    &lt;TD BGCOLOR="#cccccc" ALIGN=CENTER&gt;&lt;FONT FACE=ARIAL SIZE=3&gt;
      55-1-X&lt;BR&gt;
      55-4-X&lt;BR&gt;
      55-3-X&lt;BR&gt;
      55-2-X&lt;BR&gt;
      -&lt;BR&gt;
      -&lt;BR&gt;
      -&lt;BR&gt;
      -&lt;BR&gt;
      -&lt;BR&gt;
      -&lt;BR&gt;
      -&lt;BR&gt;
      -&lt;BR&gt;
      -&lt;BR&gt;
      -&lt;BR&gt;
      -&lt;BR&gt;
      -&lt;BR&gt;
      50-2-X&lt;BR&gt;
      50-4-X&lt;BR&gt;
      50-3-X&lt;BR&gt;
      -&lt;BR&gt;
      -&lt;BR&gt;
      -&lt;BR&gt;
      64P&lt;BR&gt;
      64W&lt;BR&gt;
      64X&lt;BR&gt;
      64Y&lt;BR&gt;
      64Z&lt;BR&gt;
      -&lt;BR&gt;
      -&lt;BR&gt;
      -&lt;BR&gt;
      -&lt;BR&gt;
      -&lt;BR&gt;&lt;/FONT&gt;
    &lt;/TD&gt;
    &lt;TD BGCOLOR="#cccccc" ALIGN=CENTER&gt;&lt;FONT FACE=ARIAL SIZE=3&gt;
      RT/RTR22&lt;BR&gt;
      RT/RTR22&lt;BR&gt;
      RT/RTR22&lt;BR&gt;
      RT/RTR22&lt;BR&gt;
      RJ/RJR22&lt;BR&gt;
      RJ/RJR22&lt;BR&gt;
      RJ/RJR22&lt;BR&gt;
      RT/RTR26&lt;BR&gt;
      RT/RTR26&lt;BR&gt;
      RT/RTR26&lt;BR&gt;
      RJ/RJR26&lt;BR&gt;
      RJ/RJR26&lt;BR&gt;
      RJ/RJR26&lt;BR&gt;
      RJ/RJR26&lt;BR&gt;
      RJ/RJR26&lt;BR&gt;
      RJ/RJR26&lt;BR&gt;
      RT/RTR24&lt;BR&gt;
      RT/RTR24&lt;BR&gt;
      RT/RTR24&lt;BR&gt;
      RJ/RJR24&lt;BR&gt;
      RJ/RJR24&lt;BR&gt;
      RJ/RJR24&lt;BR&gt;
      RJ/RJR24&lt;BR&gt;
      RJ/RJR24&lt;BR&gt;
      RJ/RJR24&lt;BR&gt;
      -&lt;BR&gt;
      -&lt;BR&gt;
      -&lt;BR&gt;
      -&lt;BR&gt;
      -&lt;BR&gt;
      -&lt;BR&gt;
      -&lt;BR&gt;&lt;/FONT&gt;
    &lt;/TD&gt;
  &lt;/TR&gt;
  &lt;TR&gt;
    &lt;TD COLSPAN=8&gt;&amp;nbsp;
    &lt;/TD&gt;
  &lt;/TR&gt;
  &lt;TR&gt;
    &lt;TD COLSPAN=8&gt;
      &lt;FONT SIZE=4 FACE=ARIAL&gt;&lt;B&gt;SINGLE TURN&lt;/B&gt;&lt;/FONT&gt;
    &lt;/TD&gt;
  &lt;/TR&gt;
  &lt;TR&gt;
    &lt;TD ALIGN=CENTER&gt;
      &lt;FONT SIZE=3 FACE=ARIAL&gt;&lt;B&gt;BOURN&lt;/B&gt;&lt;/FONT&gt;
    &lt;/TD&gt;
    &lt;TD ALIGN=CENTER&gt;
      &lt;FONT SIZE=3 FACE=ARIAL&gt;&lt;B&gt;BI&amp;nbsp;TECH&lt;/B&gt;&lt;/FONT&gt;
    &lt;/TD&gt;
    &lt;TD ALIGN=CENTER&gt;
      &lt;FONT SIZE=3 FACE=ARIAL&gt;&lt;B&gt;DALE-VISHAY&lt;/B&gt;&lt;/FONT&gt;
    &lt;/TD&gt;
    &lt;TD ALIGN=CENTER&gt;
      &lt;FONT SIZE=3 FACE=ARIAL&gt;&lt;B&gt;PHILIPS/MEPCO&lt;/B&gt;&lt;/FONT&gt;
    &lt;/TD&gt;
    &lt;TD ALIGN=CENTER&gt;
      &lt;FONT SIZE=3 FACE=ARIAL&gt;&lt;B&gt;MURATA&lt;/B&gt;&lt;/FONT&gt;
    &lt;/TD&gt;
    &lt;TD ALIGN=CENTER&gt;
      &lt;FONT SIZE=3 FACE=ARIAL&gt;&lt;B&gt;PANASONIC&lt;/B&gt;&lt;/FONT&gt;
    &lt;/TD&gt;
    &lt;TD ALIGN=CENTER&gt;
      &lt;FONT SIZE=3 FACE=ARIAL&gt;&lt;B&gt;SPECTROL&lt;/B&gt;&lt;/FONT&gt;
    &lt;/TD&gt;
    &lt;TD ALIGN=CENTER&gt;
      &lt;FONT SIZE=3 FACE=ARIAL&gt;&lt;B&gt;MILSPEC&lt;/B&gt;&lt;/FONT&gt;
    &lt;/TD&gt;
  &lt;/TR&gt;
  &lt;TR&gt;
    &lt;TD BGCOLOR="#cccccc" ALIGN=CENTER&gt;&lt;FONT FACE=ARIAL SIZE=3&gt;
      3323P&lt;BR&gt;
      3323S&lt;BR&gt;
      3323W&lt;BR&gt;
      3329H&lt;BR&gt;
      3329P&lt;BR&gt;
      3329W&lt;BR&gt;
      3339H&lt;BR&gt;
      3339P&lt;BR&gt;
      3339W&lt;BR&gt;
      3352E&lt;BR&gt;
      3352H&lt;BR&gt;
      3352K&lt;BR&gt;
      3352P&lt;BR&gt;
      3352T&lt;BR&gt;
      3352V&lt;BR&gt;
      3352W&lt;BR&gt;
      3362H&lt;BR&gt;
      3362M&lt;BR&gt;
      3362P&lt;BR&gt;
      3362R&lt;BR&gt;
      3362S&lt;BR&gt;
      3362U&lt;BR&gt;
      3362W&lt;BR&gt;
      3362X&lt;BR&gt;
      3386B&lt;BR&gt;
      3386C&lt;BR&gt;
      3386F&lt;BR&gt;
      3386H&lt;BR&gt;
      3386K&lt;BR&gt;
      3386M&lt;BR&gt;
      3386P&lt;BR&gt;
      3386S&lt;BR&gt;
      3386W&lt;BR&gt;
      3386X&lt;BR&gt;&lt;/FONT&gt;
    &lt;/TD&gt;
    &lt;TD BGCOLOR="#cccccc" ALIGN=CENTER&gt;&lt;FONT FACE=ARIAL SIZE=3&gt;
      25P&lt;BR&gt;
      25S&lt;BR&gt;
      25RX&lt;BR&gt;
      82P&lt;BR&gt;
      82M&lt;BR&gt;
      82PA&lt;BR&gt;
      -&lt;BR&gt;
      -&lt;BR&gt;
      -&lt;BR&gt;
      91E&lt;BR&gt;
      91X&lt;BR&gt;
      91T&lt;BR&gt;
      91B&lt;BR&gt;
      91A&lt;BR&gt;
      91V&lt;BR&gt;
      91W&lt;BR&gt;
      25W&lt;BR&gt;
      25V&lt;BR&gt;
      25P&lt;BR&gt;
      -&lt;BR&gt;
      25S&lt;BR&gt;
      25U&lt;BR&gt;
      25RX&lt;BR&gt;
      25X&lt;BR&gt;
      72XW&lt;BR&gt;
      72XL&lt;BR&gt;
      72PM&lt;BR&gt;
      72RX&lt;BR&gt;
      -&lt;BR&gt;
      72PX&lt;BR&gt;
      72P&lt;BR&gt;
      72RXW&lt;BR&gt;
      72RXL&lt;BR&gt;
      72X&lt;BR&gt;&lt;/FONT&gt;
    &lt;/TD&gt;
    &lt;TD BGCOLOR="#cccccc" ALIGN=CENTER&gt;&lt;FONT FACE=ARIAL SIZE=3&gt;
      -&lt;BR&gt;
      -&lt;BR&gt;
      -&lt;BR&gt;
      T7YB&lt;BR&gt;
      T7YA&lt;BR&gt;
      -&lt;BR&gt;
      -&lt;BR&gt;
      -&lt;BR&gt;
      -&lt;BR&gt;
      -&lt;BR&gt;
      -&lt;BR&gt;
      -&lt;BR&gt;
      -&lt;BR&gt;
      -&lt;BR&gt;
      -&lt;BR&gt;
      -&lt;BR&gt;
      -&lt;BR&gt;
      TXD&lt;BR&gt;
      TYA&lt;BR&gt;
      TYP&lt;BR&gt;
      -&lt;BR&gt;
      TYD&lt;BR&gt;
      TX&lt;BR&gt;
      -&lt;BR&gt;
      150SX&lt;BR&gt;
      100SX&lt;BR&gt;
      102T&lt;BR&gt;
      101S&lt;BR&gt;
      190T&lt;BR&gt;
      150TX&lt;BR&gt;
      101&lt;BR&gt;
      -&lt;BR&gt;
      -&lt;BR&gt;
      101SX&lt;BR&gt;&lt;/FONT&gt;
    &lt;/TD&gt;
    &lt;TD BGCOLOR="#cccccc" ALIGN=CENTER&gt;&lt;FONT FACE=ARIAL SIZE=3&gt;
      ET6P&lt;BR&gt;
      ET6S&lt;BR&gt;
      ET6X&lt;BR&gt;
      RJ-6W/8014EMW&lt;BR&gt;
      RJ-6P/8014EMP&lt;BR&gt;
      RJ-6X/8014EMX&lt;BR&gt;
      TM7W&lt;BR&gt;
      TM7P&lt;BR&gt;
      TM7X&lt;BR&gt;
      -&lt;BR&gt;
      8017SMS&lt;BR&gt;
      -&lt;BR&gt;
      8017SMB&lt;BR&gt;
      8017SMA&lt;BR&gt;
      -&lt;BR&gt;
      -&lt;BR&gt;
      CT-6W&lt;BR&gt;
      CT-6H&lt;BR&gt;
      CT-6P&lt;BR&gt;
      CT-6R&lt;BR&gt;
      -&lt;BR&gt;
      CT-6V&lt;BR&gt;
      CT-6X&lt;BR&gt;
      -&lt;BR&gt;
      -&lt;BR&gt;
      8038EKV&lt;BR&gt;
      -&lt;BR&gt;
      8038EKX&lt;BR&gt;
      -&lt;BR&gt;
      -&lt;BR&gt;
      8038EKP&lt;BR&gt;
      8038EKZ&lt;BR&gt;
      8038EKW&lt;BR&gt;
      -&lt;BR&gt;&lt;/FONT&gt;
    &lt;/TD&gt;
    &lt;TD BGCOLOR="#cccccc" ALIGN=CENTER&gt;&lt;FONT FACE=ARIAL SIZE=3&gt;
      -&lt;BR&gt;
      -&lt;BR&gt;
      -&lt;BR&gt;
      3321H&lt;BR&gt;
      3321P&lt;BR&gt;
      3321N&lt;BR&gt;
      1102H&lt;BR&gt;
      1102P&lt;BR&gt;
      1102T&lt;BR&gt;
      RVA0911V304A&lt;BR&gt;
      -&lt;BR&gt;
      RVA0911H413A&lt;BR&gt;
      RVG0707V100A&lt;BR&gt;
      RVA0607V(H)306A&lt;BR&gt;
      RVA1214H213A&lt;BR&gt;
      -&lt;BR&gt;
      -&lt;BR&gt;
      -&lt;BR&gt;
      -&lt;BR&gt;
      -&lt;BR&gt;
      -&lt;BR&gt;
      -&lt;BR&gt;
      -&lt;BR&gt;
      -&lt;BR&gt;
      3104B&lt;BR&gt;
      3104C&lt;BR&gt;
      3104F&lt;BR&gt;
      3104H&lt;BR&gt;
      -&lt;BR&gt;
      3104M&lt;BR&gt;
      3104P&lt;BR&gt;
      3104S&lt;BR&gt;
      3104W&lt;BR&gt;
      3104X&lt;BR&gt;&lt;/FONT&gt;
    &lt;/TD&gt;
    &lt;TD BGCOLOR="#cccccc" ALIGN=CENTER&gt;&lt;FONT FACE=ARIAL SIZE=3&gt;
      EVMQ0G&lt;BR&gt;
      EVMQIG&lt;BR&gt;
      EVMQ3G&lt;BR&gt;
      EVMS0G&lt;BR&gt;
      EVMQ0G&lt;BR&gt;
      EVMG0G&lt;BR&gt;
      -&lt;BR&gt;
      -&lt;BR&gt;
      -&lt;BR&gt;
      EVMK4GA00B&lt;BR&gt;
      EVM30GA00B&lt;BR&gt;
      EVMK0GA00B&lt;BR&gt;
      EVM38GA00B&lt;BR&gt;
      EVMB6&lt;BR&gt;
      EVLQ0&lt;BR&gt;
      -&lt;BR&gt;
      EVMMSG&lt;BR&gt;
      EVMMBG&lt;BR&gt;
      EVMMAG&lt;BR&gt;
      -&lt;BR&gt;
      -&lt;BR&gt;
      EVMMCS&lt;BR&gt;
      -&lt;BR&gt;
      -&lt;BR&gt;
      -&lt;BR&gt;
      -&lt;BR&gt;
      -&lt;BR&gt;
      EVMM1&lt;BR&gt;
      -&lt;BR&gt;
      -&lt;BR&gt;
      EVMM0&lt;BR&gt;
      -&lt;BR&gt;
      -&lt;BR&gt;
      EVMM3&lt;BR&gt;&lt;/FONT&gt;
    &lt;/TD&gt;
    &lt;TD BGCOLOR="#cccccc" ALIGN=CENTER&gt;&lt;FONT FACE=ARIAL SIZE=3&gt;
      -&lt;BR&gt;
      -&lt;BR&gt;
      -&lt;BR&gt;
      62-3-1&lt;BR&gt;
      62-1-2&lt;BR&gt;
      -&lt;BR&gt;
      -&lt;BR&gt;
      -&lt;BR&gt;
      -&lt;BR&gt;
      -&lt;BR&gt;
      -&lt;BR&gt;
      -&lt;BR&gt;
      -&lt;BR&gt;
      -&lt;BR&gt;
      -&lt;BR&gt;
      -&lt;BR&gt;
      67R&lt;BR&gt;
      -&lt;BR&gt;
      67P&lt;BR&gt;
      -&lt;BR&gt;
      -&lt;BR&gt;
      -&lt;BR&gt;
      -&lt;BR&gt;
      67X&lt;BR&gt;
      63V&lt;BR&gt;
      63S&lt;BR&gt;
      63M&lt;BR&gt;
      -&lt;BR&gt;
      -&lt;BR&gt;
      63H&lt;BR&gt;
      63P&lt;BR&gt;
      -&lt;BR&gt;
      -&lt;BR&gt;
      63X&lt;BR&gt;&lt;/FONT&gt;
    &lt;/TD&gt;
    &lt;TD BGCOLOR="#cccccc" ALIGN=CENTER&gt;&lt;FONT FACE=ARIAL SIZE=3&gt;
      -&lt;BR&gt;
      -&lt;BR&gt;
      -&lt;BR&gt;
      RJ/RJR50&lt;BR&gt;
      RJ/RJR50&lt;BR&gt;
      RJ/RJR50&lt;BR&gt;
      -&lt;BR&gt;
      -&lt;BR&gt;
      -&lt;BR&gt;
      -&lt;BR&gt;
      -&lt;BR&gt;
      -&lt;BR&gt;
      -&lt;BR&gt;
      -&lt;BR&gt;
      -&lt;BR&gt;
      -&lt;BR&gt;
      -&lt;BR&gt;
      -&lt;BR&gt;
      -&lt;BR&gt;
      -&lt;BR&gt;
      -&lt;BR&gt;
      -&lt;BR&gt;
      -&lt;BR&gt;
      -&lt;BR&gt;
      -&lt;BR&gt;
      -&lt;BR&gt;
      -&lt;BR&gt;
      -&lt;BR&gt;
      -&lt;BR&gt;
      -&lt;BR&gt;
      -&lt;BR&gt;
      -&lt;BR&gt;
      -&lt;BR&gt;
      -&lt;BR&gt;&lt;/FONT&gt;
    &lt;/TD&gt;
  &lt;/TR&gt;
&lt;/TABLE&gt;
&lt;P&gt;&amp;nbsp;&lt;P&gt;
&lt;TABLE BORDER=0 CELLSPACING=1 CELLPADDING=3&gt;
  &lt;TR&gt;
    &lt;TD COLSPAN=7&gt;
      &lt;FONT color="#0000FF" SIZE=4 FACE=ARIAL&gt;&lt;B&gt;SMD TRIM-POT CROSS REFERENCE&lt;/B&gt;&lt;/FONT&gt;
      &lt;P&gt;
      &lt;FONT SIZE=4 FACE=ARIAL&gt;&lt;B&gt;MULTI-TURN&lt;/B&gt;&lt;/FONT&gt;
    &lt;/TD&gt;
  &lt;/TR&gt;
  &lt;TR&gt;
    &lt;TD&gt;
      &lt;FONT SIZE=3 FACE=ARIAL&gt;&lt;B&gt;BOURNS&lt;/B&gt;&lt;/FONT&gt;
    &lt;/TD&gt;
    &lt;TD&gt;
      &lt;FONT SIZE=3 FACE=ARIAL&gt;&lt;B&gt;BI&amp;nbsp;TECH&lt;/B&gt;&lt;/FONT&gt;
    &lt;/TD&gt;
    &lt;TD&gt;
      &lt;FONT SIZE=3 FACE=ARIAL&gt;&lt;B&gt;DALE-VISHAY&lt;/B&gt;&lt;/FONT&gt;
    &lt;/TD&gt;
    &lt;TD&gt;
      &lt;FONT SIZE=3 FACE=ARIAL&gt;&lt;B&gt;PHILIPS/MEPCO&lt;/B&gt;&lt;/FONT&gt;
    &lt;/TD&gt;
    &lt;TD&gt;
      &lt;FONT SIZE=3 FACE=ARIAL&gt;&lt;B&gt;PANASONIC&lt;/B&gt;&lt;/FONT&gt;
    &lt;/TD&gt;
    &lt;TD&gt;
      &lt;FONT SIZE=3 FACE=ARIAL&gt;&lt;B&gt;TOCOS&lt;/B&gt;&lt;/FONT&gt;
    &lt;/TD&gt;
    &lt;TD&gt;
      &lt;FONT SIZE=3 FACE=ARIAL&gt;&lt;B&gt;AUX/KYOCERA&lt;/B&gt;&lt;/FONT&gt;
    &lt;/TD&gt;
  &lt;/TR&gt;
  &lt;TR&gt;
    &lt;TD BGCOLOR="#cccccc" ALIGN=CENTER&gt;&lt;FONT FACE=ARIAL SIZE=3&gt;
      3224G&lt;BR&gt;
      3224J&lt;BR&gt;
      3224W&lt;BR&gt;
      3269P&lt;BR&gt;
      3269W&lt;BR&gt;
      3269X&lt;BR&gt;&lt;/FONT&gt;
    &lt;/TD&gt;
    &lt;TD BGCOLOR="#cccccc" ALIGN=CENTER&gt;&lt;FONT FACE=ARIAL SIZE=3&gt;
      44G&lt;BR&gt;
      44J&lt;BR&gt;
      44W&lt;BR&gt;
      84P&lt;BR&gt;
      84W&lt;BR&gt;
      84X&lt;BR&gt;&lt;/FONT&gt;
    &lt;/TD&gt;
    &lt;TD BGCOLOR="#cccccc" ALIGN=CENTER&gt;&lt;FONT FACE=ARIAL SIZE=3&gt;
      -&lt;BR&gt;
      -&lt;BR&gt;
      -&lt;BR&gt;
      ST63Z&lt;BR&gt;
      ST63Y&lt;BR&gt;
      -&lt;BR&gt;&lt;/FONT&gt;
    &lt;/TD&gt;
    &lt;TD BGCOLOR="#cccccc" ALIGN=CENTER&gt;&lt;FONT FACE=ARIAL SIZE=3&gt;
      -&lt;BR&gt;
      -&lt;BR&gt;
      -&lt;BR&gt;
      ST5P&lt;BR&gt;
      ST5W&lt;BR&gt;
      ST5X&lt;BR&gt;&lt;/FONT&gt;
    &lt;/TD&gt;
    &lt;TD BGCOLOR="#cccccc" ALIGN=CENTER&gt;&lt;FONT FACE=ARIAL SIZE=3&gt;
      -&lt;BR&gt;
      -&lt;BR&gt;
      -&lt;BR&gt;
      -&lt;BR&gt;
      -&lt;BR&gt;
      -&lt;BR&gt;&lt;/FONT&gt;
    &lt;/TD&gt;
    &lt;TD BGCOLOR="#cccccc" ALIGN=CENTER&gt;&lt;FONT FACE=ARIAL SIZE=3&gt;
      -&lt;BR&gt;
      -&lt;BR&gt;
      -&lt;BR&gt;
      -&lt;BR&gt;
      -&lt;BR&gt;
      -&lt;BR&gt;&lt;/FONT&gt;
    &lt;/TD&gt;
    &lt;TD BGCOLOR="#cccccc" ALIGN=CENTER&gt;&lt;FONT FACE=ARIAL SIZE=3&gt;
      -&lt;BR&gt;
      -&lt;BR&gt;
      -&lt;BR&gt;
      -&lt;BR&gt;
      -&lt;BR&gt;
      -&lt;BR&gt;&lt;/FONT&gt;
    &lt;/TD&gt;
  &lt;/TR&gt;
  &lt;TR&gt;
    &lt;TD COLSPAN=7&gt;&amp;nbsp;
    &lt;/TD&gt;
  &lt;/TR&gt;
  &lt;TR&gt;
    &lt;TD COLSPAN=7&gt;
      &lt;FONT SIZE=4 FACE=ARIAL&gt;&lt;B&gt;SINGLE TURN&lt;/B&gt;&lt;/FONT&gt;
    &lt;/TD&gt;
  &lt;/TR&gt;
  &lt;TR&gt;
    &lt;TD&gt;
      &lt;FONT SIZE=3 FACE=ARIAL&gt;&lt;B&gt;BOURNS&lt;/B&gt;&lt;/FONT&gt;
    &lt;/TD&gt;
    &lt;TD&gt;
      &lt;FONT SIZE=3 FACE=ARIAL&gt;&lt;B&gt;BI&amp;nbsp;TECH&lt;/B&gt;&lt;/FONT&gt;
    &lt;/TD&gt;
    &lt;TD&gt;
      &lt;FONT SIZE=3 FACE=ARIAL&gt;&lt;B&gt;DALE-VISHAY&lt;/B&gt;&lt;/FONT&gt;
    &lt;/TD&gt;
    &lt;TD&gt;
      &lt;FONT SIZE=3 FACE=ARIAL&gt;&lt;B&gt;PHILIPS/MEPCO&lt;/B&gt;&lt;/FONT&gt;
    &lt;/TD&gt;
    &lt;TD&gt;
      &lt;FONT SIZE=3 FACE=ARIAL&gt;&lt;B&gt;PANASONIC&lt;/B&gt;&lt;/FONT&gt;
    &lt;/TD&gt;
    &lt;TD&gt;
      &lt;FONT SIZE=3 FACE=ARIAL&gt;&lt;B&gt;TOCOS&lt;/B&gt;&lt;/FONT&gt;
    &lt;/TD&gt;
    &lt;TD&gt;
      &lt;FONT SIZE=3 FACE=ARIAL&gt;&lt;B&gt;AUX/KYOCERA&lt;/B&gt;&lt;/FONT&gt;
    &lt;/TD&gt;
  &lt;/TR&gt;
  &lt;TR&gt;
    &lt;TD BGCOLOR="#cccccc" ALIGN=CENTER&gt;&lt;FONT FACE=ARIAL SIZE=3&gt;
      3314G&lt;BR&gt;
      3314J&lt;BR&gt;
      3364A/B&lt;BR&gt;
      3364C/D&lt;BR&gt;
      3364W/X&lt;BR&gt;
      3313G&lt;BR&gt;
      3313J&lt;BR&gt;&lt;/FONT&gt;
    &lt;/TD&gt;
    &lt;TD BGCOLOR="#cccccc" ALIGN=CENTER&gt;&lt;FONT FACE=ARIAL SIZE=3&gt;
      23B&lt;BR&gt;
      23A&lt;BR&gt;
      21X&lt;BR&gt;
      21W&lt;BR&gt;
      -&lt;BR&gt;
      22B&lt;BR&gt;
      22A&lt;BR&gt;&lt;/FONT&gt;
    &lt;/TD&gt;
    &lt;TD BGCOLOR="#cccccc" ALIGN=CENTER&gt;&lt;FONT FACE=ARIAL SIZE=3&gt;
      ST5YL/ST53YL&lt;BR&gt;
      ST5YJ/5T53YJ&lt;BR&gt;
      ST-23A&lt;BR&gt;
      ST-22B&lt;BR&gt;
      ST-22&lt;BR&gt;
      -&lt;BR&gt;
      -&lt;BR&gt;&lt;/FONT&gt;
    &lt;/TD&gt;
    &lt;TD BGCOLOR="#cccccc" ALIGN=CENTER&gt;&lt;FONT FACE=ARIAL SIZE=3&gt;
      ST-4B&lt;BR&gt;
      ST-4A&lt;BR&gt;
      -&lt;BR&gt;
      -&lt;BR&gt;
      -&lt;BR&gt;
      ST-3B&lt;BR&gt;
      ST-3A&lt;BR&gt;&lt;/FONT&gt;
    &lt;/TD&gt;
    &lt;TD BGCOLOR="#cccccc" ALIGN=CENTER&gt;&lt;FONT FACE=ARIAL SIZE=3&gt;
      -&lt;BR&gt;
      EVM-6YS&lt;BR&gt;
      EVM-1E&lt;BR&gt;
      EVM-1G&lt;BR&gt;
      EVM-1D&lt;BR&gt;
      -&lt;BR&gt;
      -&lt;BR&gt;&lt;/FONT&gt;
    &lt;/TD&gt;
    &lt;TD BGCOLOR="#cccccc" ALIGN=CENTER&gt;&lt;FONT FACE=ARIAL SIZE=3&gt;
      G4B&lt;BR&gt;
      G4A&lt;BR&gt;
      TR04-3S1&lt;BR&gt;
      TRG04-2S1&lt;BR&gt;
      -&lt;BR&gt;
      -&lt;BR&gt;
      -&lt;BR&gt;&lt;/FONT&gt;
    &lt;/TD&gt;
    &lt;TD BGCOLOR="#cccccc" ALIGN=CENTER&gt;&lt;FONT FACE=ARIAL SIZE=3&gt;
      -&lt;BR&gt;
      -&lt;BR&gt;
      DVR-43A&lt;BR&gt;
      CVR-42C&lt;BR&gt;
      CVR-42A/C&lt;BR&gt;
      -&lt;BR&gt;
      -&lt;BR&gt;&lt;/FONT&gt;
    &lt;/TD&gt;
  &lt;/TR&gt;
&lt;/TABLE&gt;
&lt;P&gt;
&lt;FONT SIZE=4 FACE=ARIAL&gt;&lt;B&gt;ALT =&amp;nbsp;ALTERNATE&lt;/B&gt;&lt;/FONT&gt;
&lt;P&gt;

&amp;nbsp;
&lt;P&gt;
&lt;/td&gt;
&lt;/tr&gt;
&lt;/table&gt;</description>
<packages>
<package name="R0603">
<description>&lt;b&gt;RESISTOR&lt;/b&gt;</description>
<wire x1="-0.432" y1="-0.356" x2="0.432" y2="-0.356" width="0.1524" layer="51"/>
<wire x1="0.432" y1="0.356" x2="-0.432" y2="0.356" width="0.1524" layer="51"/>
<wire x1="-1.473" y1="0.983" x2="1.473" y2="0.983" width="0.0508" layer="39"/>
<wire x1="1.473" y1="0.983" x2="1.473" y2="-0.983" width="0.0508" layer="39"/>
<wire x1="1.473" y1="-0.983" x2="-1.473" y2="-0.983" width="0.0508" layer="39"/>
<wire x1="-1.473" y1="-0.983" x2="-1.473" y2="0.983" width="0.0508" layer="39"/>
<smd name="1" x="-0.85" y="0" dx="1" dy="1.1" layer="1"/>
<smd name="2" x="0.85" y="0" dx="1" dy="1.1" layer="1"/>
<text x="-0.635" y="0.635" size="1.27" layer="25">&gt;NAME</text>
<text x="-0.635" y="-1.905" size="1.27" layer="27">&gt;VALUE</text>
<rectangle x1="0.4318" y1="-0.4318" x2="0.8382" y2="0.4318" layer="51"/>
<rectangle x1="-0.8382" y1="-0.4318" x2="-0.4318" y2="0.4318" layer="51"/>
<rectangle x1="-0.1999" y1="-0.4001" x2="0.1999" y2="0.4001" layer="35"/>
</package>
<package name="C0603K">
<description>&lt;b&gt;Ceramic Chip Capacitor KEMET 0603 reflow solder&lt;/b&gt;&lt;p&gt;
Metric Code Size 1608</description>
<wire x1="-0.725" y1="0.35" x2="0.725" y2="0.35" width="0.1016" layer="51"/>
<wire x1="0.725" y1="-0.35" x2="-0.725" y2="-0.35" width="0.1016" layer="51"/>
<smd name="1" x="-0.875" y="0" dx="1.05" dy="1.08" layer="1"/>
<smd name="2" x="0.875" y="0" dx="1.05" dy="1.08" layer="1"/>
<text x="-0.8" y="0.65" size="1.016" layer="25">&gt;NAME</text>
<text x="-0.8" y="-1.65" size="1.016" layer="27">&gt;VALUE</text>
<rectangle x1="-0.8" y1="-0.4" x2="-0.45" y2="0.4" layer="51"/>
<rectangle x1="0.45" y1="-0.4" x2="0.8" y2="0.4" layer="51"/>
</package>
</packages>
</library>
<library name="_miniRoboter">
<packages>
<package name="2X3PINHEADSIDEWAYSSMD">
<smd name="1" x="0" y="0" dx="3.81" dy="1.9304" layer="1"/>
<smd name="3" x="0" y="-2.54" dx="3.81" dy="1.9304" layer="1"/>
<smd name="5" x="0" y="-5.08" dx="3.81" dy="1.9304" layer="1"/>
<smd name="2" x="0" y="0" dx="3.81" dy="1.9304" layer="16" rot="R180"/>
<smd name="4" x="0" y="-2.54" dx="3.81" dy="1.9304" layer="16" rot="R180"/>
<smd name="6" x="0" y="-5.08" dx="3.81" dy="1.9304" layer="16" rot="R180"/>
<wire x1="2.54" y1="2.54" x2="2.54" y2="-7.62" width="0.127" layer="21"/>
<wire x1="2.54" y1="-7.62" x2="-3.81" y2="-7.62" width="0.127" layer="21"/>
<wire x1="-3.81" y1="-7.62" x2="-5.08" y2="-7.62" width="0.127" layer="21"/>
<wire x1="-5.08" y1="-7.62" x2="-5.08" y2="-5.08" width="0.127" layer="21"/>
<wire x1="-5.08" y1="-5.08" x2="-5.08" y2="-2.54" width="0.127" layer="21"/>
<wire x1="-5.08" y1="-2.54" x2="-5.08" y2="0" width="0.127" layer="21"/>
<wire x1="-5.08" y1="0" x2="-5.08" y2="2.54" width="0.127" layer="21"/>
<wire x1="-5.08" y1="2.54" x2="-3.81" y2="2.54" width="0.127" layer="21"/>
<wire x1="-3.81" y1="2.54" x2="2.54" y2="2.54" width="0.127" layer="21"/>
<wire x1="-3.81" y1="2.54" x2="-3.81" y2="-5.08" width="0.127" layer="21"/>
<rectangle x1="-5.08" y1="-7.62" x2="-3.81" y2="2.54" layer="21"/>
<wire x1="-3.81" y1="-5.08" x2="-3.81" y2="-7.62" width="0.127" layer="21"/>
<wire x1="-5.08" y1="0" x2="-8.89" y2="0" width="0.6096" layer="21"/>
<wire x1="-5.08" y1="-2.54" x2="-8.89" y2="-2.54" width="0.6096" layer="21"/>
<wire x1="-5.08" y1="-5.08" x2="-8.89" y2="-5.08" width="0.6096" layer="21"/>
<wire x1="-3.81" y1="-5.08" x2="-2.54" y2="-5.08" width="0.6096" layer="21"/>
<wire x1="-5.08" y1="-2.54" x2="-2.54" y2="-2.54" width="0.6096" layer="21"/>
<wire x1="-5.08" y1="0" x2="-2.54" y2="0" width="0.6096" layer="21"/>
<circle x="2.54" y="1.778" radius="0.359209375" width="0.6096" layer="21"/>
</package>
</packages>
</library>
</libraries>
<attributes>
</attributes>
<variantdefs>
</variantdefs>
<classes>
<class number="0" name="default" width="0" drill="0">
</class>
</classes>
<designrules name="dirt_cheap_dirty_boards.v1 *">
<description language="en">&lt;b&gt;Dirty Cheap Dirty Board Design Rules&lt;/b&gt;
&lt;br&gt;
&lt;br&gt;Min width/Spacing: 5/5mil
&lt;br&gt;Min diameter of finished hole 12mil</description>
<param name="layerSetup" value="(1*16)"/>
<param name="mtCopper" value="0.035mm 0.0175mm 0.035mm 0.035mm 0.035mm 0.035mm 0.035mm 0.035mm 0.035mm 0.035mm 0.035mm 0.035mm 0.035mm 0.035mm 0.0175mm 0.035mm"/>
<param name="mtIsolate" value="1.5mm 1.1mm 0.2mm 0.15mm 0.2mm 0.15mm 0.2mm 0.15mm 0.2mm 0.15mm 0.2mm 0.15mm 0.2mm 0.15mm 0.2mm"/>
<param name="mdWireWire" value="8mil"/>
<param name="mdWirePad" value="8mil"/>
<param name="mdWireVia" value="5mil"/>
<param name="mdPadPad" value="5mil"/>
<param name="mdPadVia" value="5mil"/>
<param name="mdViaVia" value="5mil"/>
<param name="mdSmdPad" value="0mil"/>
<param name="mdSmdVia" value="0mil"/>
<param name="mdSmdSmd" value="0mil"/>
<param name="mdViaViaSameLayer" value="8mil"/>
<param name="mnLayersViaInSmd" value="2"/>
<param name="mdCopperDimension" value="1mil"/>
<param name="mdDrill" value="10mil"/>
<param name="mdSmdStop" value="0mil"/>
<param name="msWidth" value="5mil"/>
<param name="msDrill" value="12mil"/>
<param name="msMicroVia" value="12mil"/>
<param name="msBlindViaRatio" value="0.5"/>
<param name="rvPadTop" value="0.25"/>
<param name="rvPadInner" value="0.25"/>
<param name="rvPadBottom" value="0.25"/>
<param name="rvViaOuter" value="0.25"/>
<param name="rvViaInner" value="0.25"/>
<param name="rvMicroViaOuter" value="0.25"/>
<param name="rvMicroViaInner" value="0.25"/>
<param name="rlMinPadTop" value="10mil"/>
<param name="rlMaxPadTop" value="20mil"/>
<param name="rlMinPadInner" value="10mil"/>
<param name="rlMaxPadInner" value="20mil"/>
<param name="rlMinPadBottom" value="10mil"/>
<param name="rlMaxPadBottom" value="20mil"/>
<param name="rlMinViaOuter" value="6mil"/>
<param name="rlMaxViaOuter" value="20mil"/>
<param name="rlMinViaInner" value="6mil"/>
<param name="rlMaxViaInner" value="20mil"/>
<param name="rlMinMicroViaOuter" value="4mil"/>
<param name="rlMaxMicroViaOuter" value="20mil"/>
<param name="rlMinMicroViaInner" value="4mil"/>
<param name="rlMaxMicroViaInner" value="20mil"/>
<param name="psTop" value="-1"/>
<param name="psBottom" value="-1"/>
<param name="psFirst" value="0"/>
<param name="psElongationLong" value="100"/>
<param name="psElongationOffset" value="100"/>
<param name="mvStopFrame" value="1"/>
<param name="mvCreamFrame" value="0"/>
<param name="mlMinStopFrame" value="2mil"/>
<param name="mlMaxStopFrame" value="2mil"/>
<param name="mlMinCreamFrame" value="0mil"/>
<param name="mlMaxCreamFrame" value="0mil"/>
<param name="mlViaStopLimit" value="25mil"/>
<param name="srRoundness" value="0"/>
<param name="srMinRoundness" value="0mil"/>
<param name="srMaxRoundness" value="0mil"/>
<param name="slThermalIsolate" value="10mil"/>
<param name="slThermalsForVias" value="0"/>
<param name="dpMaxLengthDifference" value="10mm"/>
<param name="dpGapFactor" value="2.5"/>
<param name="checkGrid" value="0"/>
<param name="checkAngle" value="0"/>
<param name="checkFont" value="1"/>
<param name="checkRestrict" value="0"/>
<param name="useDiameter" value="13"/>
<param name="maxErrors" value="50"/>
</designrules>
<autorouter>
<pass name="Default">
<param name="RoutingGrid" value="50mil"/>
<param name="AutoGrid" value="1"/>
<param name="Efforts" value="0"/>
<param name="TopRouterVariant" value="1"/>
<param name="tpViaShape" value="round"/>
<param name="PrefDir.1" value="a"/>
<param name="PrefDir.2" value="0"/>
<param name="PrefDir.3" value="0"/>
<param name="PrefDir.4" value="0"/>
<param name="PrefDir.5" value="0"/>
<param name="PrefDir.6" value="0"/>
<param name="PrefDir.7" value="0"/>
<param name="PrefDir.8" value="0"/>
<param name="PrefDir.9" value="0"/>
<param name="PrefDir.10" value="0"/>
<param name="PrefDir.11" value="0"/>
<param name="PrefDir.12" value="0"/>
<param name="PrefDir.13" value="0"/>
<param name="PrefDir.14" value="0"/>
<param name="PrefDir.15" value="0"/>
<param name="PrefDir.16" value="a"/>
<param name="cfVia" value="8"/>
<param name="cfNonPref" value="5"/>
<param name="cfChangeDir" value="2"/>
<param name="cfOrthStep" value="2"/>
<param name="cfDiagStep" value="3"/>
<param name="cfExtdStep" value="0"/>
<param name="cfBonusStep" value="1"/>
<param name="cfMalusStep" value="1"/>
<param name="cfPadImpact" value="4"/>
<param name="cfSmdImpact" value="4"/>
<param name="cfBusImpact" value="0"/>
<param name="cfHugging" value="3"/>
<param name="cfAvoid" value="4"/>
<param name="cfPolygon" value="10"/>
<param name="cfBase.1" value="0"/>
<param name="cfBase.2" value="1"/>
<param name="cfBase.3" value="1"/>
<param name="cfBase.4" value="1"/>
<param name="cfBase.5" value="1"/>
<param name="cfBase.6" value="1"/>
<param name="cfBase.7" value="1"/>
<param name="cfBase.8" value="1"/>
<param name="cfBase.9" value="1"/>
<param name="cfBase.10" value="1"/>
<param name="cfBase.11" value="1"/>
<param name="cfBase.12" value="1"/>
<param name="cfBase.13" value="1"/>
<param name="cfBase.14" value="1"/>
<param name="cfBase.15" value="1"/>
<param name="cfBase.16" value="0"/>
<param name="mnVias" value="20"/>
<param name="mnSegments" value="9999"/>
<param name="mnExtdSteps" value="9999"/>
<param name="mnRipupLevel" value="10"/>
<param name="mnRipupSteps" value="100"/>
<param name="mnRipupTotal" value="100"/>
</pass>
<pass name="Follow-me" refer="Default" active="yes">
</pass>
<pass name="Busses" refer="Default" active="yes">
<param name="cfNonPref" value="4"/>
<param name="cfBusImpact" value="4"/>
<param name="cfHugging" value="0"/>
<param name="mnVias" value="0"/>
</pass>
<pass name="Route" refer="Default" active="yes">
</pass>
<pass name="Optimize1" refer="Default" active="yes">
<param name="cfVia" value="99"/>
<param name="cfExtdStep" value="10"/>
<param name="cfHugging" value="1"/>
<param name="mnExtdSteps" value="1"/>
<param name="mnRipupLevel" value="0"/>
</pass>
<pass name="Optimize2" refer="Optimize1" active="yes">
<param name="cfNonPref" value="0"/>
<param name="cfChangeDir" value="6"/>
<param name="cfExtdStep" value="0"/>
<param name="cfBonusStep" value="2"/>
<param name="cfMalusStep" value="2"/>
<param name="cfPadImpact" value="2"/>
<param name="cfSmdImpact" value="2"/>
<param name="cfHugging" value="0"/>
</pass>
<pass name="Optimize3" refer="Optimize2" active="yes">
<param name="cfChangeDir" value="8"/>
<param name="cfPadImpact" value="0"/>
<param name="cfSmdImpact" value="0"/>
</pass>
<pass name="Optimize4" refer="Optimize3" active="yes">
<param name="cfChangeDir" value="25"/>
</pass>
</autorouter>
<elements>
<element name="IC1" library="74xx-eu" package="SO16" value="74HC595" x="6.985" y="15.24" smashed="yes" rot="MR0">
<attribute name="VALUE" x="9.8425" y="14.478" size="0.8128" layer="26" ratio="10" rot="MR0"/>
</element>
<element name="LED1" library="display-kingbright" package="SA56-11" value="7-SEG" x="6.985" y="13.335" smashed="yes">
<attribute name="OC_NEWARK" value="unknown" x="6.985" y="13.335" size="1.778" layer="27" display="off"/>
<attribute name="MPN" value="" x="6.985" y="13.335" size="1.778" layer="27" display="off"/>
<attribute name="MF" value="" x="6.985" y="13.335" size="1.778" layer="27" display="off"/>
<attribute name="OC_FARNELL" value="unknown" x="6.985" y="13.335" size="1.778" layer="27" display="off"/>
</element>
<element name="R1" library="rcl" package="R0603" value="" x="10.31875" y="18.0975" smashed="yes" rot="R90">
<attribute name="VALUE" x="12.22375" y="17.4625" size="1.27" layer="27" rot="R90"/>
</element>
<element name="R2" library="rcl" package="R0603" value="" x="12.3825" y="18.0975" smashed="yes" rot="R90">
<attribute name="VALUE" x="14.2875" y="17.4625" size="1.27" layer="27" rot="R90"/>
</element>
<element name="R3" library="rcl" package="R0603" value="" x="9.525" y="8.89" smashed="yes" rot="MR270">
<attribute name="VALUE" x="11.43" y="9.525" size="1.27" layer="28" rot="MR270"/>
</element>
<element name="R4" library="rcl" package="R0603" value="" x="4.1275" y="8.5725" smashed="yes" rot="MR270">
<attribute name="VALUE" x="6.0325" y="9.2075" size="1.27" layer="28" rot="MR270"/>
</element>
<element name="R5" library="rcl" package="R0603" value="" x="1.905" y="8.5725" smashed="yes" rot="MR270">
<attribute name="VALUE" x="3.81" y="9.2075" size="1.27" layer="28" rot="MR270"/>
</element>
<element name="R6" library="rcl" package="R0603" value="" x="4.445" y="18.0975" smashed="yes" rot="R90">
<attribute name="VALUE" x="6.35" y="17.4625" size="1.27" layer="27" rot="R90"/>
</element>
<element name="R7" library="rcl" package="R0603" value="" x="1.905" y="18.0975" smashed="yes" rot="R90">
<attribute name="VALUE" x="3.81" y="17.4625" size="1.27" layer="27" rot="R90"/>
</element>
<element name="R8" library="rcl" package="R0603" value="" x="12.065" y="8.89" smashed="yes" rot="MR270">
<attribute name="VALUE" x="13.97" y="9.525" size="1.27" layer="28" rot="MR270"/>
</element>
<element name="U$1" library="_miniRoboter" package="2X3PINHEADSIDEWAYSSMD" value="ISP-SMD-SIDE" x="9.525" y="1.27" rot="MR90"/>
<element name="C1" library="rcl" package="C0603K" value="" x="11.7475" y="1.905" smashed="yes" rot="R90">
<attribute name="VALUE" x="13.3975" y="1.105" size="1.016" layer="27" rot="R90"/>
</element>
<element name="R9" library="rcl" package="R0603" value="" x="8.255" y="18.0975" smashed="yes" rot="R270">
<attribute name="VALUE" x="6.35" y="18.7325" size="1.27" layer="27" rot="R270"/>
</element>
</elements>
<signals>
<signal name="N$1">
<contactref element="IC1" pad="15"/>
<contactref element="R1" pad="1"/>
<wire x1="10.31875" y1="17.2475" x2="10.31875" y2="16.35125" width="0.4064" layer="1"/>
<wire x1="10.31875" y1="16.35125" x2="10.795" y2="15.875" width="0.4064" layer="1"/>
<via x="10.795" y="15.875" extent="1-16" drill="0.3302"/>
<wire x1="10.16" y1="18.3134" x2="10.16" y2="16.51" width="0.4064" layer="16"/>
<wire x1="10.16" y1="16.51" x2="10.795" y2="15.875" width="0.4064" layer="16"/>
</signal>
<signal name="N$2">
<contactref element="IC1" pad="1"/>
<contactref element="R2" pad="1"/>
<via x="12.065" y="12.3825" extent="1-16" drill="0.3302"/>
<wire x1="12.065" y1="12.3825" x2="11.6459" y2="12.3825" width="0.4064" layer="16"/>
<wire x1="11.6459" y1="12.3825" x2="11.43" y2="12.1666" width="0.4064" layer="16"/>
<wire x1="12.3825" y1="17.2475" x2="12.85875" y2="16.77125" width="0.4064" layer="1"/>
<wire x1="12.85875" y1="16.77125" x2="12.85875" y2="15.39875" width="0.4064" layer="1"/>
<wire x1="12.85875" y1="15.39875" x2="12.065" y2="14.605" width="0.4064" layer="1"/>
<wire x1="12.065" y1="14.605" x2="12.065" y2="12.3825" width="0.4064" layer="1"/>
</signal>
<signal name="N$3">
<contactref element="IC1" pad="2"/>
<contactref element="R3" pad="1"/>
<wire x1="10.16" y1="12.1666" x2="10.16" y2="10.375" width="0.4064" layer="16"/>
<wire x1="10.16" y1="10.375" x2="9.525" y2="9.74" width="0.4064" layer="16"/>
</signal>
<signal name="N$4">
<contactref element="IC1" pad="3"/>
<contactref element="R4" pad="1"/>
<wire x1="4.1275" y1="9.4225" x2="6.8825" y2="9.4225" width="0.4064" layer="16"/>
<wire x1="6.8825" y1="9.4225" x2="8.89" y2="11.43" width="0.4064" layer="16"/>
<wire x1="8.89" y1="11.43" x2="8.89" y2="12.1666" width="0.4064" layer="16"/>
<wire x1="8.89" y1="12.7" x2="8.89" y2="12.1666" width="0.4064" layer="16"/>
</signal>
<signal name="N$5">
<contactref element="IC1" pad="4"/>
<contactref element="R5" pad="1"/>
<wire x1="7.62" y1="12.1666" x2="7.62" y2="11.43" width="0.4064" layer="16"/>
<wire x1="7.62" y1="11.43" x2="6.6675" y2="10.4775" width="0.4064" layer="16"/>
<wire x1="6.6675" y1="10.4775" x2="2.96" y2="10.4775" width="0.4064" layer="16"/>
<wire x1="2.96" y1="10.4775" x2="1.905" y2="9.4225" width="0.4064" layer="16"/>
</signal>
<signal name="N$6">
<contactref element="IC1" pad="5"/>
<contactref element="R6" pad="1"/>
<wire x1="4.445" y1="17.2475" x2="4.445" y2="15.875" width="0.4064" layer="1"/>
<via x="4.445" y="15.875" extent="1-16" drill="0.3302"/>
<wire x1="6.35" y1="12.1666" x2="6.35" y2="13.0175" width="0.4064" layer="16"/>
<wire x1="6.35" y1="13.0175" x2="5.715" y2="13.6525" width="0.4064" layer="16"/>
<wire x1="5.715" y1="13.6525" x2="5.715" y2="14.605" width="0.4064" layer="16"/>
<wire x1="5.715" y1="14.605" x2="4.445" y2="15.875" width="0.4064" layer="16"/>
</signal>
<signal name="N$7">
<contactref element="IC1" pad="6"/>
<contactref element="R7" pad="1"/>
<wire x1="1.905" y1="17.2475" x2="1.8025" y2="17.2475" width="0.4064" layer="1"/>
<wire x1="1.8025" y1="17.2475" x2="3.175" y2="15.875" width="0.4064" layer="1"/>
<via x="3.175" y="15.875" extent="1-16" drill="0.3302"/>
<wire x1="3.175" y1="15.875" x2="5.08" y2="13.97" width="0.4064" layer="16"/>
<wire x1="5.08" y1="13.97" x2="5.08" y2="12.1666" width="0.4064" layer="16"/>
</signal>
<signal name="N$8">
<contactref element="IC1" pad="7"/>
<contactref element="R8" pad="1"/>
<wire x1="12.065" y1="9.74" x2="12.065" y2="9.8425" width="0.4064" layer="16"/>
<wire x1="12.065" y1="9.8425" x2="13.0175" y2="10.795" width="0.4064" layer="16"/>
<wire x1="13.0175" y1="10.795" x2="13.0175" y2="12.7" width="0.4064" layer="16"/>
<wire x1="13.0175" y1="12.7" x2="11.7475" y2="13.97" width="0.4064" layer="16"/>
<wire x1="11.7475" y1="13.97" x2="6.6675" y2="13.97" width="0.4064" layer="16"/>
<via x="6.6675" y="13.97" extent="1-16" drill="0.3302"/>
<wire x1="6.6675" y1="13.97" x2="3.81" y2="13.97" width="0.4064" layer="1"/>
<via x="3.81" y="13.97" extent="1-16" drill="0.3302"/>
<wire x1="3.81" y1="13.97" x2="3.81" y2="12.1666" width="0.4064" layer="16"/>
</signal>
<signal name="N$9">
<contactref element="R1" pad="2"/>
<contactref element="LED1" pad="7"/>
<wire x1="10.31875" y1="18.9475" x2="10.16" y2="19.265" width="0.4064" layer="1"/>
<wire x1="10.16" y1="19.265" x2="10.16" y2="19.685" width="0.4064" layer="1"/>
<wire x1="10.16" y1="19.685" x2="9.525" y2="20.32" width="0.4064" layer="1"/>
<wire x1="9.525" y1="20.32" x2="9.525" y2="20.955" width="0.4064" layer="1"/>
</signal>
<signal name="N$10">
<contactref element="R2" pad="2"/>
<contactref element="LED1" pad="6"/>
<wire x1="12.3825" y1="18.9475" x2="12.3825" y2="20.0025" width="0.4064" layer="1"/>
<wire x1="12.3825" y1="20.0025" x2="12.065" y2="20.32" width="0.4064" layer="1"/>
<wire x1="12.065" y1="20.32" x2="12.065" y2="20.955" width="0.4064" layer="1"/>
</signal>
<signal name="N$11">
<contactref element="R3" pad="2"/>
<contactref element="LED1" pad="4"/>
<wire x1="9.525" y1="8.04" x2="9.525" y2="5.715" width="0.4064" layer="16"/>
</signal>
<signal name="N$12">
<contactref element="R4" pad="2"/>
<contactref element="LED1" pad="2"/>
<wire x1="4.445" y1="5.715" x2="4.445" y2="7.405" width="0.4064" layer="16"/>
<wire x1="4.445" y1="7.405" x2="4.1275" y2="7.7225" width="0.4064" layer="16" curve="90"/>
</signal>
<signal name="N$13">
<contactref element="R5" pad="2"/>
<contactref element="LED1" pad="1"/>
<wire x1="1.905" y1="7.7225" x2="1.905" y2="5.715" width="0.4064" layer="16"/>
</signal>
<signal name="N$14">
<contactref element="R6" pad="2"/>
<contactref element="LED1" pad="9"/>
<wire x1="4.445" y1="20.955" x2="4.445" y2="18.9475" width="0.4064" layer="1"/>
</signal>
<signal name="N$15">
<contactref element="R7" pad="2"/>
<contactref element="LED1" pad="10"/>
<wire x1="1.905" y1="20.955" x2="1.905" y2="18.9475" width="0.4064" layer="1"/>
</signal>
<signal name="N$16">
<contactref element="R8" pad="2"/>
<contactref element="LED1" pad="5"/>
<wire x1="12.065" y1="8.04" x2="12.065" y2="5.715" width="0.4064" layer="16"/>
</signal>
<signal name="GND">
<contactref element="IC1" pad="8"/>
<contactref element="LED1" pad="3"/>
<contactref element="LED1" pad="8"/>
<wire x1="0.635" y1="22.225" x2="1.27" y2="22.86" width="0.4064" layer="16"/>
<wire x1="1.27" y1="22.86" x2="5.08" y2="22.86" width="0.4064" layer="16"/>
<wire x1="2.2225" y1="3.81" x2="0.635" y2="3.81" width="0.4064" layer="16"/>
<wire x1="0.635" y1="3.81" x2="0.635" y2="12.3825" width="0.4064" layer="16"/>
<wire x1="0.635" y1="12.3825" x2="0.635" y2="22.225" width="0.4064" layer="16"/>
<wire x1="2.54" y1="12.1666" x2="2.3241" y2="12.3825" width="0.4064" layer="16" curve="90"/>
<wire x1="2.3241" y1="12.3825" x2="0.635" y2="12.3825" width="0.4064" layer="16"/>
<contactref element="U$1" pad="6"/>
<wire x1="4.445" y1="1.27" x2="3.81" y2="1.27" width="0.4064" layer="1"/>
<via x="2.2225" y="1.27" extent="1-16" drill="0.3302"/>
<wire x1="3.81" y1="1.27" x2="2.2225" y2="1.27" width="0.4064" layer="1"/>
<wire x1="2.2225" y1="1.27" x2="2.2225" y2="3.81" width="0.4064" layer="16"/>
<wire x1="4.445" y1="2.8575" x2="4.445" y2="1.27" width="0.4064" layer="1"/>
<wire x1="3.81" y1="2.54" x2="3.81" y2="1.27" width="0.4064" layer="1"/>
<polygon width="0.4064" layer="1">
<vertex x="19.05" y="27.305"/>
<vertex x="-10.4775" y="27.305"/>
<vertex x="-9.8425" y="0"/>
<vertex x="19.685" y="0"/>
</polygon>
<polygon width="0.4064" layer="16">
<vertex x="18.0975" y="28.2575"/>
<vertex x="-12.3825" y="28.2575"/>
<vertex x="-12.3825" y="-30.7975"/>
<vertex x="18.0975" y="-30.7975"/>
</polygon>
<via x="1.27" y="1.27" extent="1-16" drill="0.3302"/>
<via x="1.27" y="2.2225" extent="1-16" drill="0.3302"/>
<via x="2.2225" y="2.2225" extent="1-16" drill="0.3302"/>
<via x="8.255" y="22.225" extent="1-16" drill="0.3302"/>
<via x="5.715" y="22.225" extent="1-16" drill="0.3302"/>
<via x="1.27" y="11.7475" extent="1-16" drill="0.3302"/>
<via x="1.27" y="13.0175" extent="1-16" drill="0.3302"/>
<contactref element="C1" pad="2"/>
<contactref element="R9" pad="1"/>
<via x="2.8575" y="14.605" extent="1-16" drill="0.3302"/>
<via x="4.445" y="3.81" extent="1-16" drill="0.3302"/>
<via x="5.715" y="23.1775" extent="1-16" drill="0.3302"/>
<via x="6.985" y="23.1775" extent="1-16" drill="0.3302"/>
<via x="8.255" y="23.1775" extent="1-16" drill="0.3302"/>
<via x="9.525" y="23.1775" extent="1-16" drill="0.3302"/>
<via x="1.27" y="3.175" extent="1-16" drill="0.3302"/>
<via x="2.2225" y="3.175" extent="1-16" drill="0.3302"/>
</signal>
<signal name="+5V">
<contactref element="IC1" pad="16"/>
<contactref element="U$1" pad="2"/>
<wire x1="9.525" y1="1.27" x2="9.525" y2="3.4925" width="0.4064" layer="1"/>
<wire x1="9.525" y1="3.4925" x2="10.795" y2="4.7625" width="0.4064" layer="1"/>
<wire x1="10.795" y1="4.7625" x2="10.795" y2="14.605" width="0.4064" layer="1"/>
<via x="12.065" y="15.875" extent="1-16" drill="0.3302"/>
<contactref element="C1" pad="1"/>
<wire x1="11.7475" y1="1.03" x2="11.1680875" y2="1.27" width="0.4064" layer="1" curve="45"/>
<wire x1="11.1680875" y1="1.27" x2="9.525" y2="1.27" width="0.4064" layer="1"/>
<wire x1="10.795" y1="14.605" x2="12.065" y2="15.875" width="0.4064" layer="1"/>
<wire x1="11.43" y1="18.3134" x2="11.43" y2="16.51" width="0.4064" layer="16"/>
<wire x1="11.43" y1="16.51" x2="12.065" y2="15.875" width="0.4064" layer="16"/>
</signal>
<signal name="N$17">
<contactref element="U$1" pad="4"/>
<contactref element="IC1" pad="14"/>
<wire x1="8.255" y1="3.81" x2="8.255" y2="6.985" width="0.4064" layer="1"/>
<wire x1="8.255" y1="6.985" x2="10.16" y2="8.89" width="0.4064" layer="1"/>
<wire x1="10.16" y1="8.89" x2="10.16" y2="15.24" width="0.4064" layer="1"/>
<wire x1="10.16" y1="15.24" x2="9.525" y2="15.875" width="0.4064" layer="1"/>
<via x="9.525" y="15.875" extent="1-16" drill="0.3302"/>
<wire x1="7.62" y1="1.905" x2="7.46125" y2="1.74625" width="0.4064" layer="1"/>
<wire x1="7.46125" y1="1.74625" x2="6.985" y2="1.27" width="0.4064" layer="1"/>
<wire x1="8.255" y1="3.81" x2="6.985" y2="2.54" width="0.4064" layer="1"/>
<wire x1="6.985" y1="2.54" x2="7.46125" y2="2.06375" width="0.4064" layer="1"/>
<wire x1="7.46125" y1="2.06375" x2="7.46125" y2="1.74625" width="0.4064" layer="1"/>
<wire x1="8.89" y1="18.3134" x2="8.89" y2="16.51" width="0.4064" layer="16"/>
<wire x1="8.89" y1="16.51" x2="9.525" y2="15.875" width="0.4064" layer="16"/>
</signal>
<signal name="N$19">
<contactref element="IC1" pad="11"/>
<contactref element="U$1" pad="3"/>
<wire x1="6.985" y1="1.27" x2="6.985" y2="2.54" width="0.4064" layer="16"/>
<wire x1="6.985" y1="2.54" x2="5.715" y2="3.81" width="0.4064" layer="16"/>
<wire x1="5.715" y1="3.81" x2="5.715" y2="6.985" width="0.4064" layer="16"/>
<wire x1="5.715" y1="6.985" x2="7.9375" y2="9.2075" width="0.4064" layer="16"/>
<via x="7.9375" y="9.2075" extent="1-16" drill="0.3302"/>
<wire x1="7.9375" y1="9.2075" x2="9.525" y2="10.795" width="0.4064" layer="1"/>
<wire x1="9.525" y1="10.795" x2="9.525" y2="13.335" width="0.4064" layer="1"/>
<wire x1="6.0325" y1="15.875" x2="5.08" y2="16.8275" width="0.4064" layer="16"/>
<wire x1="5.08" y1="16.8275" x2="5.08" y2="18.3134" width="0.4064" layer="16"/>
<via x="6.985" y="15.875" extent="1-16" drill="0.3302"/>
<wire x1="6.985" y1="15.875" x2="6.0325" y2="15.875" width="0.4064" layer="16"/>
<wire x1="6.985" y1="15.875" x2="9.525" y2="13.335" width="0.4064" layer="1"/>
</signal>
<signal name="N$20">
<contactref element="IC1" pad="13"/>
<contactref element="R9" pad="2"/>
<wire x1="8.255" y1="17.2475" x2="8.255" y2="15.875" width="0.4064" layer="1"/>
<via x="8.255" y="15.875" extent="1-16" drill="0.3302"/>
<wire x1="8.255" y1="15.875" x2="7.62" y2="16.8275" width="0.4064" layer="16"/>
<wire x1="7.62" y1="16.8275" x2="7.62" y2="18.3134" width="0.4064" layer="16"/>
</signal>
<signal name="N$21">
<contactref element="IC1" pad="10"/>
<contactref element="U$1" pad="5"/>
<wire x1="4.445" y1="1.27" x2="4.445" y2="2.2225" width="0.4064" layer="16"/>
<via x="3.175" y="3.65125" extent="1-16" drill="0.3302"/>
<wire x1="3.175" y1="3.65125" x2="3.175" y2="12.3825" width="0.4064" layer="1"/>
<wire x1="3.175" y1="12.3825" x2="1.905" y2="13.6525" width="0.4064" layer="1"/>
<wire x1="1.905" y1="13.6525" x2="1.905" y2="15.875" width="0.4064" layer="1"/>
<via x="1.905" y="15.875" extent="1-16" drill="0.3302"/>
<wire x1="3.81" y1="17.4625" x2="3.81" y2="18.3134" width="0.4064" layer="16"/>
<wire x1="3.81" y1="17.4625" x2="3.01625" y2="16.66875" width="0.4064" layer="16"/>
<wire x1="3.01625" y1="16.66875" x2="2.06375" y2="16.66875" width="0.4064" layer="16"/>
<wire x1="2.06375" y1="16.66875" x2="1.905" y2="16.51" width="0.4064" layer="16"/>
<wire x1="1.905" y1="16.51" x2="1.905" y2="15.875" width="0.4064" layer="16"/>
<wire x1="4.445" y1="2.2225" x2="3.175" y2="3.4925" width="0.4064" layer="16"/>
<wire x1="3.175" y1="3.4925" x2="3.175" y2="3.65125" width="0.4064" layer="16"/>
</signal>
<signal name="N$22">
<contactref element="IC1" pad="12"/>
<contactref element="U$1" pad="1"/>
<wire x1="6.35" y1="18.3134" x2="6.35" y2="16.8275" width="0.4064" layer="16"/>
<via x="6.35" y="16.8275" extent="1-16" drill="0.3302"/>
<wire x1="6.985" y1="9.525" x2="6.985" y2="8.255" width="0.4064" layer="1"/>
<wire x1="8.255" y1="3.81" x2="9.2075" y2="2.8575" width="0.4064" layer="16"/>
<wire x1="9.2075" y1="2.8575" x2="9.2075" y2="2.54" width="0.4064" layer="16"/>
<wire x1="9.2075" y1="2.54" x2="9.525" y2="2.2225" width="0.4064" layer="16"/>
<wire x1="9.525" y1="1.27" x2="9.525" y2="2.2225" width="0.4064" layer="16"/>
<wire x1="8.89" y1="13.0175" x2="8.89" y2="11.43" width="0.4064" layer="1"/>
<wire x1="8.89" y1="11.43" x2="6.985" y2="9.525" width="0.4064" layer="1"/>
<wire x1="8.89" y1="13.0175" x2="6.985" y2="14.9225" width="0.4064" layer="1"/>
<wire x1="6.985" y1="14.9225" x2="6.35" y2="14.9225" width="0.4064" layer="1"/>
<wire x1="6.35" y1="14.9225" x2="6.0325" y2="15.24" width="0.4064" layer="1"/>
<wire x1="6.0325" y1="15.24" x2="6.0325" y2="16.51" width="0.4064" layer="1"/>
<wire x1="6.0325" y1="16.51" x2="6.35" y2="16.8275" width="0.4064" layer="1"/>
<wire x1="8.255" y1="3.81" x2="8.255" y2="6.985" width="0.4064" layer="16"/>
<wire x1="8.255" y1="6.985" x2="7.62" y2="7.62" width="0.4064" layer="16"/>
<via x="7.62" y="7.62" extent="1-16" drill="0.3302"/>
<wire x1="7.62" y1="7.62" x2="6.985" y2="8.255" width="0.4064" layer="1"/>
</signal>
</signals>
</board>
</drawing>
</eagle>
