^D:\VISUAL STUDIO 2015 PROJECTS\LUMICKS TEST\LUMICKS TEST\LASER_CONTROLLER.CPP
/c /ZI /nologo /W3 /WX- /sdl /Od /Oy- /D WIN32 /D _DEBUG /D _CONSOLE /D _UNICODE /D UNICODE /Gm /EHsc /RTC1 /MDd /GS /fp:precise /Zc:wchar_t /Zc:forScope /Zc:inline /Fo"DEBUG\\" /Fd"DEBUG\VC140.PDB" /Gd /TP /analyze- D:\VISUAL STUDIO 2015 PROJECTS\LUMICKS TEST\LUMICKS TEST\LASER_CONTROLLER.CPP
^D:\VISUAL STUDIO 2015 PROJECTS\LUMICKS TEST\LUMICKS TEST\POSSIBLE_COMMANDS.CPP
/c /ZI /nologo /W3 /WX- /sdl /Od /Oy- /D WIN32 /D _DEBUG /D _CONSOLE /D _UNICODE /D UNICODE /Gm /EHsc /RTC1 /MDd /GS /fp:precise /Zc:wchar_t /Zc:forScope /Zc:inline /Fo"DEBUG\\" /Fd"DEBUG\VC140.PDB" /Gd /TP /analyze- D:\VISUAL STUDIO 2015 PROJECTS\LUMICKS TEST\LUMICKS TEST\POSSIBLE_COMMANDS.CPP
^D:\VISUAL STUDIO 2015 PROJECTS\LUMICKS TEST\LUMICKS TEST\LASER.CPP
/c /ZI /nologo /W3 /WX- /sdl /Od /Oy- /D WIN32 /D _DEBUG /D _CONSOLE /D _UNICODE /D UNICODE /Gm /EHsc /RTC1 /MDd /GS /fp:precise /Zc:wchar_t /Zc:forScope /Zc:inline /Fo"DEBUG\\" /Fd"DEBUG\VC140.PDB" /Gd /TP /analyze- D:\VISUAL STUDIO 2015 PROJECTS\LUMICKS TEST\LUMICKS TEST\LASER.CPP
^D:\VISUAL STUDIO 2015 PROJECTS\LUMICKS TEST\LUMICKS TEST\MAIN.CPP
/c /ZI /nologo /W3 /WX- /sdl /Od /Oy- /D WIN32 /D _DEBUG /D _CONSOLE /D _UNICODE /D UNICODE /Gm /EHsc /RTC1 /MDd /GS /fp:precise /Zc:wchar_t /Zc:forScope /Zc:inline /Fo"DEBUG\\" /Fd"DEBUG\VC140.PDB" /Gd /TP /analyze- D:\VISUAL STUDIO 2015 PROJECTS\LUMICKS TEST\LUMICKS TEST\MAIN.CPP
