{
    "loginURL": "http://www.way2automation.com/angularjs-protractor/registeration/#/login",
    "multiformURL": "http://www.way2automation.com/angularjs-protractor/multiform/#/form/profile",
    "calcURL": "http://www.way2automation.com/angularjs-protractor/calc/",
    "webtableURL": "http://www.way2automation.com/angularjs-protractor/webtables/",
    "username": "angular",
    "password": "password",
    "name": "Test123",
    "email": "test@test.com",
    "description": "Valid data with valid description",
    "invalidUserMessage": "Username or password is incorrect",
    "loggedInMessage": "You're logged in!!",
    "completedMessage": "Test Completed, WooHoo!",
    "type": "ps",
    "add": "+",
    "subtract": "-",
    "multiply": "*",
    "divide": "/",
    "modulo": "%",
    "historySize": 5
}