Shopclues Order No,Invoice Number,Shopclues Invoice No,Shopclues Courier,Shopclues AWB No
12257095,I000017547,,,
12345363,I000017795,,,
12527047,I000018296,,,
12653117,I000018899,,,
12827393,I000019577,,,
13001093,I000020103,,,
13004543,I000020102,,,
13065907,I000020567,,,
13274089,I000021747,,,
13716135,I000023823,,,
13742993,I000023856,,,
13828635,I000024438,,,
13983481,I000024947,,,
14001115,I000025049,,,
14226791,I000026009,,,
14858885,I000028341,,,
16025145,I000032446,,,
16157847,I000033056,,,
16479159,I000034151,,,
16938483,I000035931,,,
17274509,I000037153,,,
17286605,I000037739,,,
17866951,I000039218,,,
18067933,I000040193,,,
19372721,I000043878,,,
19802891,I000044956,,,
20129439,I000045702,,,
20893087,I000048156,,,
