\relax 
\bibcite{aa}{1}
\@writefile{toc}{\contentsline {section}{\numberline {1}}{2}}
\@writefile{toc}{\contentsline {section}{\numberline {2}}{2}}
\@writefile{toc}{\contentsline {section}{\numberline {3}}{2}}
\@writefile{toc}{\contentsline {section}{\numberline {4}}{2}}
\@writefile{toc}{\contentsline {section}{\numberline {5}}{2}}
\@writefile{toc}{\contentsline {section}{\numberline {6}}{2}}
