\relax 
\bibcite{aa}{1}
\@writefile{toc}{\contentsline {section}{\numberline {1}原理}{2}}
\@writefile{toc}{\contentsline {section}{\numberline {2}方法}{2}}
\@writefile{toc}{\contentsline {section}{\numberline {3}結果}{2}}
\@writefile{toc}{\contentsline {section}{\numberline {4}考察}{2}}
\@writefile{toc}{\contentsline {section}{\numberline {5}結論}{2}}
\@writefile{toc}{\contentsline {section}{\numberline {6}}{2}}
