{
  "project_info": {
    "project_number": "978811634153",
    "firebase_url": "https://edashboard-34867.firebaseio.com",
    "project_id": "edashboard-34867",
    "storage_bucket": "edashboard-34867.appspot.com"
  },
  "client": [
    {
      "client_info": {
        "mobilesdk_app_id": "1:978811634153:android:231f1722623fc0df",
        "android_client_info": {
          "package_name": "name.adty.mobiledashboard"
        }
      },
      "oauth_client": [
        {
          "client_id": "978811634153-itfso47rv6j22iqdemm5p1nbqatjemkm.apps.googleusercontent.com",
          "client_type": 3
        }
      ],
      "api_key": [
        {
          "current_key": "AIzaSyDK3I-HrDjKQMvgbOveV7zyAjfGCuC286w"
        }
      ],
      "services": {
        "analytics_service": {
          "status": 1
        },
        "appinvite_service": {
          "status": 1,
          "other_platform_oauth_client": []
        },
        "ads_service": {
          "status": 2
        }
      }
    }
  ],
  "configuration_version": "1"
}