 <div id="header" class="container-fluid">
        <nav class="navbar navbar-default">
            <div class="container-fluid">
                <div class="navbar-header">
                    <button id="collapse-button" type="button" class="navbar-toggle" data-toggle="collapse" data-target="#myNavbar">
        <span class="icon-bar"></span>
        <span class="icon-bar"></span>
        <span class="icon-bar"></span>
      </button>
                    <a class="navbar-brand" href="#"><img id="logo" src="LOGO green.png" style="display:inline-block;" /><span id="logo_text">HoshoBosh<small>Livestock Marketplace</small></span></a>
                </div>
                <div class="collapse navbar-collapse" id="myNavbar">
                    <ul class="nav navbar-nav navbar-right">
                        <li><a href="#">Home</a></li>
                        <li><a href="#">How it Works</a></li>
                        <li><a href="#">Blog</a></li>
                        <li><a href="#">About Us</a></li>
                        <li><a href="#">Contact Us</a></li>
                    </ul>
                </div>
            </div>
        </nav>
    </div>
