
{
  "header": {
    "reportVersion": 1,
    "event": "Allocation failed - JavaScript heap out of memory",
    "trigger": "FatalError",
    "filename": "report.20200229.212113.19424.0.001.json",
    "dumpEventTime": "2020-02-29T21:21:13Z",
    "dumpEventTimeStamp": "1582982473894",
    "processId": 19424,
    "cwd": "D:\\Repo\\Angular\\PrimePngChax",
    "commandLine": [
      "C:\\Program Files\\nodejs\\node.exe",
      "D:\\Repo\\Angular\\PrimePngChax\\node_modules\\jest-worker\\build\\workers\\processChild.js"
    ],
    "nodejsVersion": "v12.16.0",
    "wordSize": 64,
    "arch": "x64",
    "platform": "win32",
    "componentVersions": {
      "node": "12.16.0",
      "v8": "7.8.279.23-node.31",
      "uv": "1.34.0",
      "zlib": "1.2.11",
      "brotli": "1.0.7",
      "ares": "1.15.0",
      "modules": "72",
      "nghttp2": "1.40.0",
      "napi": "5",
      "llhttp": "2.0.4",
      "http_parser": "2.9.3",
      "openssl": "1.1.1d",
      "cldr": "35.1",
      "icu": "64.2",
      "tz": "2019c",
      "unicode": "12.1"
    },
    "release": {
      "name": "node",
      "lts": "Erbium",
      "headersUrl": "https://nodejs.org/download/release/v12.16.0/node-v12.16.0-headers.tar.gz",
      "sourceUrl": "https://nodejs.org/download/release/v12.16.0/node-v12.16.0.tar.gz",
      "libUrl": "https://nodejs.org/download/release/v12.16.0/win-x64/node.lib"
    },
    "osName": "Windows_NT",
    "osRelease": "10.0.18363",
    "osVersion": "Windows 10 Pro N",
    "osMachine": "x86_64",
    "cpus": [
      {
        "model": "AMD Ryzen 7 2700 Eight-Core Processor          ",
        "speed": 3900,
        "user": 152750,
        "nice": 0,
        "sys": 209609,
        "idle": 6113468,
        "irq": 47515
      },
      {
        "model": "AMD Ryzen 7 2700 Eight-Core Processor          ",
        "speed": 3900,
        "user": 32531,
        "nice": 0,
        "sys": 14390,
        "idle": 6428718,
        "irq": 375
      },
      {
        "model": "AMD Ryzen 7 2700 Eight-Core Processor          ",
        "speed": 3900,
        "user": 225781,
        "nice": 0,
        "sys": 72593,
        "idle": 6177265,
        "irq": 1000
      },
      {
        "model": "AMD Ryzen 7 2700 Eight-Core Processor          ",
        "speed": 3900,
        "user": 39140,
        "nice": 0,
        "sys": 27812,
        "idle": 6408687,
        "irq": 328
      },
      {
        "model": "AMD Ryzen 7 2700 Eight-Core Processor          ",
        "speed": 3900,
        "user": 125406,
        "nice": 0,
        "sys": 49671,
        "idle": 6300562,
        "irq": 953
      },
      {
        "model": "AMD Ryzen 7 2700 Eight-Core Processor          ",
        "speed": 3900,
        "user": 27640,
        "nice": 0,
        "sys": 14906,
        "idle": 6433093,
        "irq": 281
      },
      {
        "model": "AMD Ryzen 7 2700 Eight-Core Processor          ",
        "speed": 3900,
        "user": 121968,
        "nice": 0,
        "sys": 62250,
        "idle": 6291421,
        "irq": 906
      },
      {
        "model": "AMD Ryzen 7 2700 Eight-Core Processor          ",
        "speed": 3900,
        "user": 28359,
        "nice": 0,
        "sys": 12953,
        "idle": 6434328,
        "irq": 93
      },
      {
        "model": "AMD Ryzen 7 2700 Eight-Core Processor          ",
        "speed": 3900,
        "user": 116234,
        "nice": 0,
        "sys": 48250,
        "idle": 6311156,
        "irq": 640
      },
      {
        "model": "AMD Ryzen 7 2700 Eight-Core Processor          ",
        "speed": 3900,
        "user": 76437,
        "nice": 0,
        "sys": 128531,
        "idle": 6270671,
        "irq": 250
      },
      {
        "model": "AMD Ryzen 7 2700 Eight-Core Processor          ",
        "speed": 3900,
        "user": 248984,
        "nice": 0,
        "sys": 158859,
        "idle": 6067796,
        "irq": 859
      },
      {
        "model": "AMD Ryzen 7 2700 Eight-Core Processor          ",
        "speed": 3900,
        "user": 40828,
        "nice": 0,
        "sys": 19671,
        "idle": 6415140,
        "irq": 484
      },
      {
        "model": "AMD Ryzen 7 2700 Eight-Core Processor          ",
        "speed": 3900,
        "user": 150046,
        "nice": 0,
        "sys": 89796,
        "idle": 6235796,
        "irq": 859
      },
      {
        "model": "AMD Ryzen 7 2700 Eight-Core Processor          ",
        "speed": 3900,
        "user": 39218,
        "nice": 0,
        "sys": 15796,
        "idle": 6420625,
        "irq": 234
      },
      {
        "model": "AMD Ryzen 7 2700 Eight-Core Processor          ",
        "speed": 3900,
        "user": 170140,
        "nice": 0,
        "sys": 72812,
        "idle": 6232687,
        "irq": 687
      },
      {
        "model": "AMD Ryzen 7 2700 Eight-Core Processor          ",
        "speed": 3900,
        "user": 166921,
        "nice": 0,
        "sys": 55437,
        "idle": 6253281,
        "irq": 562
      }
    ],
    "networkInterfaces": [
      {
        "name": "Ethernet",
        "internal": false,
        "mac": "30:9c:23:05:d8:0e",
        "address": "fda4:9b4f:fa13:a00:7443:33b2:2dba:f4ca",
        "netmask": "ffff:ffff:ffff:ffff::",
        "family": "IPv6",
        "scopeid": 0
      },
      {
        "name": "Ethernet",
        "internal": false,
        "mac": "30:9c:23:05:d8:0e",
        "address": "fda4:9b4f:fa13:a00:55d0:7646:bc48:41aa",
        "netmask": "ffff:ffff:ffff:ffff:ffff:ffff:ffff:ffff",
        "family": "IPv6",
        "scopeid": 0
      },
      {
        "name": "Ethernet",
        "internal": false,
        "mac": "30:9c:23:05:d8:0e",
        "address": "fe80::7443:33b2:2dba:f4ca",
        "netmask": "ffff:ffff:ffff:ffff::",
        "family": "IPv6",
        "scopeid": 9
      },
      {
        "name": "Ethernet",
        "internal": false,
        "mac": "30:9c:23:05:d8:0e",
        "address": "192.168.254.100",
        "netmask": "255.255.255.0",
        "family": "IPv4"
      },
      {
        "name": "VirtualBox Host-Only Network",
        "internal": false,
        "mac": "0a:00:27:00:00:04",
        "address": "fe80::25f7:b880:a13:302a",
        "netmask": "ffff:ffff:ffff:ffff::",
        "family": "IPv6",
        "scopeid": 4
      },
      {
        "name": "VirtualBox Host-Only Network",
        "internal": false,
        "mac": "0a:00:27:00:00:04",
        "address": "192.168.56.1",
        "netmask": "255.255.255.0",
        "family": "IPv4"
      },
      {
        "name": "Ethernet 2",
        "internal": false,
        "mac": "0a:00:27:00:00:11",
        "address": "fe80::1c5c:a964:e8e0:9b6a",
        "netmask": "ffff:ffff:ffff:ffff::",
        "family": "IPv6",
        "scopeid": 17
      },
      {
        "name": "Ethernet 2",
        "internal": false,
        "mac": "0a:00:27:00:00:11",
        "address": "169.254.155.106",
        "netmask": "255.255.0.0",
        "family": "IPv4"
      },
      {
        "name": "Ethernet 3",
        "internal": false,
        "mac": "0a:00:27:00:00:12",
        "address": "fe80::f5c1:7db9:85f1:4f70",
        "netmask": "ffff:ffff:ffff:ffff::",
        "family": "IPv6",
        "scopeid": 18
      },
      {
        "name": "Ethernet 3",
        "internal": false,
        "mac": "0a:00:27:00:00:12",
        "address": "169.254.79.112",
        "netmask": "255.255.0.0",
        "family": "IPv4"
      },
      {
        "name": "Loopback Pseudo-Interface 1",
        "internal": true,
        "mac": "00:00:00:00:00:00",
        "address": "::1",
        "netmask": "ffff:ffff:ffff:ffff:ffff:ffff:ffff:ffff",
        "family": "IPv6",
        "scopeid": 0
      },
      {
        "name": "Loopback Pseudo-Interface 1",
        "internal": true,
        "mac": "00:00:00:00:00:00",
        "address": "127.0.0.1",
        "netmask": "255.0.0.0",
        "family": "IPv4"
      }
    ],
    "host": "Derstine"
  },
  "javascriptStack": {
    "message": "No stack.",
    "stack": [
      "Unavailable."
    ]
  },
  "nativeStack": [
    {
      "pc": "0x00007ff78d0019f9",
      "symbol": "std::basic_ostream<char,std::char_traits<char> >::operator<<+10873"
    },
    {
      "pc": "0x00007ff78d005e1c",
      "symbol": "std::basic_ostream<char,std::char_traits<char> >::operator<<+28316"
    },
    {
      "pc": "0x00007ff78d004dd8",
      "symbol": "std::basic_ostream<char,std::char_traits<char> >::operator<<+24152"
    },
    {
      "pc": "0x00007ff78d10364b",
      "symbol": "v8::base::CPU::has_sse+38363"
    },
    {
      "pc": "0x00007ff78d91a11e",
      "symbol": "v8::Isolate::ReportExternalAllocationLimitReached+94"
    },
    {
      "pc": "0x00007ff78d9021f1",
      "symbol": "v8::SharedArrayBuffer::Externalize+833"
    },
    {
      "pc": "0x00007ff78d7ce74c",
      "symbol": "v8::internal::Heap::EphemeronKeyWriteBarrierFromCode+1436"
    },
    {
      "pc": "0x00007ff78d7d99a0",
      "symbol": "v8::internal::Heap::ProtectUnprotectedMemoryChunks+1312"
    },
    {
      "pc": "0x00007ff78d7d64c4",
      "symbol": "v8::internal::Heap::PageFlagsAreConsistent+3204"
    },
    {
      "pc": "0x00007ff78d7cbce3",
      "symbol": "v8::internal::Heap::CollectGarbage+1283"
    },
    {
      "pc": "0x00007ff78d7ca354",
      "symbol": "v8::internal::Heap::AddRetainedMap+2452"
    },
    {
      "pc": "0x00007ff78d7eb53d",
      "symbol": "v8::internal::Factory::NewFillerObject+61"
    },
    {
      "pc": "0x00007ff78d550e21",
      "symbol": "v8::internal::interpreter::JumpTableTargetOffsets::iterator::operator=+1665"
    },
    {
      "pc": "0x00007ff78dd64fad",
      "symbol": "v8::internal::SetupIsolateDelegate::SetupHeap+546637"
    },
    {
      "pc": "0x000003af80b556dd",
      "symbol": ""
    }
  ],
  "javascriptHeap": {
    "totalMemory": 2153558016,
    "totalCommittedMemory": 2153558016,
    "usedMemory": 2147096376,
    "availableMemory": 46566584,
    "memoryLimit": 2197815296,
    "heapSpaces": {
      "read_only_space": {
        "memorySize": 262144,
        "committedMemory": 262144,
        "capacity": 32808,
        "used": 32808,
        "available": 0
      },
      "new_space": {
        "memorySize": 2621440,
        "committedMemory": 2621440,
        "capacity": 1309320,
        "used": 730168,
        "available": 579152
      },
      "old_space": {
        "memorySize": 1960984576,
        "committedMemory": 1960984576,
        "capacity": 1958038864,
        "used": 1957618032,
        "available": 420832
      },
      "code_space": {
        "memorySize": 692224,
        "committedMemory": 692224,
        "capacity": 588352,
        "used": 588352,
        "available": 0
      },
      "map_space": {
        "memorySize": 1576960,
        "committedMemory": 1576960,
        "capacity": 890640,
        "used": 890640,
        "available": 0
      },
      "large_object_space": {
        "memorySize": 187371520,
        "committedMemory": 187371520,
        "capacity": 187233592,
        "used": 187233592,
        "available": 0
      },
      "code_large_object_space": {
        "memorySize": 49152,
        "committedMemory": 49152,
        "capacity": 2784,
        "used": 2784,
        "available": 0
      },
      "new_large_object_space": {
        "memorySize": 0,
        "committedMemory": 0,
        "capacity": 1309320,
        "used": 0,
        "available": 1309320
      }
    }
  },
  "resourceUsage": {
    "userCpuSeconds": 68.984,
    "kernelCpuSeconds": 1.359,
    "cpuConsumptionPercent": 242.562,
    "maxRss": 2322513920,
    "pageFaults": {
      "IORequired": 810850,
      "IONotRequired": 0
    },
    "fsActivity": {
      "reads": 901,
      "writes": 110
    }
  },
  "libuv": [
  ],
  "environmentVariables": {
    "ALLUSERSPROFILE": "C:\\ProgramData",
    "APPDATA": "C:\\Users\\Derstine\\AppData\\Roaming",
    "BROWSERSLIST_IGNORE_OLD_DATA": "1",
    "ChocolateyInstall": "C:\\ProgramData\\chocolatey",
    "ChocolateyLastPathUpdate": "132263891837547371",
    "CI_HOLOS_CLI": "C:\\Program Files (x86)\\Seagate Software\\Open Olap\\",
    "COLORTERM": "truecolor",
    "CommonProgramFiles": "C:\\Program Files\\Common Files",
    "CommonProgramFiles(x86)": "C:\\Program Files (x86)\\Common Files",
    "CommonProgramW6432": "C:\\Program Files\\Common Files",
    "COMPUTERNAME": "DERSTINE",
    "ComSpec": "C:\\Windows\\system32\\cmd.exe",
    "DriverData": "C:\\Windows\\System32\\Drivers\\DriverData",
    "FORCE_COLOR": "1",
    "FPS_BROWSER_APP_PROFILE_STRING": "Internet Explorer",
    "FPS_BROWSER_USER_PROFILE_STRING": "Default",
    "HOMEDRIVE": "C:",
    "HOMEPATH": "\\Users\\Derstine",
    "include": "C:\\Program Files (x86)\\Microsoft Visual Studio\\VC98\\atl\\include;C:\\Program Files (x86)\\Microsoft Visual Studio\\VC98\\mfc\\include;C:\\Program Files (x86)\\Microsoft Visual Studio\\VC98\\include",
    "JEST_WORKER_ID": "5",
    "LANG": "en_US.UTF-8",
    "lib": "C:\\Program Files (x86)\\Microsoft Visual Studio\\VC98\\mfc\\lib;C:\\Program Files (x86)\\Microsoft Visual Studio\\VC98\\lib",
    "LOCALAPPDATA": "C:\\Users\\Derstine\\AppData\\Local",
    "LOGONSERVER": "\\\\DERSTINE",
    "MSDevDir": "C:\\Program Files (x86)\\Microsoft Visual Studio\\Common\\MSDev98",
    "NUMBER_OF_PROCESSORS": "16",
    "OneDrive": "E:\\OneDrive",
    "OneDriveConsumer": "E:\\OneDrive",
    "OS": "Windows_NT",
    "Path": "C:\\Program Files (x86)\\Common Files\\Oracle\\Java\\javapath;C:\\Program Files (x86)\\Python\\Scripts\\;C:\\Program Files (x86)\\Python\\;C:\\Windows\\system32;C:\\Windows;C:\\Windows\\System32\\Wbem;C:\\Windows\\System32\\WindowsPowerShell\\v1.0\\;C:\\Windows\\System32\\OpenSSH\\;C:\\Program Files (x86)\\Microsoft SQL Server\\Client SDK\\ODBC\\130\\Tools\\Binn\\;C:\\Program Files (x86)\\Microsoft SQL Server\\140\\Tools\\Binn\\;C:\\Program Files (x86)\\Microsoft SQL Server\\140\\DTS\\Binn\\;C:\\Program Files (x86)\\Microsoft SQL Server\\140\\Tools\\Binn\\ManagementStudio\\;C:\\Program Files\\Microsoft SQL Server\\Client SDK\\ODBC\\130\\Tools\\Binn\\;C:\\Program Files\\Microsoft SQL Server\\140\\Tools\\Binn\\;C:\\Program Files\\Microsoft SQL Server\\140\\DTS\\Binn\\;C:\\Program Files\\Git\\cmd;C:\\Program Files\\Microsoft VS Code\\bin;C:\\Program Files\\dotnet\\;C:\\Program Files\\Microsoft SQL Server\\130\\Tools\\Binn\\;C:\\Program Files\\Microsoft SQL Server\\Client SDK\\ODBC\\170\\Tools\\Binn\\;C:\\Program Files\\nodejs\\;C:\\ProgramData\\chocolatey\\bin;C:\\Program Files (x86)\\Microsoft Visual Studio\\Common\\Tools\\WinNT;C:\\Program Files (x86)\\Microsoft Visual Studio\\Common\\MSDev98\\Bin;C:\\Program Files (x86)\\Microsoft Visual Studio\\Common\\Tools;C:\\Program Files (x86)\\Microsoft Visual Studio\\VC98\\bin;C:\\Users\\Derstine\\AppData\\Local\\Microsoft\\WindowsApps;C:\\Users\\Derstine\\.dotnet\\tools;C:\\Program Files\\JetBrains\\WebStorm 2019.2.2\\bin;C:\\Users\\Derstine\\AppData\\Roaming\\npm;C:\\Program Files\\JetBrains\\WebStorm 2019.3.1\\bin;C:\\Users\\Derstine\\AppData\\Local\\GitHubDesktop\\bin;C:\\Program Files\\JetBrains\\WebStorm 2019.3.1\\bin;",
    "PATHEXT": ".COM;.EXE;.BAT;.CMD;.VBS;.VBE;.JSE;.WSF;.WSH;.MSC;.PY;.PYW;.CPL",
    "PROCESSOR_ARCHITECTURE": "AMD64",
    "PROCESSOR_IDENTIFIER": "AMD64 Family 23 Model 8 Stepping 2, AuthenticAMD",
    "PROCESSOR_LEVEL": "23",
    "PROCESSOR_REVISION": "0802",
    "ProgramData": "C:\\ProgramData",
    "ProgramFiles": "C:\\Program Files",
    "ProgramFiles(x86)": "C:\\Program Files (x86)",
    "ProgramW6432": "C:\\Program Files",
    "PROMPT": "$P$G",
    "PSModulePath": "C:\\Users\\Derstine\\Documents\\WindowsPowerShell\\Modules;C:\\Program Files\\WindowsPowerShell\\Modules;C:\\Windows\\system32\\WindowsPowerShell\\v1.0\\Modules;C:\\Program Files (x86)\\Microsoft SQL Server\\140\\Tools\\PowerShell\\Modules\\",
    "PUBLIC": "C:\\Users\\Public",
    "SESSIONNAME": "Console",
    "SHFBROOT": "C:\\Program Files (x86)\\EWSoftware\\Sandcastle Help File Builder\\",
    "SystemDrive": "C:",
    "SystemRoot": "C:\\Windows",
    "TEMP": "C:\\Users\\Derstine\\AppData\\Local\\Temp",
    "TERM_PROGRAM": "vscode",
    "TERM_PROGRAM_VERSION": "1.42.1",
    "TMP": "C:\\Users\\Derstine\\AppData\\Local\\Temp",
    "USERDOMAIN": "DERSTINE",
    "USERDOMAIN_ROAMINGPROFILE": "DERSTINE",
    "USERNAME": "Derstine",
    "USERPROFILE": "C:\\Users\\Derstine",
    "VBOX_MSI_INSTALL_PATH": "C:\\Program Files\\Oracle\\VirtualBox\\",
    "VS90COMNTOOLS": "D:\\Program Files (x86)\\Microsoft Visual Studio 9.0\\Common7\\Tools\\",
    "WEBPACK_DEV_SERVER": "true",
    "WebStorm": "C:\\Program Files\\JetBrains\\WebStorm 2019.3.1\\bin;",
    "windir": "C:\\Windows"
  },
  "sharedObjects": [
    "C:\\Program Files\\nodejs\\node.exe",
    "C:\\Windows\\SYSTEM32\\ntdll.dll",
    "C:\\Windows\\System32\\KERNEL32.DLL",
    "C:\\Windows\\System32\\KERNELBASE.dll",
    "C:\\Windows\\System32\\WS2_32.dll",
    "C:\\Windows\\System32\\RPCRT4.dll",
    "C:\\Windows\\SYSTEM32\\dbghelp.dll",
    "C:\\Windows\\System32\\PSAPI.DLL",
    "C:\\Windows\\System32\\ucrtbase.dll",
    "C:\\Windows\\System32\\ADVAPI32.dll",
    "C:\\Windows\\System32\\msvcrt.dll",
    "C:\\Windows\\System32\\sechost.dll",
    "C:\\Windows\\SYSTEM32\\IPHLPAPI.DLL",
    "C:\\Windows\\SYSTEM32\\USERENV.dll",
    "C:\\Windows\\System32\\USER32.dll",
    "C:\\Windows\\System32\\profapi.dll",
    "C:\\Windows\\System32\\win32u.dll",
    "C:\\Windows\\System32\\GDI32.dll",
    "C:\\Windows\\System32\\gdi32full.dll",
    "C:\\Windows\\System32\\msvcp_win.dll",
    "C:\\Windows\\System32\\CRYPT32.dll",
    "C:\\Windows\\System32\\MSASN1.dll",
    "C:\\Windows\\System32\\bcrypt.dll",
    "C:\\Windows\\SYSTEM32\\WINMM.dll",
    "C:\\Windows\\SYSTEM32\\winmmbase.dll",
    "C:\\Windows\\System32\\cfgmgr32.dll",
    "C:\\Windows\\System32\\bcryptPrimitives.dll",
    "C:\\Windows\\System32\\IMM32.DLL",
    "C:\\Windows\\System32\\powrprof.dll",
    "C:\\Windows\\System32\\UMPDC.dll",
    "C:\\Windows\\SYSTEM32\\CRYPTBASE.DLL",
    "C:\\Windows\\system32\\uxtheme.dll",
    "C:\\Windows\\System32\\combase.dll",
    "C:\\Windows\\system32\\mswsock.dll",
    "C:\\Windows\\System32\\kernel.appcore.dll",
    "C:\\Windows\\System32\\NSI.dll",
    "C:\\Windows\\SYSTEM32\\dhcpcsvc6.DLL",
    "C:\\Windows\\SYSTEM32\\dhcpcsvc.DLL",
    "C:\\Windows\\SYSTEM32\\DNSAPI.dll",
    "C:\\Windows\\system32\\napinsp.dll",
    "C:\\Windows\\system32\\pnrpnsp.dll",
    "C:\\Windows\\system32\\wshbth.dll",
    "C:\\Windows\\system32\\NLAapi.dll",
    "C:\\Windows\\System32\\winrnr.dll"
  ]
}