close(4)                                = 0
munmap(0x7f6529c37000, 4096)            = 0
stat("/etc/localtime", {st_mode=S_IFREG|0644, st_size=3519, ...}) = 0
utime("/home/bearface/website_output/www.ucla.edu/css/fonts/proximanova-light.ttf", [2014/06/30-12:17:37, 2014/05/01-15:09:18]) = 0
write(2, "2014-06-30 12:17:37 (203 KB/s) -"..., 129) = 129
statfs("/home/bearface/website_output/www.ucla.edu/css/fonts", {f_type="EXT2_SUPER_MAGIC", f_bsize=4096, f_blocks=59275954, f_bfree=49141207, f_bavail=46124401, f_files=15065088, f_ffree=14788408, f_fsid={533008265, 2108930253}, f_namelen=255, f_frsize=4096}) = 0
stat("/home/bearface/website_output/www.ucla.edu/css/fonts/proximanova-regular.eot", 0x7fff13a30660) = -1 ENOENT (No such file or directory)
stat("/home/bearface/website_output/www.ucla.edu/css/fonts/proximanova-regular.eot", 0x7fff13a306f0) = -1 ENOENT (No such file or directory)
statfs("/home/bearface/website_output/www.ucla.edu/css/fonts", {f_type="EXT2_SUPER_MAGIC", f_bsize=4096, f_blocks=59275954, f_bfree=49141207, f_bavail=46124401, f_files=15065088, f_ffree=14788408, f_fsid={533008265, 2108930253}, f_namelen=255, f_frsize=4096}) = 0
stat("/home/bearface/website_output/www.ucla.edu/css/fonts/proximanova-regular.eot", 0x7fff13a30660) = -1 ENOENT (No such file or directory)
nanosleep({1, 0}, 0x7fff13a30770)       = 0
stat("/etc/localtime", {st_mode=S_IFREG|0644, st_size=3519, ...}) = 0
write(2, "--2014-06-30 12:17:38--  http://"..., 79) = 79
select(4, [3], NULL, NULL, {0, 1})      = 0 (Timeout)
getpeername(3, {sa_family=AF_INET, sin_port=htons(80), sin_addr=inet_addr("164.67.228.152")}, [16]) = 0
write(2, "Reusing existing connection to w"..., 48) = 48
select(4, NULL, [3], NULL, {900, 0})    = 1 (out [3], left {899, 999993})
write(3, "GET /css/fonts/proximanova-regul"..., 172) = 172
write(2, "HTTP request sent, awaiting resp"..., 40) = 40
select(4, [3], NULL, NULL, {900, 0})    = 1 (in [3], left {899, 932911})
recvfrom(3, "HTTP/1.1 200 OK\r\nContent-Type: a"..., 511, MSG_PEEK, NULL, NULL) = 511
read(3, "HTTP/1.1 200 OK\r\nContent-Type: a"..., 424) = 424
write(2, "200 OK\n", 7)                 = 7
stat("/home/bearface/website_output/www.ucla.edu/css/fonts/proximanova-regular.eot", 0x7fff13a30190) = -1 ENOENT (No such file or directory)
write(2, "Length: ", 8)                 = 8
write(2, "22911", 5)                    = 5
write(2, " (22K)", 6)                   = 6
write(2, " [application/octet-stream]\n", 28) = 28
stat("/home/bearface/website_output/www.ucla.edu/css/fonts", {st_mode=S_IFDIR|0755, st_size=4096, ...}) = 0
open("/home/bearface/website_output/www.ucla.edu/css/fonts/proximanova-regular.eot", O_WRONLY|O_CREAT|O_TRUNC, 0666) = 4
write(2, "Saving to: \342\200\230/home/bearface/web"..., 94) = 94
write(2, "\n", 1)                       = 1
write(2, "\r", 1)                       = 1
write(2, " 0% [                           "..., 79) = 79
select(4, [3], NULL, NULL, {0, 950000}) = 1 (in [3], left {0, 949992})
read(3, "\177Y\0\0\223X\0\0\2\0\2\0\4\0\0\0\2\0\5\6\3\0\0\2\0\4\1\0\220\1\0\0"..., 8192) = 3680
fstat(4, {st_mode=S_IFREG|0644, st_size=0, ...}) = 0
mmap(NULL, 4096, PROT_READ|PROT_WRITE, MAP_PRIVATE|MAP_ANONYMOUS, -1, 0) = 0x7f6529c37000
write(4, "\177Y\0\0\223X\0\0\2\0\2\0\4\0\0\0\2\0\5\6\3\0\0\2\0\4\1\0\220\1\0\0"..., 3680) = 3680
select(4, [3], NULL, NULL, {0, 950000}) = 1 (in [3], left {0, 887185})
read(3, "2\327\254p\336'\232Z\36\334\274\311~\377\227s\304\363#\23^\321\10\254\22\341Il\357\345\7\361"..., 8192) = 1368
write(4, "2\327\254p\336'\232Z\36\334\274\311~\377\227s\304\363#\23^\321\10\254\22\341Il\357\345\7\361"..., 1368) = 1368
select(4, [3], NULL, NULL, {0, 950000}) = 1 (in [3], left {0, 949989})
read(3, "\364\252\224\326\32\2t\24&\247\250\247&g\30K\246i\32\332\342\240cRVn\305Jg\353\260\252"..., 8192) = 1368
write(4, "\364\252\224\326\32\2t\24&\247\250\247&g\30K\246i\32\332\342\240cRVn\305Jg\353\260\252"..., 1368) = 1368
select(4, [3], NULL, NULL, {0, 950000}) = 1 (in [3], left {0, 949441})
read(3, "m\217\343b\204\2518w\24\24C\354\321QBY\344+\303#h;\\o\267&~\225\202\242K\201"..., 8192) = 1368
write(4, "m\217\343b\204\2518w\24\24C\354\321QBY\344+\303#h;\\o\267&~\225\202\242K\201"..., 1368) = 1368
select(4, [3], NULL, NULL, {0, 950000}) = 1 (in [3], left {0, 949995})
read(3, "Tr\1\200\227.\17\253\223\306\f\221A\20\213\370\340\25\352\246\272\6\327\3455m_\32\326\3442\0"..., 8192) = 2736
write(4, "Tr\1\200\227.\17\253\223\306\f\221A\20\213\370\340\25\352\246\272\6\327\3455m_\32\326\3442\0"..., 2736) = 2736
select(4, [3], NULL, NULL, {0, 950000}) = 1 (in [3], left {0, 949993})
read(3, "5\301/\226v8&\v\264\"_nt\375\0235Ib\25\24\0369&<\246\7\341\234C\37\356A"..., 8192) = 1368
write(4, "5\301/\226v8&\v\264\"_nt\375\0235Ib\25\24\0369&<\246\7\341\234C\37\356A"..., 1368) = 1368
select(4, [3], NULL, NULL, {0, 950000}) = 1 (in [3], left {0, 887051})
read(3, "\205\367\352\323\367UB\344e\231\367~\10eR\300\362\326F\335\366\36\313\303j\253i\240\310\214\212\260"..., 8192) = 1368
write(4, "\205\367\352\323\367UB\344e\231\367~\10eR\300\362\326F\335\366\36\313\303j\253i\240\310\214\212\260"..., 1368) = 1368
select(4, [3], NULL, NULL, {0, 950000}) = 1 (in [3], left {0, 949990})
read(3, "MR%\203'r%\177\3460v\356\352\234\213\236HF\330\334\373=q]\230\220\331\227v{u\334"..., 8192) = 2736
write(4, "MR%\203'r%\177\3460v\356\352\234\213\236HF\330\334\373=q]\230\220\331\227v{u\334"..., 2736) = 2736
select(4, [3], NULL, NULL, {0, 950000}) = 1 (in [3], left {0, 949994})
read(3, "\320e\16\314\256T\f/\6p]\270T)\314\\\343\330\246\300\306\fx\350`Ap\251\237\341f@"..., 6919) = 1368
write(4, "\320e\16\314\256T\f/\6p]\270T)\314\\\343\330\246\300\306\fx\350`Ap\251\237\341f@"..., 1368) = 1368
select(4, [3], NULL, NULL, {0, 950000}) = 1 (in [3], left {0, 949349})
read(3, "\260(.\210.^\"\276a\274\v\272D\230\\\26 \0168\323\2145i\325{\370\260}\306\n\\\326"..., 5551) = 1368
write(4, "\260(.\210.^\"\276a\274\v\272D\230\\\26 \0168\323\2145i\325{\370\260}\306\n\\\326"..., 1368) = 1368
select(4, [3], NULL, NULL, {0, 950000}) = 1 (in [3], left {0, 949688})
read(3, "\355\224\200J'i\351fV\337B\271{\245\2415\27y+\263?\271n>\352\201~\237h\4\\\35"..., 4183) = 1368
write(4, "\355\224\200J'i\351fV\337B\271{\245\2415\27y+\263?\271n>\352\201~\237h\4\\\35"..., 1368) = 1368
select(4, [3], NULL, NULL, {0, 950000}) = 1 (in [3], left {0, 949997})
read(3, "<\275\233\271\251+5\376\302\364=6\31\232\371\304\216&\30A\35\213\247\21\302\20Wx\364\24Ar"..., 2815) = 2815
write(4, "<\275\233\271\251+5\376\302\364=6\31\232\371\304\216&\30A\35\213\247\21\302\20Wx\364\24Ar"..., 2815) = 2815
write(2, "\r", 1)                       = 1
write(2, "100%[==========================="..., 79) = 79
write(2, "\n\n", 2)                     = 2
