mprotect(0x7feb0d3ba000, 4096, PROT_READ) = 0
mprotect(0x7feb0d5ed000, 4096, PROT_READ) = 0
mprotect(0x7feb0d806000, 4096, PROT_READ) = 0
mprotect(0x7feb0dbb8000, 110592, PROT_READ) = 0
mprotect(0x7feb0de36000, 12288, PROT_READ) = 0
mprotect(0x65e000, 4096, PROT_READ)     = 0
mprotect(0x7feb0e062000, 4096, PROT_READ) = 0
munmap(0x7feb0e043000, 115291)          = 0
brk(0)                                  = 0x2124000
brk(0x2145000)                          = 0x2145000
clock_getres(CLOCK_MONOTONIC, {0, 1})   = 0
clock_getres(CLOCK_MONOTONIC, {0, 1})   = 0
open("/usr/lib/locale/locale-archive", O_RDONLY|O_CLOEXEC) = 3
fstat(3, {st_mode=S_IFREG|0644, st_size=2919792, ...}) = 0
mmap(NULL, 2919792, PROT_READ, MAP_PRIVATE, 3, 0) = 0x7feb0c924000
close(3)                                = 0
stat("/etc/wgetrc", {st_mode=S_IFREG|0644, st_size=4812, ...}) = 0
open("/etc/wgetrc", O_RDONLY)           = 3
fstat(3, {st_mode=S_IFREG|0644, st_size=4812, ...}) = 0
mmap(NULL, 4096, PROT_READ|PROT_WRITE, MAP_PRIVATE|MAP_ANONYMOUS, -1, 0) = 0x7feb0e05f000
read(3, "###\n### Sample Wget initializati"..., 4096) = 4096
read(3, "by setting this to on.\n#recursiv"..., 4096) = 716
read(3, "", 4096)                       = 0
close(3)                                = 0
munmap(0x7feb0e05f000, 4096)            = 0
stat("/home/bearface/.wgetrc", 0x7ffffe5e1b00) = -1 ENOENT (No such file or directory)
ioctl(2, SNDCTL_TMR_TIMEBASE or SNDRV_TIMER_IOCTL_NEXT_DEVICE or TCGETS, {B38400 opost isig icanon echo ...}) = 0
ioctl(2, SNDCTL_TMR_TIMEBASE or SNDRV_TIMER_IOCTL_NEXT_DEVICE or TCGETS, {B38400 opost isig icanon echo ...}) = 0
rt_sigaction(SIGHUP, {SIG_IGN, [HUP], SA_RESTORER|SA_RESTART, 0x7feb0ce27ff0}, {SIG_DFL, [], 0}, 8) = 0
rt_sigaction(SIGHUP, {0x421350, [HUP], SA_RESTORER|SA_RESTART, 0x7feb0ce27ff0}, {SIG_IGN, [HUP], SA_RESTORER|SA_RESTART, 0x7feb0ce27ff0}, 8) = 0
rt_sigaction(SIGUSR1, {0x421350, [USR1], SA_RESTORER|SA_RESTART, 0x7feb0ce27ff0}, {SIG_DFL, [], 0}, 8) = 0
rt_sigaction(SIGPIPE, {SIG_IGN, [PIPE], SA_RESTORER|SA_RESTART, 0x7feb0ce27ff0}, {SIG_DFL, [], 0}, 8) = 0
rt_sigaction(SIGWINCH, {0x422a80, [WINCH], SA_RESTORER|SA_RESTART, 0x7feb0ce27ff0}, {SIG_DFL, [], 0}, 8) = 0
statfs("/home/bearface/website_output/www.berkeley.edu", 0x7ffffe5e15c0) = -1 ENOENT (No such file or directory)
statfs("/home/bearface/website_output", {f_type="EXT2_SUPER_MAGIC", f_bsize=4096, f_blocks=59275954, f_bfree=49151623, f_bavail=46134817, f_files=15065088, f_ffree=14788706, f_fsid={533008265, 2108930253}, f_namelen=255, f_frsize=4096}) = 0
stat("/home/bearface/website_output/www.berkeley.edu/index.html", 0x7ffffe5e1610) = -1 ENOENT (No such file or directory)
stat("/home/bearface/website_output/www.berkeley.edu/index.html", 0x7ffffe5e16a0) = -1 ENOENT (No such file or directory)
statfs("/home/bearface/website_output/www.berkeley.edu", 0x7ffffe5e15c0) = -1 ENOENT (No such file or directory)
statfs("/home/bearface/website_output", {f_type="EXT2_SUPER_MAGIC", f_bsize=4096, f_blocks=59275954, f_bfree=49151622, f_bavail=46134816, f_files=15065088, f_ffree=14788706, f_fsid={533008265, 2108930253}, f_namelen=255, f_frsize=4096}) = 0
stat("/home/bearface/website_output/www.berkeley.edu/index.html", 0x7ffffe5e1610) = -1 ENOENT (No such file or directory)
open("/etc/localtime", O_RDONLY|O_CLOEXEC) = 3
fstat(3, {st_mode=S_IFREG|0644, st_size=3519, ...}) = 0
fstat(3, {st_mode=S_IFREG|0644, st_size=3519, ...}) = 0
mmap(NULL, 4096, PROT_READ|PROT_WRITE, MAP_PRIVATE|MAP_ANONYMOUS, -1, 0) = 0x7feb0e05f000
read(3, "TZif2\0\0\0\0\0\0\0\0\0\0\0\0\0\0\0\0\0\0\4\0\0\0\4\0\0\0\0"..., 4096) = 3519
lseek(3, -2252, SEEK_CUR)               = 1267
read(3, "TZif2\0\0\0\0\0\0\0\0\0\0\0\0\0\0\0\0\0\0\5\0\0\0\5\0\0\0\0"..., 4096) = 2252
close(3)                                = 0
munmap(0x7feb0e05f000, 4096)            = 0
write(2, "--2014-06-30 12:12:45--  http://"..., 50) = 50
stat("/home/bearface/.netrc", 0x7ffffe5e1100) = -1 ENOENT (No such file or directory)
open("/usr/share/locale/locale.alias", O_RDONLY|O_CLOEXEC) = 3
fstat(3, {st_mode=S_IFREG|0644, st_size=2570, ...}) = 0
mmap(NULL, 4096, PROT_READ|PROT_WRITE, MAP_PRIVATE|MAP_ANONYMOUS, -1, 0) = 0x7feb0e05f000
read(3, "# Locale name alias data base.\n#"..., 4096) = 2570
read(3, "", 4096)                       = 0
close(3)                                = 0
munmap(0x7feb0e05f000, 4096)            = 0
open("/usr/share/locale/en_US.UTF-8/LC_MESSAGES/wget.mo", O_RDONLY) = -1 ENOENT (No such file or directory)
open("/usr/share/locale/en_US.utf8/LC_MESSAGES/wget.mo", O_RDONLY) = -1 ENOENT (No such file or directory)
open("/usr/share/locale/en_US/LC_MESSAGES/wget.mo", O_RDONLY) = -1 ENOENT (No such file or directory)
open("/usr/share/locale/en.UTF-8/LC_MESSAGES/wget.mo", O_RDONLY) = -1 ENOENT (No such file or directory)
open("/usr/share/locale/en.utf8/LC_MESSAGES/wget.mo", O_RDONLY) = -1 ENOENT (No such file or directory)
open("/usr/share/locale/en/LC_MESSAGES/wget.mo", O_RDONLY) = -1 ENOENT (No such file or directory)
open("/usr/share/locale-langpack/en_US.UTF-8/LC_MESSAGES/wget.mo", O_RDONLY) = -1 ENOENT (No such file or directory)
open("/usr/share/locale-langpack/en_US.utf8/LC_MESSAGES/wget.mo", O_RDONLY) = -1 ENOENT (No such file or directory)
open("/usr/share/locale-langpack/en_US/LC_MESSAGES/wget.mo", O_RDONLY) = -1 ENOENT (No such file or directory)
open("/usr/share/locale-langpack/en.UTF-8/LC_MESSAGES/wget.mo", O_RDONLY) = -1 ENOENT (No such file or directory)
open("/usr/share/locale-langpack/en.utf8/LC_MESSAGES/wget.mo", O_RDONLY) = -1 ENOENT (No such file or directory)
open("/usr/share/locale-langpack/en/LC_MESSAGES/wget.mo", O_RDONLY) = -1 ENOENT (No such file or directory)
write(2, "Resolving www.berkeley.edu (www."..., 49) = 49
socket(PF_LOCAL, SOCK_STREAM|SOCK_CLOEXEC|SOCK_NONBLOCK, 0) = 3
connect(3, {sa_family=AF_LOCAL, sun_path="/var/run/nscd/socket"}, 110) = -1 ENOENT (No such file or directory)
close(3)                                = 0
socket(PF_LOCAL, SOCK_STREAM|SOCK_CLOEXEC|SOCK_NONBLOCK, 0) = 3
