lstat("/home/bearface/website_output/www.nyu.edu/common/images/gradientPipeArrow.gif", {st_mode=S_IFREG|0644, st_size=212, ...}) = 0
stat("/home/bearface/website_output/www.nyu.edu/common/images/gradientPipeArrow.gif", {st_mode=S_IFREG|0644, st_size=212, ...}) = 0
statfs("/home/bearface/website_output/www.nyu.edu/common/images", {f_type="EXT2_SUPER_MAGIC", f_bsize=4096, f_blocks=59275954, f_bfree=49160504, f_bavail=46143698, f_files=15065088, f_ffree=14788954, f_fsid={533008265, 2108930253}, f_namelen=255, f_frsize=4096}) = 0
stat("/home/bearface/website_output/www.nyu.edu/common/images/gradientPipeArrow.gif", {st_mode=S_IFREG|0644, st_size=212, ...}) = 0
lstat("/home/bearface/website_output/www.nyu.edu/common/images/gradientPipeArrow.gif", {st_mode=S_IFREG|0644, st_size=212, ...}) = 0
nanosleep({1, 0}, 0x7fff7afecca0)       = 0
stat("/etc/localtime", {st_mode=S_IFREG|0644, st_size=3519, ...}) = 0
write(2, "--2014-06-30 12:09:16--  http://"..., 80) = 80
select(4, [3], NULL, NULL, {0, 1})      = 0 (Timeout)
getpeername(3, {sa_family=AF_INET, sin_port=htons(80), sin_addr=inet_addr("128.122.119.202")}, [16]) = 0
write(2, "Reusing existing connection to w"..., 47) = 47
select(4, NULL, [3], NULL, {900, 0})    = 1 (out [3], left {899, 999998})
write(3, "GET /common/images/gradientPipeA"..., 230) = 230
write(2, "HTTP request sent, awaiting resp"..., 40) = 40
select(4, [3], NULL, NULL, {900, 0})    = 1 (in [3], left {899, 933212})
recvfrom(3, "HTTP/1.1 200 OK\r\nDate: Mon, 30 J"..., 511, MSG_PEEK, NULL, NULL) = 511
read(3, "HTTP/1.1 200 OK\r\nDate: Mon, 30 J"..., 360) = 360
write(2, "200 OK\n", 7)                 = 7
stat("/home/bearface/website_output/www.nyu.edu/common/images/gradientPipeArrow.gif", {st_mode=S_IFREG|0644, st_size=212, ...}) = 0
write(2, "Length: ", 8)                 = 8
write(2, "212", 3)                      = 3
write(2, " [image/gif]\n", 13)          = 13
stat("/home/bearface/website_output/www.nyu.edu/common/images", {st_mode=S_IFDIR|0755, st_size=4096, ...}) = 0
open("/home/bearface/website_output/www.nyu.edu/common/images/gradientPipeArrow.gif", O_WRONLY|O_CREAT|O_TRUNC, 0666) = 4
write(2, "Saving to: \342\200\230/home/bearface/web"..., 95) = 95
write(2, "\n", 1)                       = 1
write(2, "\r", 1)                       = 1
write(2, " 0% [                           "..., 79) = 79
select(4, [3], NULL, NULL, {0, 950000}) = 1 (in [3], left {0, 949993})
read(3, "GIF89a+\0\31\0\304\30\0\266\233\220v%\253X\7\215Z\t\217t#\251Y\10\216m"..., 212) = 212
fstat(4, {st_mode=S_IFREG|0644, st_size=0, ...}) = 0
mmap(NULL, 4096, PROT_READ|PROT_WRITE, MAP_PRIVATE|MAP_ANONYMOUS, -1, 0) = 0x7f6a77ed4000
write(4, "GIF89a+\0\31\0\304\30\0\266\233\220v%\253X\7\215Z\t\217t#\251Y\10\216m"..., 212) = 212
write(2, "\r", 1)                       = 1
write(2, "100%[==========================="..., 79) = 79
write(2, "\n\n", 2)                     = 2
close(4)                                = 0
munmap(0x7f6a77ed4000, 4096)            = 0
stat("/etc/localtime", {st_mode=S_IFREG|0644, st_size=3519, ...}) = 0
utime("/home/bearface/website_output/www.nyu.edu/common/images/gradientPipeArrow.gif", [2014/06/30-12:09:16, 2014/02/21-16:48:12]) = 0
write(2, "2014-06-30 12:09:16 (831 KB/s) -"..., 134) = 134
statfs("/home/bearface/website_output/www.nyu.edu/common/images", {f_type="EXT2_SUPER_MAGIC", f_bsize=4096, f_blocks=59275954, f_bfree=49160451, f_bavail=46143645, f_files=15065088, f_ffree=14788953, f_fsid={533008265, 2108930253}, f_namelen=255, f_frsize=4096}) = 0
stat("/home/bearface/website_output/www.nyu.edu/common/images/gradientPipeArrowAZ.gif", {st_mode=S_IFREG|0644, st_size=207, ...}) = 0
lstat("/home/bearface/website_output/www.nyu.edu/common/images/gradientPipeArrowAZ.gif", {st_mode=S_IFREG|0644, st_size=207, ...}) = 0
stat("/home/bearface/website_output/www.nyu.edu/common/images/gradientPipeArrowAZ.gif", {st_mode=S_IFREG|0644, st_size=207, ...}) = 0
statfs("/home/bearface/website_output/www.nyu.edu/common/images", {f_type="EXT2_SUPER_MAGIC", f_bsize=4096, f_blocks=59275954, f_bfree=49160451, f_bavail=46143645, f_files=15065088, f_ffree=14788953, f_fsid={533008265, 2108930253}, f_namelen=255, f_frsize=4096}) = 0
stat("/home/bearface/website_output/www.nyu.edu/common/images/gradientPipeArrowAZ.gif", {st_mode=S_IFREG|0644, st_size=207, ...}) = 0
lstat("/home/bearface/website_output/www.nyu.edu/common/images/gradientPipeArrowAZ.gif", {st_mode=S_IFREG|0644, st_size=207, ...}) = 0
nanosleep({1, 0}, 0x7fff7afecca0)       = 0
stat("/etc/localtime", {st_mode=S_IFREG|0644, st_size=3519, ...}) = 0
write(2, "--2014-06-30 12:09:17--  http://"..., 82) = 82
select(4, [3], NULL, NULL, {0, 1})      = 0 (Timeout)
getpeername(3, {sa_family=AF_INET, sin_port=htons(80), sin_addr=inet_addr("128.122.119.202")}, [16]) = 0
write(2, "Reusing existing connection to w"..., 47) = 47
select(4, NULL, [3], NULL, {900, 0})    = 1 (out [3], left {899, 999997})
write(3, "GET /common/images/gradientPipeA"..., 232) = 232
write(2, "HTTP request sent, awaiting resp"..., 40) = 40
select(4, [3], NULL, NULL, {900, 0})    = 1 (in [3], left {899, 937215})
recvfrom(3, "HTTP/1.1 200 OK\r\nDate: Mon, 30 J"..., 511, MSG_PEEK, NULL, NULL) = 511
read(3, "HTTP/1.1 200 OK\r\nDate: Mon, 30 J"..., 360) = 360
write(2, "200 OK\n", 7)                 = 7
stat("/home/bearface/website_output/www.nyu.edu/common/images/gradientPipeArrowAZ.gif", {st_mode=S_IFREG|0644, st_size=207, ...}) = 0
write(2, "Length: ", 8)                 = 8
write(2, "207", 3)                      = 3
write(2, " [image/gif]\n", 13)          = 13
stat("/home/bearface/website_output/www.nyu.edu/common/images", {st_mode=S_IFDIR|0755, st_size=4096, ...}) = 0
open("/home/bearface/website_output/www.nyu.edu/common/images/gradientPipeArrowAZ.gif", O_WRONLY|O_CREAT|O_TRUNC, 0666) = 4
write(2, "Saving to: \342\200\230/home/bearface/web"..., 97) = 97
write(2, "\n", 1)                       = 1
write(2, "\r", 1)                       = 1
write(2, " 0% [                           "..., 79) = 79
select(4, [3], NULL, NULL, {0, 950000}) = 1 (in [3], left {0, 949997})
read(3, "GIF89a\"\0\31\0\304\30\0\266\233\220v%\253X\7\215Z\t\217t#\251Y\10\216m"..., 207) = 207
fstat(4, {st_mode=S_IFREG|0644, st_size=0, ...}) = 0
mmap(NULL, 4096, PROT_READ|PROT_WRITE, MAP_PRIVATE|MAP_ANONYMOUS, -1, 0) = 0x7f6a77ed4000
