write(4, "\377\0\277\4\277\32\241JA\231\322\352\264\331V\355\325m\334\266y\v\37J\262\3109\270\212\215>5"..., 4096) = 4096
select(4, [3], NULL, NULL, {0, 950000}) = 1 (in [3], left {0, 949998})
read(3, "\322\302\203`\5\24\346\1\355\220\302\366\350\35\305'6PH\t\322\4\257N\322#\267\347q\332%)"..., 8192) = 3120
write(4, "\322\302\203`\5\24\346\1\355\220\302\366\350\35\305'6PH\t\322\4\257N\322#\267\347q\332%)"..., 3120) = 3120
select(4, [3], NULL, NULL, {0, 950000}) = 1 (in [3], left {0, 949996})
read(3, ">j\327\275s'\22\2612\241\2\3468\22j\237\355[\235\313\244\346Z\365B\226\362\322\322u\21B"..., 8192) = 2528
write(4, ">j\327\275s'\22\2612\241\2\3468\22j\237\355[\235\313\244\346Z\365B\226\362\322\322u\21B"..., 2528) = 2528
select(4, [3], NULL, NULL, {0, 950000}) = 1 (in [3], left {0, 949996})
read(3, "\240\204\327\323:\332\233S\365\tY\364\3324\3\307,m\237o\266@\343\326\341P\25?\270\263\313B"..., 8192) = 1368
write(4, "\240\204\327\323:\332\233S\365\tY\364\3324\3\307,m\237o\266@\343\326\341P\25?\270\263\313B"..., 1368) = 1368
select(4, [3], NULL, NULL, {0, 950000}) = 1 (in [3], left {0, 949998})
read(3, "\246\251v\244\200HM(3\7!\226<[D\353&!\5\334`\24\257V\212\225w\3\r\271\252F"..., 8192) = 3073
write(4, "\246\251v\244\200HM(3\7!\226<[D\353&!\5\334`\24\257V\212\225w\3\r\271\252F"..., 3073) = 3073
select(4, [3], NULL, NULL, {0, 950000}) = 1 (in [3], left {0, 887029})
read(3, "\337\371R\245*\205@\217\210\2466\356\301\355\300\24.\n\203\272\367\235\t\272\261\333k\201\245\313\321H"..., 8192) = 1368
write(4, "\337\371R\245*\205@\217\210\2466\356\301\355\300\24.\n\203\272\367\235\t\272\261\333k\201\245\313\321H"..., 1368) = 1368
select(4, [3], NULL, NULL, {0, 950000}) = 1 (in [3], left {0, 949994})
read(3, "\216\246+\314\252;44\0\240\321\300GUe\362\305\372?a\247\312\351\226,\306\313\23\256\10\271\375"..., 8192) = 2736
write(4, "\216\246+\314\252;44\0\240\321\300GUe\362\305\372?a\247\312\351\226,\306\313\23\256\10\271\375"..., 2736) = 2736
select(4, [3], NULL, NULL, {0, 950000}) = 1 (in [3], left {0, 949995})
read(3, "\255\254n:\361\37\340\251}\321\333\f\313\35m\374Ao\37\205=\330\355\375\365\266\21\304\276\345a\263"..., 8192) = 1368
write(4, "\255\254n:\361\37\340\251}\321\333\f\313\35m\374Ao\37\205=\330\355\375\365\266\21\304\276\345a\263"..., 1368) = 1368
select(4, [3], NULL, NULL, {0, 950000}) = 1 (in [3], left {0, 949995})
read(3, "I\250\3231\2264\265U\256\253\217\207]B\207\31Iv\211\24\250\255>\312\333u\1\306V\nV\332"..., 8192) = 4104
write(4, "I\250\3231\2264\265U\256\253\217\207]B\207\31Iv\211\24\250\255>\312\333u\1\306V\nV\332"..., 4096) = 4096
write(4, "\v\4[\6\306\267\22\222", 8)   = 8
select(4, [3], NULL, NULL, {0, 950000}) = 1 (in [3], left {0, 949995})
read(3, "\241N\344\370\376\334B\317\230\24\244x\205\301\31@\262\241\240\tM\17CQ\343\327\21S\345\23U#"..., 8192) = 4104
write(4, "\241N\344\370\376\334B\317\230\24\244x\205\301\31@\262\241\240\tM\17CQ\343\327\21S\345\23U#"..., 4096) = 4096
write(4, "\316\332\32\5-\3\303\202", 8) = 8
select(4, [3], NULL, NULL, {0, 950000}) = 1 (in [3], left {0, 949523})
read(3, "\311\364\255:\322\333_\225]@O\366\341\2275\244x\247\3\334\36\205_\214\246\\q\t\0\202HN"..., 8192) = 2736
write(4, "\311\364\255:\322\333_\225]@O\366\341\2275\244x\247\3\334\36\205_\214\246\\q\t\0\202HN"..., 2736) = 2736
select(4, [3], NULL, NULL, {0, 950000}) = 1 (in [3], left {0, 949994})
read(3, "\361A\200\207\256\236\202\311\31\22\241Z\250w\357\211\34>\240\225D\30\361x\353K_\224d\232\216\244"..., 8192) = 5631
write(4, "\361A\200\207\256\236\202\311\31\22\241Z\250w\357\211\34>\240\225D\30\361x\353K_\224d\232\216\244"..., 4096) = 4096
write(4, "9\35\323p\356F\312\362s/\263\277p<\5g\346\37q\362,\251\335s\271\206K6~>\335["..., 1535) = 1535
select(4, [3], NULL, NULL, {0, 950000}) = 1 (in [3], left {0, 949996})
read(3, "\257\"\224\242\260\226\255\237\25\244!\266\30\320R4\220E2\306\264\315\337\234MIS\370\3337\n#"..., 8192) = 5472
write(4, "\257\"\224\242\260\226\255\237\25\244!\266\30\320R4\220E2\306\264\315\337\234MIS\370\3337\n#"..., 4096) = 4096
write(4, "\203\235z\34\374p&nk\31z\204T\0\275\366R\24m\2530>\246\222\357\242\224\247Z\313\240\327"..., 1376) = 1376
select(4, [3], NULL, NULL, {0, 950000}) = 1 (in [3], left {0, 949997})
read(3, "\25\37\221\214M\306\250v\357\266.\333\203nD\334\321#)\366\22\2050\372\22\n\212J\r\ni\237"..., 8192) = 1368
write(4, "\25\37\221\214M\306\250v\357\266.\333\203nD\334\321#)\366\22\2050\372\22\n\212J\r\ni\237"..., 1368) = 1368
select(4, [3], NULL, NULL, {0, 950000}) = 1 (in [3], left {0, 949498})
read(3, "vsZ\352T\256\304\23\221\256\0302\2\352%\372t\t\206\345\35\345\266\246\336N\220\212\205\1\375\370"..., 8192) = 1368
write(4, "vsZ\352T\256\304\23\221\256\0302\2\352%\372t\t\206\345\35\345\266\246\336N\220\212\205\1\375\370"..., 1368) = 1368
select(4, [3], NULL, NULL, {0, 950000}) = 1 (in [3], left {0, 949997})
read(3, "\333\376\346l\373\204\236\223e\350\233\213\36\v\36?\345u\n+{u^\325&/\"\242\340\306\357\215"..., 8192) = 1368
write(4, "\333\376\346l\373\204\236\223e\350\233\213\36\v\36?\345u\n+{u^\325&/\"\242\340\306\357\215"..., 1368) = 1368
select(4, [3], NULL, NULL, {0, 950000}) = 1 (in [3], left {0, 949506})
read(3, "4\205z`P+\272jpL39@\356\273dL4\2\200\244+\206\21_>t*\24\360\301-"..., 8192) = 2528
write(4, "4\205z`P+\272jpL39@\356\273dL4\2\200\244+\206\21_>t*\24\360\301-"..., 2528) = 2528
select(4, [3], NULL, NULL, {0, 950000}) = 1 (in [3], left {0, 949210})
read(3, "*\227d\223m\336\234\225i\265\334\v\266=\253k\\-\325vJ\225Y\177L\352Wp!d\237#"..., 8192) = 2736
write(4, "*\227d\223m\336\234\225i\265\334\v\266=\253k\\-\325vJ\225Y\177L\352Wp!d\237#"..., 2736) = 2736
select(4, [3], NULL, NULL, {0, 950000}) = 1 (in [3], left {0, 949997})
read(3, "P?\22]\36\341)\326\27.S\2400\345Amc=AZNc\367`y1\230\35\322\321u\353"..., 8192) = 2736
write(4, "P?\22]\36\341)\326\27.S\2400\345Amc=AZNc\367`y1\230\35\322\321u\353"..., 2736) = 2736
select(4, [3], NULL, NULL, {0, 950000}) = 1 (in [3], left {0, 949996})
read(3, "w5Ha\"\254,\222V\200RsH&\345\271\226g\305\371\230\232\f\215\274\200Z\243\204\203\313\367"..., 8192) = 2736
write(4, "w5Ha\"\254,\222V\200RsH&\345\271\226g\305\371\230\232\f\215\274\200Z\243\204\203\313\367"..., 2736) = 2736
select(4, [3], NULL, NULL, {0, 950000}) = 1 (in [3], left {0, 949997})
read(3, "IHlm\25%s\267t\367i\2717q\320s^\316}\243\373\36\343\216#\343\273\fK\226\334n"..., 8192) = 4104
write(4, "IHlm\25%s\267t\367i\2717q\320s^\316}\243\373\36\343\216#\343\273\fK\226\334n"..., 4096) = 4096
write(4, ":q\235\314\331~\260\377", 8)  = 8
select(4, [3], NULL, NULL, {0, 950000}) = 1 (in [3], left {0, 949997})
read(3, "\0e\273\f\255\263\366\336\366\327\36k+i\333\205\256]\344\245t\251L\213\214\207\20r=\nhF"..., 8192) = 3896
write(4, "\0e\273\f\255\263\366\336\366\327\36k+i\333\205\256]\344\245t\251L\213\214\207\20r=\nhF"..., 3896) = 3896
select(4, [3], NULL, NULL, {0, 950000}) = 1 (in [3], left {0, 949157})
read(3, "\276\333\257\27]\177\246\327\374\373}\203j^i\256\242\324&gd\17mc\347\200p\377\0\267\255\265"..., 8192) = 2736
write(4, "\276\333\257\27]\177\246\327\374\373}\203j^i\256\242\324&gd\17mc\347\200p\377\0\267\255\265"..., 2736) = 2736
select(4, [3], NULL, NULL, {0, 950000}) = 1 (in [3], left {0, 949997})
read(3, "\252\320%\322u\nxa\343\265\22\23fjpR\364\237\270W\26r)D\233\233MZn\340\202\\"..., 8192) = 2736
write(4, "\252\320%\322u\nxa\343\265\22\23fjpR\364\237\270W\26r)D\233\233MZn\340\202\\"..., 2736) = 2736
