write(2, "Saving to: \342\200\230/home/bearface/web"..., 94) = 94
write(2, "\n", 1)                       = 1
write(2, "\r", 1)                       = 1
write(2, " 0% [                           "..., 79) = 79
select(4, [3], NULL, NULL, {0, 950000}) = 1 (in [3], left {0, 949998})
read(3, "/**\n * jQuery lightBox plugin\n *"..., 2329) = 2329
fstat(4, {st_mode=S_IFREG|0644, st_size=0, ...}) = 0
mmap(NULL, 4096, PROT_READ|PROT_WRITE, MAP_PRIVATE|MAP_ANONYMOUS, -1, 0) = 0x7f6a77ed4000
write(4, "/**\n * jQuery lightBox plugin\n *"..., 2329) = 2329
write(2, "\r", 1)                       = 1
write(2, "100%[==========================="..., 79) = 79
write(2, "\n\n", 2)                     = 2
close(4)                                = 0
munmap(0x7f6a77ed4000, 4096)            = 0
stat("/etc/localtime", {st_mode=S_IFREG|0644, st_size=3519, ...}) = 0
utime("/home/bearface/website_output/www.nyu.edu/common/css/jquery.lightbox-0.5.css", [2014/06/30-12:08:42, 2014/02/21-16:47:52]) = 0
write(2, "2014-06-30 12:08:42 (18.9 MB/s) "..., 136) = 136
open("/home/bearface/website_output/www.nyu.edu/common/css/jquery.lightbox-0.5.css", O_RDONLY) = 4
fstat(4, {st_mode=S_IFREG|0644, st_size=2329, ...}) = 0
mmap(NULL, 2329, PROT_READ|PROT_WRITE, MAP_PRIVATE, 4, 0) = 0x7f6a77ed4000
close(4)                                = 0
munmap(0x7f6a77ed4000, 2329)            = 0
statfs("/home/bearface/website_output/www.nyu.edu/etc/designs/nyu/clientlibs", {f_type="EXT2_SUPER_MAGIC", f_bsize=4096, f_blocks=59275954, f_bfree=49162142, f_bavail=46145336, f_files=15065088, f_ffree=14788976, f_fsid={533008265, 2108930253}, f_namelen=255, f_frsize=4096}) = 0
stat("/home/bearface/website_output/www.nyu.edu/etc/designs/nyu/clientlibs/jquery.js", {st_mode=S_IFREG|0644, st_size=111693, ...}) = 0
lstat("/home/bearface/website_output/www.nyu.edu/etc/designs/nyu/clientlibs/jquery.js", {st_mode=S_IFREG|0644, st_size=111693, ...}) = 0
stat("/home/bearface/website_output/www.nyu.edu/etc/designs/nyu/clientlibs/jquery.js", {st_mode=S_IFREG|0644, st_size=111693, ...}) = 0
statfs("/home/bearface/website_output/www.nyu.edu/etc/designs/nyu/clientlibs", {f_type="EXT2_SUPER_MAGIC", f_bsize=4096, f_blocks=59275954, f_bfree=49162142, f_bavail=46145336, f_files=15065088, f_ffree=14788976, f_fsid={533008265, 2108930253}, f_namelen=255, f_frsize=4096}) = 0
stat("/home/bearface/website_output/www.nyu.edu/etc/designs/nyu/clientlibs/jquery.js", {st_mode=S_IFREG|0644, st_size=111693, ...}) = 0
lstat("/home/bearface/website_output/www.nyu.edu/etc/designs/nyu/clientlibs/jquery.js", {st_mode=S_IFREG|0644, st_size=111693, ...}) = 0
nanosleep({1, 0}, 0x7fff7afecca0)       = 0
stat("/etc/localtime", {st_mode=S_IFREG|0644, st_size=3519, ...}) = 0
write(2, "--2014-06-30 12:08:43--  http://"..., 81) = 81
select(4, [3], NULL, NULL, {0, 1})      = 0 (Timeout)
getpeername(3, {sa_family=AF_INET, sin_port=htons(80), sin_addr=inet_addr("128.122.119.202")}, [16]) = 0
write(2, "Reusing existing connection to w"..., 47) = 47
select(4, NULL, [3], NULL, {900, 0})    = 1 (out [3], left {899, 999997})
write(3, "GET /etc/designs/nyu/clientlibs/"..., 212) = 212
write(2, "HTTP request sent, awaiting resp"..., 40) = 40
select(4, [3], NULL, NULL, {900, 0})    = 1 (in [3], left {899, 952987})
recvfrom(3, "HTTP/1.1 200 OK\r\nDate: Mon, 30 J"..., 511, MSG_PEEK, NULL, NULL) = 511
read(3, "HTTP/1.1 200 OK\r\nDate: Mon, 30 J"..., 372) = 372
write(2, "200 OK\n", 7)                 = 7
stat("/home/bearface/website_output/www.nyu.edu/etc/designs/nyu/clientlibs/jquery.js", {st_mode=S_IFREG|0644, st_size=111693, ...}) = 0
write(2, "Length: ", 8)                 = 8
write(2, "111693", 6)                   = 6
write(2, " (109K)", 7)                  = 7
write(2, " [text/javascript]\n", 19)    = 19
stat("/home/bearface/website_output/www.nyu.edu/etc/designs/nyu/clientlibs", {st_mode=S_IFDIR|0755, st_size=4096, ...}) = 0
open("/home/bearface/website_output/www.nyu.edu/etc/designs/nyu/clientlibs/jquery.js", O_WRONLY|O_CREAT|O_TRUNC, 0666) = 4
write(2, "Saving to: \342\200\230/home/bearface/web"..., 96) = 96
write(2, "\n", 1)                       = 1
write(2, "\r", 1)                       = 1
write(2, " 0% [                           "..., 79) = 79
select(4, [3], NULL, NULL, {0, 950000}) = 1 (in [3], left {0, 949996})
read(3, "/*! jQuery v1.9.1 | (c) 2005, 20"..., 8192) = 8192
fstat(4, {st_mode=S_IFREG|0644, st_size=0, ...}) = 0
mmap(NULL, 4096, PROT_READ|PROT_WRITE, MAP_PRIVATE|MAP_ANONYMOUS, -1, 0) = 0x7f6a77ed4000
write(4, "/*! jQuery v1.9.1 | (c) 2005, 20"..., 8192) = 8192
select(4, [3], NULL, NULL, {0, 950000}) = 1 (in [3], left {0, 949996})
read(3, "&&p.has(n)||u.push(n):n&&n.lengt"..., 8192) = 7932
write(4, "&&p.has(n)||u.push(n):n&&n.lengt"..., 4096) = 4096
write(4, "s=\"padding:0;margin:0;border:0;d"..., 3836) = 3836
select(4, [3], NULL, NULL, {0, 950000}) = 1 (in [3], left {0, 949997})
read(3, "i),\"string\"==typeof r){try{r=\"tr"..., 8192) = 2736
write(4, "i),\"string\"==typeof r){try{r=\"tr"..., 2736) = 2736
select(4, [3], NULL, NULL, {0, 950000}) = 1 (in [3], left {0, 949214})
read(3, "gth||\"string\"==typeof e&&e;if(b."..., 8192) = 1368
write(4, "gth||\"string\"==typeof e&&e;if(b."..., 1368) = 1368
select(4, [3], NULL, NULL, {0, 950000}) = 1 (in [3], left {0, 949997})
read(3, "&&r.set(this,o,\"value\")!==t||(th"..., 8192) = 2736
write(4, "&&r.set(this,o,\"value\")!==t||(th"..., 2736) = 2736
select(4, [3], NULL, NULL, {0, 950000}) = 1 (in [3], left {0, 948666})
read(3, "var r=e.getAttributeNode(n);retu"..., 8192) = 4104
write(4, "var r=e.getAttributeNode(n);retu"..., 4096) = 4096
write(4, "+\"(\\\\.|$", 8)              = 8
