mmap(NULL, 2206376, PROT_READ|PROT_EXEC, MAP_PRIVATE|MAP_DENYWRITE, 3, 0) = 0x7fb29ec26000
mprotect(0x7fb29ec3d000, 2097152, PROT_NONE) = 0
mmap(0x7fb29ee3d000, 8192, PROT_READ|PROT_WRITE, MAP_PRIVATE|MAP_FIXED|MAP_DENYWRITE, 3, 0x17000) = 0x7fb29ee3d000
mmap(0x7fb29ee3f000, 6824, PROT_READ|PROT_WRITE, MAP_PRIVATE|MAP_FIXED|MAP_ANONYMOUS, -1, 0) = 0x7fb29ee3f000
close(3)                                = 0
mprotect(0x7fb29ee3d000, 4096, PROT_READ) = 0
mprotect(0x7fb29f045000, 4096, PROT_READ) = 0
munmap(0x7fb2a0b75000, 115291)          = 0
stat("/etc/resolv.conf", {st_mode=S_IFREG|0644, st_size=187, ...}) = 0
open("/etc/resolv.conf", O_RDONLY|O_CLOEXEC) = 3
fstat(3, {st_mode=S_IFREG|0644, st_size=187, ...}) = 0
mmap(NULL, 4096, PROT_READ|PROT_WRITE, MAP_PRIVATE|MAP_ANONYMOUS, -1, 0) = 0x7fb2a0b91000
read(3, "# Dynamic resolv.conf(5) file fo"..., 4096) = 187
read(3, "", 4096)                       = 0
close(3)                                = 0
munmap(0x7fb2a0b91000, 4096)            = 0
socket(PF_INET, SOCK_DGRAM|SOCK_NONBLOCK, IPPROTO_IP) = 3
connect(3, {sa_family=AF_INET, sin_port=htons(53), sin_addr=inet_addr("127.0.1.1")}, 16) = 0
poll([{fd=3, events=POLLOUT}], 1, 0)    = 1 ([{fd=3, revents=POLLOUT}])
sendmmsg(3, {{{msg_name(0)=NULL, msg_iov(1)=[{"r\227\1\0\0\1\0\0\0\0\0\0\3www\3wfu\3edu\0\0\1\0\1", 29}], msg_controllen=0, msg_flags=0}, 29}, {{msg_name(0)=NULL, msg_iov(1)=[{"yd\1\0\0\1\0\0\0\0\0\0\3www\3wfu\3edu\0\0\34\0\1", 29}], msg_controllen=0, msg_flags=0}, 29}}, 2, MSG_NOSIGNAL) = 2
poll([{fd=3, events=POLLIN}], 1, 5000)  = 1 ([{fd=3, revents=POLLIN}])
ioctl(3, FIONREAD, [181])               = 0
recvfrom(3, "r\227\205\200\0\1\0\1\0\4\0\4\3www\3wfu\3edu\0\0\1\0\1\300\f\0"..., 2048, 0, {sa_family=AF_INET, sin_port=htons(53), sin_addr=inet_addr("127.0.1.1")}, [16]) = 181
poll([{fd=3, events=POLLIN}], 1, 4997)  = 1 ([{fd=3, revents=POLLIN}])
ioctl(3, FIONREAD, [80])                = 0
recvfrom(3, "yd\205\200\0\1\0\0\0\1\0\0\3www\3wfu\3edu\0\0\34\0\1\300\20\0"..., 1867, 0, {sa_family=AF_INET, sin_port=htons(53), sin_addr=inet_addr("127.0.1.1")}, [16]) = 80
close(3)                                = 0
write(2, "10.2.1.83", 9)                = 9
write(2, "\n", 1)                       = 1
write(2, "Connecting to www.wfu.edu (www.w"..., 57) = 57
socket(PF_INET, SOCK_STREAM, IPPROTO_IP) = 3
connect(3, {sa_family=AF_INET, sin_port=htons(80), sin_addr=inet_addr("10.2.1.83")}, 16) = 0
write(2, "connected.\n", 11)            = 11
select(4, NULL, [3], NULL, {900, 0})    = 1 (out [3], left {899, 999996})
write(3, "GET / HTTP/1.1\r\nUser-Agent: Mozi"..., 95) = 95
write(2, "HTTP request sent, awaiting resp"..., 40) = 40
select(4, [3], NULL, NULL, {900, 0})    = 1 (in [3], left {899, 994543})
recvfrom(3, "HTTP/1.1 200 OK\r\nDate: Mon, 30 J"..., 511, MSG_PEEK, NULL, NULL) = 511
read(3, "HTTP/1.1 200 OK\r\nDate: Mon, 30 J"..., 290) = 290
write(2, "200 OK\n", 7)                 = 7
stat("/home/bearface/website_output/www.wfu.edu/index.html", {st_mode=S_IFREG|0644, st_size=57035, ...}) = 0
write(2, "Length: ", 8)                 = 8
write(2, "57035", 5)                    = 5
write(2, " (56K)", 6)                   = 6
write(2, " [text/html]\n", 13)          = 13
stat("/home/bearface/website_output/www.wfu.edu", {st_mode=S_IFDIR|0755, st_size=4096, ...}) = 0
open("/home/bearface/website_output/www.wfu.edu/index.html", O_WRONLY|O_CREAT|O_TRUNC, 0666) = 4
open("/usr/lib/charset.alias", O_RDONLY|O_NOFOLLOW) = -1 ENOENT (No such file or directory)
write(2, "Saving to: \342\200\230/home/bearface/web"..., 70) = 70
ioctl(2, TIOCGWINSZ, {ws_row=24, ws_col=80, ws_xpixel=0, ws_ypixel=0}) = 0
write(2, "\n", 1)                       = 1
open("/usr/lib/x86_64-linux-gnu/gconv/gconv-modules.cache", O_RDONLY) = 5
fstat(5, {st_mode=S_IFREG|0644, st_size=26258, ...}) = 0
mmap(NULL, 26258, PROT_READ, MAP_SHARED, 5, 0) = 0x7fb2a0b8b000
close(5)                                = 0
write(2, "\r", 1)                       = 1
write(2, " 0% [                           "..., 79) = 79
select(4, [3], NULL, NULL, {0, 950000}) = 1 (in [3], left {0, 949995})
read(3, "\n\n<!DOCTYPE html>\n<html lang=\"en"..., 8192) = 8192
fstat(4, {st_mode=S_IFREG|0644, st_size=0, ...}) = 0
mmap(NULL, 4096, PROT_READ|PROT_WRITE, MAP_PRIVATE|MAP_ANONYMOUS, -1, 0) = 0x7fb2a0b8a000
write(4, "\n\n<!DOCTYPE html>\n<html lang=\"en"..., 8192) = 8192
select(4, [3], NULL, NULL, {0, 950000}) = 1 (in [3], left {0, 949997})
read(3, "ployment']);\">Employment</a></li"..., 8192) = 5198
write(4, "ployment']);\">Employment</a></li"..., 4096) = 4096
write(4, " class=\"gray3\" type=\"text\">\n    "..., 1102) = 1102
select(4, [3], NULL, NULL, {0, 950000}) = 1 (in [3], left {0, 949996})
read(3, " class=\"next\">&nbsp;</a>\n\t\t\t\t\t</"..., 8192) = 1368
write(4, " class=\"next\">&nbsp;</a>\n\t\t\t\t\t</"..., 1368) = 1368
select(4, [3], NULL, NULL, {0, 950000}) = 1 (in [3], left {0, 949884})
read(3, "</a>\n\t<!-- LINK and TEXT (for bl"..., 8192) = 1368
write(4, "</a>\n\t<!-- LINK and TEXT (for bl"..., 1368) = 1368
select(4, [3], NULL, NULL, {0, 950000}) = 1 (in [3], left {0, 949997})
read(3, "40403.OPCD98percent.jpg) no-repe"..., 8192) = 4104
write(4, "40403.OPCD98percent.jpg) no-repe"..., 4096) = 4096
