select(4, [3], NULL, NULL, {0, 950000}) = 1 (in [3], left {0, 949998})
read(3, "},Tl=function(a,b){for(var c=0,d"..., 8192) = 2842
write(4, "},Tl=function(a,b){for(var c=0,d"..., 2842) = 2842
select(4, [3], NULL, NULL, {0, 950000}) = 1 (in [3], left {0, 946190})
read(3, ";b=\"\";if(m){c=m.length;for(g=f=a"..., 8192) = 1368
write(4, ";b=\"\";if(m){c=m.length;for(g=f=a"..., 1368) = 1368
select(4, [3], NULL, NULL, {0, 950000}) = 1 (in [3], left {0, 949998})
read(3, "(this)};_.k.ub=function(a){retur"..., 8192) = 2736
write(4, "(this)};_.k.ub=function(a){retur"..., 2736) = 2736
select(4, [3], NULL, NULL, {0, 950000}) = 1 (in [3], left {0, 949887})
read(3, "parse(m));g[l]=m}var n=m=!1,h=!1"..., 8192) = 1368
write(4, "parse(m));g[l]=m}var n=m=!1,h=!1"..., 1368) = 1368
select(4, [3], NULL, NULL, {0, 950000}) = 1 (in [3], left {0, 949997})
read(3, "rCase(),e=c.na().toLowerCase();d"..., 8192) = 1368
write(4, "rCase(),e=c.na().toLowerCase();d"..., 1368) = 1368
select(4, [3], NULL, NULL, {0, 950000}) = 1 (in [3], left {0, 949997})
read(3, "0,0,0,0,0,0,0,0,0,0,0,0,0,63,0,0"..., 8192) = 1368
write(4, "0,0,0,0,0,0,0,0,0,0,0,0,0,63,0,0"..., 1368) = 1368
select(4, [3], NULL, NULL, {0, 950000}) = 1 (in [3], left {0, 949997})
read(3, "=1732584193;a.Y[1]=4023233417;a."..., 8192) = 1368
write(4, "=1732584193;a.Y[1]=4023233417;a."..., 1368) = 1368
select(4, [3], NULL, NULL, {0, 950000}) = 1 (in [3], left {0, 949997})
read(3, "):g&&(h=e)):-1<h&&(c.push({s:h,e"..., 8192) = 1368
write(4, "):g&&(h=e)):-1<h&&(c.push({s:h,e"..., 1368) = 1368
select(4, [3], NULL, NULL, {0, 950000}) = 1 (in [3], left {0, 949997})
read(3, "e!important\")};\n_.k.P=function(a"..., 8192) = 1368
write(4, "e!important\")};\n_.k.P=function(a"..., 1368) = 1368
select(4, [3], NULL, NULL, {0, 950000}) = 1 (in [3], left {0, 949998})
read(3, "(this.I,!1);Lm(this.B,!1);var a="..., 8192) = 1368
write(4, "(this.I,!1);Lm(this.B,!1);var a="..., 1368) = 1368
select(4, [3], NULL, NULL, {0, 950000}) = 1 (in [3], left {0, 949997})
read(3, "th=b+\"px\"):a.style.width=b},Lm=f"..., 8192) = 1368
write(4, "th=b+\"px\"):a.style.width=b},Lm=f"..., 1368) = 1368
select(4, [3], NULL, NULL, {0, 950000}) = 1 (in [3], left {0, 949998})
read(3, ",Gl(A)&&D&&(La=D.ga(),Da=La.pare"..., 8192) = 1368
write(4, ",Gl(A)&&D&&(La=D.ga(),Da=La.pare"..., 1368) = 1368
select(4, [3], NULL, NULL, {0, 950000}) = 1 (in [3], left {0, 949997})
read(3, "y)}));if(c||d||e||Wa)a.nc=!0}fun"..., 8192) = 2736
write(4, "y)}));if(c||d||e||Wa)a.nc=!0}fun"..., 2736) = 2736
select(4, [3], NULL, NULL, {0, 950000}) = 1 (in [3], left {0, 949298})
read(3, "l,cf:m,Ed:n,select:p,refresh:q,f"..., 8192) = 1368
write(4, "l,cf:m,Ed:n,select:p,refresh:q,f"..., 1368) = 1368
select(4, [3], NULL, NULL, {0, 950000}) = 1 (in [3], left {0, 949997})
read(3, "[]),b.push(c),a=c.ga(),a.parentN"..., 8192) = 1368
write(4, "[]),b.push(c),a=c.ga(),a.parentN"..., 1368) = 1368
select(4, [3], NULL, NULL, {0, 950000}) = 1 (in [3], left {0, 949377})
read(3, ",F,S,aa,va,H,ma={},Va=[],na=[],N"..., 8038) = 1368
write(4, ",F,S,aa,va,H,ma={},Va=[],na=[],N"..., 1368) = 1368
select(4, [3], NULL, NULL, {0, 950000}) = 1 (in [3], left {0, 949998})
read(3, "ar Qm=function(){};(0,_.L)(Qm,Z)"..., 6670) = 1368
write(4, "ar Qm=function(){};(0,_.L)(Qm,Z)"..., 1368) = 1368
select(4, [3], NULL, NULL, {0, 950000}) = 1 (in [3], left {0, 949998})
read(3, "&b&&(a=a[c])&&b.Df(a[0]||a,d)};v"..., 5302) = 1368
write(4, "&b&&(a=a[c])&&b.Df(a[0]||a,d)};v"..., 1368) = 1368
select(4, [3], NULL, NULL, {0, 950000}) = 1 (in [3], left {0, 949997})
read(3, ".Z=function(){this.k=!1};_.k.wa="..., 3934) = 2736
write(4, ".Z=function(){this.k=!1};_.k.wa="..., 2736) = 2736
select(4, [3], NULL, NULL, {0, 950000}) = 1 (in [3], left {0, 949932})
read(3, "dth=\"100%\";this.C=$(\"span\");c.ap"..., 1198) = 1198
write(4, "dth=\"100%\";this.C=$(\"span\");c.ap"..., 1198) = 1198
select(4, [3], NULL, NULL, {900, 0})    = 1 (in [3], left {899, 999997})
recvfrom(3, "\r\n1000\r\nndChild(a);this.B=a.inse"..., 127, MSG_PEEK, NULL, NULL) = 127
read(3, "\r\n", 2)                      = 2
select(4, [3], NULL, NULL, {900, 0})    = 1 (in [3], left {899, 999997})
recvfrom(3, "1000\r\nndChild(a);this.B=a.insert"..., 127, MSG_PEEK, NULL, NULL) = 127
read(3, "1000\r\n", 6)                  = 6
select(4, [3], NULL, NULL, {0, 950000}) = 1 (in [3], left {0, 949997})
read(3, "ndChild(a);this.B=a.insertRow(-1"..., 4096) = 1530
write(4, "ndChild(a);this.B=a.insertRow(-1"..., 1530) = 1530
select(4, [3], NULL, NULL, {0, 950000}) = 1 (in [3], left {0, 949936})
read(3, ".ob:\"\"}function b(a){return new "..., 2566) = 1368
write(4, ".ob:\"\"}function b(a){return new "..., 1368) = 1368
select(4, [3], NULL, NULL, {0, 950000}) = 1 (in [3], left {0, 949151})
read(3, "4,this);this.A=a.get(123,this);t"..., 1198) = 1198
write(4, "4,this);this.A=a.get(123,this);t"..., 1198) = 1198
