statfs("/home/bearface/website_output/www.cornell.edu/assets/photos/400x225", {f_type="EXT2_SUPER_MAGIC", f_bsize=4096, f_blocks=59275954, f_bfree=49115271, f_bavail=46098465, f_files=15065088, f_ffree=14787916, f_fsid={533008265, 2108930253}, f_namelen=255, f_frsize=4096}) = 0
stat("/home/bearface/website_output/www.cornell.edu/assets/photos/400x225/2F95372D-FE19-C542-4878EABFE5FB100F.jpg", 0x7fff66db0aa0) = -1 ENOENT (No such file or directory)
stat("/home/bearface/website_output/www.cornell.edu/assets/photos/400x225/2F95372D-FE19-C542-4878EABFE5FB100F.jpg", 0x7fff66db0b30) = -1 ENOENT (No such file or directory)
statfs("/home/bearface/website_output/www.cornell.edu/assets/photos/400x225", {f_type="EXT2_SUPER_MAGIC", f_bsize=4096, f_blocks=59275954, f_bfree=49115271, f_bavail=46098465, f_files=15065088, f_ffree=14787916, f_fsid={533008265, 2108930253}, f_namelen=255, f_frsize=4096}) = 0
stat("/home/bearface/website_output/www.cornell.edu/assets/photos/400x225/2F95372D-FE19-C542-4878EABFE5FB100F.jpg", 0x7fff66db0aa0) = -1 ENOENT (No such file or directory)
nanosleep({1, 0}, 0x7fff66db0bb0)       = 0
stat("/etc/localtime", {st_mode=S_IFREG|0644, st_size=3519, ...}) = 0
write(2, "--2014-06-30 12:34:53--  https:/"..., 111) = 111
select(5, [4], NULL, NULL, {0, 1})      = 0 (Timeout)
getpeername(4, {sa_family=AF_INET, sin_port=htons(443), sin_addr=inet_addr("132.236.204.10")}, [16]) = 0
write(2, "Reusing existing connection to w"..., 52) = 52
select(5, NULL, [4], NULL, {900, 0})    = 1 (out [4], left {899, 999998})
write(4, "\27\3\1\0\371)\275\372\33\372\366\247i\340\vZ\3719)\10\317t\261,Me\252%C=\212\247"..., 254) = 254
write(2, "HTTP request sent, awaiting resp"..., 40) = 40
select(5, [4], NULL, NULL, {900, 0})    = 1 (in [4], left {899, 971311})
read(4, "\27\3\1\5\206", 5)             = 5
read(4, "{P1T\30\333\31\231\313\322U\367=\323\352\241\367W\256\301\233HEF\20\376@\350\261\315\2430"..., 1414) = 1414
rt_sigaction(SIGALRM, {0x42c180, [ALRM], SA_RESTORER|SA_RESTART, 0x7f094452eff0}, {SIG_DFL, [ALRM], SA_RESTORER|SA_RESTART, 0x7f094452eff0}, 8) = 0
rt_sigprocmask(SIG_BLOCK, NULL, [], 8)  = 0
setitimer(ITIMER_REAL, {it_interval={0, 0}, it_value={900, 0}}, NULL) = 0
setitimer(ITIMER_REAL, {it_interval={0, 0}, it_value={0, 0}}, NULL) = 0
rt_sigaction(SIGALRM, {SIG_DFL, [ALRM], SA_RESTORER|SA_RESTART, 0x7f094452eff0}, {0x42c180, [ALRM], SA_RESTORER|SA_RESTART, 0x7f094452eff0}, 8) = 0
write(2, "200 OK\n", 7)                 = 7
stat("/home/bearface/website_output/www.cornell.edu/assets/photos/400x225/2F95372D-FE19-C542-4878EABFE5FB100F.jpg", 0x7fff66db0590) = -1 ENOENT (No such file or directory)
write(2, "Length: ", 8)                 = 8
write(2, "72741", 5)                    = 5
write(2, " (71K)", 6)                   = 6
write(2, " [image/jpeg]\n", 14)         = 14
stat("/home/bearface/website_output/www.cornell.edu/assets/photos/400x225", {st_mode=S_IFDIR|0755, st_size=4096, ...}) = 0
open("/home/bearface/website_output/www.cornell.edu/assets/photos/400x225/2F95372D-FE19-C542-4878EABFE5FB100F.jpg", O_WRONLY|O_CREAT|O_TRUNC, 0666) = 3
write(2, "Saving to: \342\200\230/home/bearface/web"..., 125) = 125
write(2, "\n", 1)                       = 1
write(2, "\r", 1)                       = 1
write(2, " 0% [                           "..., 79) = 79
rt_sigaction(SIGALRM, {0x42c180, [ALRM], SA_RESTORER|SA_RESTART, 0x7f094452eff0}, {SIG_DFL, [ALRM], SA_RESTORER|SA_RESTART, 0x7f094452eff0}, 8) = 0
rt_sigprocmask(SIG_BLOCK, NULL, [], 8)  = 0
setitimer(ITIMER_REAL, {it_interval={0, 0}, it_value={900, 0}}, NULL) = 0
setitimer(ITIMER_REAL, {it_interval={0, 0}, it_value={0, 0}}, NULL) = 0
rt_sigaction(SIGALRM, {SIG_DFL, [ALRM], SA_RESTORER|SA_RESTART, 0x7f094452eff0}, {0x42c180, [ALRM], SA_RESTORER|SA_RESTART, 0x7f094452eff0}, 8) = 0
fstat(3, {st_mode=S_IFREG|0644, st_size=0, ...}) = 0
mmap(NULL, 4096, PROT_READ|PROT_WRITE, MAP_PRIVATE|MAP_ANONYMOUS, -1, 0) = 0x7f094575f000
write(3, "\377\330\377\340\0\20JFIF\0\1\2\0\0\1\0\1\0\0\377\333\0C\0\1\1\1\1\1\1\1"..., 1036) = 1036
select(5, [4], NULL, NULL, {0, 950000}) = 1 (in [4], left {0, 949996})
rt_sigaction(SIGALRM, {0x42c180, [ALRM], SA_RESTORER|SA_RESTART, 0x7f094452eff0}, {SIG_DFL, [ALRM], SA_RESTORER|SA_RESTART, 0x7f094452eff0}, 8) = 0
rt_sigprocmask(SIG_BLOCK, NULL, [], 8)  = 0
setitimer(ITIMER_REAL, {it_interval={0, 0}, it_value={900, 0}}, NULL) = 0
read(4, "\27\3\1\5S", 5)                = 5
read(4, "\242y!\377\366\206\31\323\256.\32\310\230\241\255\231\224D\271V\243J\363pi\177N\224u\v\277\31"..., 1363) = 1363
setitimer(ITIMER_REAL, {it_interval={0, 0}, it_value={0, 0}}, NULL) = 0
rt_sigaction(SIGALRM, {SIG_DFL, [ALRM], SA_RESTORER|SA_RESTART, 0x7f094452eff0}, {0x42c180, [ALRM], SA_RESTORER|SA_RESTART, 0x7f094452eff0}, 8) = 0
write(3, "\250J\225\217b\217\245z\217\17s\374\274\306\372\204\322\247\206@\321\364\212\356\267v\327\277g\211\224\326"..., 1347) = 1347
select(5, [4], NULL, NULL, {0, 950000}) = 1 (in [4], left {0, 949997})
rt_sigaction(SIGALRM, {0x42c180, [ALRM], SA_RESTORER|SA_RESTART, 0x7f094452eff0}, {SIG_DFL, [ALRM], SA_RESTORER|SA_RESTART, 0x7f094452eff0}, 8) = 0
rt_sigprocmask(SIG_BLOCK, NULL, [], 8)  = 0
setitimer(ITIMER_REAL, {it_interval={0, 0}, it_value={900, 0}}, NULL) = 0
read(4, "\27\3\1\5S", 5)                = 5
read(4, "+8\177\336\310q\t\215\370~#\215\234\265\10\24yxR\222l\354\237w\31\332\362\265B`@\210"..., 1363) = 1363
setitimer(ITIMER_REAL, {it_interval={0, 0}, it_value={0, 0}}, NULL) = 0
rt_sigaction(SIGALRM, {SIG_DFL, [ALRM], SA_RESTORER|SA_RESTART, 0x7f094452eff0}, {0x42c180, [ALRM], SA_RESTORER|SA_RESTART, 0x7f094452eff0}, 8) = 0
write(3, "\375\264\276\33*Y\335\217\257\32\322\216)f\334\26\2348\251\316tYG\\\215=[x\3\242{\363"..., 1347) = 1347
select(5, [4], NULL, NULL, {0, 950000}) = 1 (in [4], left {0, 949997})
rt_sigaction(SIGALRM, {0x42c180, [ALRM], SA_RESTORER|SA_RESTART, 0x7f094452eff0}, {SIG_DFL, [ALRM], SA_RESTORER|SA_RESTART, 0x7f094452eff0}, 8) = 0
rt_sigprocmask(SIG_BLOCK, NULL, [], 8)  = 0
setitimer(ITIMER_REAL, {it_interval={0, 0}, it_value={900, 0}}, NULL) = 0
read(4, "\27\3\1\5S", 5)                = 5
read(4, "<r_\367\303\343\323\232\207x\3448k\1\6\232\322M\246\347\257\216\373\240J\fx\362\253@\24\227"..., 1363) = 1363
setitimer(ITIMER_REAL, {it_interval={0, 0}, it_value={0, 0}}, NULL) = 0
rt_sigaction(SIGALRM, {SIG_DFL, [ALRM], SA_RESTORER|SA_RESTART, 0x7f094452eff0}, {0x42c180, [ALRM], SA_RESTORER|SA_RESTART, 0x7f094452eff0}, 8) = 0
write(3, "\373\273\241\245;N\312\"\204\206\2222\314\0\276A\312\204:\332\232\200)MG\370\340\3363zy\347"..., 1347) = 1347
select(5, [4], NULL, NULL, {0, 950000}) = 1 (in [4], left {0, 949997})
rt_sigaction(SIGALRM, {0x42c180, [ALRM], SA_RESTORER|SA_RESTART, 0x7f094452eff0}, {SIG_DFL, [ALRM], SA_RESTORER|SA_RESTART, 0x7f094452eff0}, 8) = 0
rt_sigprocmask(SIG_BLOCK, NULL, [], 8)  = 0
setitimer(ITIMER_REAL, {it_interval={0, 0}, it_value={900, 0}}, NULL) = 0
read(4, "\27\3\1\5S", 5)                = 5
read(4, "A\376\335\330D\337\325\211\346\4P4\273\30%\245D\201\17\365\322)\304\305\257\336\245\206\360?\274\344"..., 1363) = 1363
