open("/etc/nsswitch.conf", O_RDONLY|O_CLOEXEC) = 3
fstat(3, {st_mode=S_IFREG|0644, st_size=507, ...}) = 0
mmap(NULL, 4096, PROT_READ|PROT_WRITE, MAP_PRIVATE|MAP_ANONYMOUS, -1, 0) = 0x7fc21fdf3000
read(3, "# /etc/nsswitch.conf\n#\n# Example"..., 4096) = 507
read(3, "", 4096)                       = 0
close(3)                                = 0
munmap(0x7fc21fdf3000, 4096)            = 0
open("/etc/host.conf", O_RDONLY|O_CLOEXEC) = 3
fstat(3, {st_mode=S_IFREG|0644, st_size=92, ...}) = 0
mmap(NULL, 4096, PROT_READ|PROT_WRITE, MAP_PRIVATE|MAP_ANONYMOUS, -1, 0) = 0x7fc21fdf3000
read(3, "# The \"order\" line is only used "..., 4096) = 92
read(3, "", 4096)                       = 0
close(3)                                = 0
munmap(0x7fc21fdf3000, 4096)            = 0
getpid()                                = 8909
open("/etc/resolv.conf", O_RDONLY|O_CLOEXEC) = 3
fstat(3, {st_mode=S_IFREG|0644, st_size=187, ...}) = 0
mmap(NULL, 4096, PROT_READ|PROT_WRITE, MAP_PRIVATE|MAP_ANONYMOUS, -1, 0) = 0x7fc21fdf3000
read(3, "# Dynamic resolv.conf(5) file fo"..., 4096) = 187
read(3, "", 4096)                       = 0
close(3)                                = 0
munmap(0x7fc21fdf3000, 4096)            = 0
open("/etc/ld.so.cache", O_RDONLY|O_CLOEXEC) = 3
fstat(3, {st_mode=S_IFREG|0644, st_size=115291, ...}) = 0
mmap(NULL, 115291, PROT_READ, MAP_PRIVATE, 3, 0) = 0x7fc21fdd7000
close(3)                                = 0
access("/etc/ld.so.nohwcap", F_OK)      = -1 ENOENT (No such file or directory)
open("/lib/x86_64-linux-gnu/libnss_files.so.2", O_RDONLY|O_CLOEXEC) = 3
read(3, "\177ELF\2\1\1\0\0\0\0\0\0\0\0\0\3\0>\0\1\0\0\0\240\"\0\0\0\0\0\0"..., 832) = 832
fstat(3, {st_mode=S_IFREG|0644, st_size=47712, ...}) = 0
mmap(NULL, 2144392, PROT_READ|PROT_EXEC, MAP_PRIVATE|MAP_DENYWRITE, 3, 0) = 0x7fc21e4ac000
mprotect(0x7fc21e4b7000, 2093056, PROT_NONE) = 0
mmap(0x7fc21e6b6000, 8192, PROT_READ|PROT_WRITE, MAP_PRIVATE|MAP_FIXED|MAP_DENYWRITE, 3, 0xa000) = 0x7fc21e6b6000
close(3)                                = 0
mprotect(0x7fc21e6b6000, 4096, PROT_READ) = 0
munmap(0x7fc21fdd7000, 115291)          = 0
open("/etc/hosts", O_RDONLY|O_CLOEXEC)  = 3
fstat(3, {st_mode=S_IFREG|0644, st_size=219, ...}) = 0
mmap(NULL, 4096, PROT_READ|PROT_WRITE, MAP_PRIVATE|MAP_ANONYMOUS, -1, 0) = 0x7fc21fdf3000
read(3, "127.0.0.1\tlocalhost\n127.0.1.1\tdo"..., 4096) = 219
read(3, "", 4096)                       = 0
close(3)                                = 0
munmap(0x7fc21fdf3000, 4096)            = 0
open("/etc/ld.so.cache", O_RDONLY|O_CLOEXEC) = 3
fstat(3, {st_mode=S_IFREG|0644, st_size=115291, ...}) = 0
mmap(NULL, 115291, PROT_READ, MAP_PRIVATE, 3, 0) = 0x7fc21fdd7000
close(3)                                = 0
access("/etc/ld.so.nohwcap", F_OK)      = -1 ENOENT (No such file or directory)
open("/lib/x86_64-linux-gnu/libnss_mdns4_minimal.so.2", O_RDONLY|O_CLOEXEC) = 3
read(3, "\177ELF\2\1\1\0\0\0\0\0\0\0\0\0\3\0>\0\1\0\0\0\20\f\0\0\0\0\0\0"..., 832) = 832
fstat(3, {st_mode=S_IFREG|0644, st_size=10432, ...}) = 0
mmap(NULL, 2105560, PROT_READ|PROT_EXEC, MAP_PRIVATE|MAP_DENYWRITE, 3, 0) = 0x7fc21e2a9000
mprotect(0x7fc21e2ab000, 2093056, PROT_NONE) = 0
mmap(0x7fc21e4aa000, 8192, PROT_READ|PROT_WRITE, MAP_PRIVATE|MAP_FIXED|MAP_DENYWRITE, 3, 0x1000) = 0x7fc21e4aa000
close(3)                                = 0
mprotect(0x7fc21e4aa000, 4096, PROT_READ) = 0
munmap(0x7fc21fdd7000, 115291)          = 0
open("/etc/ld.so.cache", O_RDONLY|O_CLOEXEC) = 3
fstat(3, {st_mode=S_IFREG|0644, st_size=115291, ...}) = 0
mmap(NULL, 115291, PROT_READ, MAP_PRIVATE, 3, 0) = 0x7fc21fdd7000
close(3)                                = 0
access("/etc/ld.so.nohwcap", F_OK)      = -1 ENOENT (No such file or directory)
open("/lib/x86_64-linux-gnu/libnss_dns.so.2", O_RDONLY|O_CLOEXEC) = 3
read(3, "\177ELF\2\1\1\0\0\0\0\0\0\0\0\0\3\0>\0\1\0\0\0\0\21\0\0\0\0\0\0"..., 832) = 832
fstat(3, {st_mode=S_IFREG|0644, st_size=22952, ...}) = 0
mmap(NULL, 2117896, PROT_READ|PROT_EXEC, MAP_PRIVATE|MAP_DENYWRITE, 3, 0) = 0x7fc21e0a3000
mprotect(0x7fc21e0a8000, 2093056, PROT_NONE) = 0
mmap(0x7fc21e2a7000, 8192, PROT_READ|PROT_WRITE, MAP_PRIVATE|MAP_FIXED|MAP_DENYWRITE, 3, 0x4000) = 0x7fc21e2a7000
close(3)                                = 0
access("/etc/ld.so.nohwcap", F_OK)      = -1 ENOENT (No such file or directory)
open("/lib/x86_64-linux-gnu/libresolv.so.2", O_RDONLY|O_CLOEXEC) = 3
read(3, "\177ELF\2\1\1\0\0\0\0\0\0\0\0\0\3\0>\0\1\0\0\0\320:\0\0\0\0\0\0"..., 832) = 832
fstat(3, {st_mode=S_IFREG|0644, st_size=101240, ...}) = 0
mmap(NULL, 2206376, PROT_READ|PROT_EXEC, MAP_PRIVATE|MAP_DENYWRITE, 3, 0) = 0x7fc21de88000
mprotect(0x7fc21de9f000, 2097152, PROT_NONE) = 0
