select(4, [3], NULL, NULL, {0, 950000}) = 1 (in [3], left {0, 949997})
read(3, "\307\3\206#(\363N\353\17o\277\341J\312\306\322\233{\31\36\201\354\237\376>\237\377\0lg\374\240"..., 8192) = 2736
write(4, "\307\3\206#(\363N\353\17o\277\341J\312\306\322\233{\31\36\201\354\237\376>\237\377\0lg\374\240"..., 2736) = 2736
select(4, [3], NULL, NULL, {0, 950000}) = 1 (in [3], left {0, 949997})
read(3, "C\353`j\264L\312O\tyu\304u\342\vQR\211\2\214\0q\340!\266\370\202\324tK\2041"..., 8192) = 2736
write(4, "C\353`j\264L\312O\tyu\304u\342\vQR\211\2\214\0q\340!\266\370\202\324tK\2041"..., 2736) = 2736
select(4, [3], NULL, NULL, {0, 950000}) = 1 (in [3], left {0, 949958})
read(3, "\237\25\333\307\234\334)\242\217pt\300\277\357\210\253R\243\331\377\0\374{]JO\260\305\355\275\240$"..., 8192) = 1368
write(4, "\237\25\333\307\234\334)\242\217pt\300\277\357\210\253R\243\331\377\0\374{]JO\260\305\355\275\240$"..., 1368) = 1368
select(4, [3], NULL, NULL, {0, 950000}) = 1 (in [3], left {0, 949997})
read(3, "\0g\234yWzn_\310\260p7\361\252l&\271#\320\235\221\335\266\262:\33O\260G\256\355]"..., 8192) = 1368
write(4, "\0g\234yWzn_\310\260p7\361\252l&\271#\320\235\221\335\266\262:\33O\260G\256\355]"..., 1368) = 1368
select(4, [3], NULL, NULL, {0, 950000}) = 1 (in [3], left {0, 949043})
read(3, "Y\346\205\301\332t\237\371\33#\317\241<\332w\231\224\237-\256bc$\200Nq\316\354\177\220c\334"..., 8192) = 2736
write(4, "Y\346\205\301\332t\237\371\33#\317\241<\332w\231\224\237-\256bc$\200Nq\316\354\177\220c\334"..., 2736) = 2736
select(4, [3], NULL, NULL, {0, 950000}) = 1 (in [3], left {0, 949926})
read(3, "kb\230\334\317\326\215h\245\246\17\236\366\215'J\360I3\22\23\4\304\333W\325/\n\25s\301\253"..., 8192) = 1368
write(4, "kb\230\334\317\326\215h\245\246\17\236\366\215'J\360I3\22\23\4\304\333W\325/\n\25s\301\253"..., 1368) = 1368
select(4, [3], NULL, NULL, {0, 950000}) = 1 (in [3], left {0, 937848})
read(3, "\2\0\4#\24N\\\177_\\\2040]F\325\217f8v\343\2146\365\35\246\232\214\231\372!<\207"..., 8192) = 1368
write(4, "\2\0\4#\24N\\\177_\\\2040]F\325\217f8v\343\2146\365\35\246\232\214\231\372!<\207"..., 1368) = 1368
select(4, [3], NULL, NULL, {0, 950000}) = 1 (in [3], left {0, 948476})
read(3, "\352\277\342x\37\362n\343\227u\335\263\342\316\276Ly\\c\341\323k\375G\250>)\320j\266\324\211"..., 8192) = 5472
write(4, "\352\277\342x\37\362n\343\227u\335\263\342\316\276Ly\\c\341\323k\375G\250>)\320j\266\324\211"..., 4096) = 4096
write(4, "\225m\353r5l\250E0-s\37[sqg\360\201\4\211b;\344\217Lil\266\376\364\327S"..., 1376) = 1376
select(4, [3], NULL, NULL, {0, 950000}) = 1 (in [3], left {0, 949248})
read(3, "\335cO\241z\211\26\31\270\365\255\r5M\352\272\225\340\371C.\322\253A[S\tZ\20\330 \226"..., 8192) = 1368
write(4, "\335cO\241z\211\26\31\270\365\255\r5M\352\272\225\340\371C.\322\253A[S\tZ\20\330 \226"..., 1368) = 1368
select(4, [3], NULL, NULL, {0, 950000}) = 1 (in [3], left {0, 949595})
read(3, "\306:x\372\21\226\375E{\2711\n\343\234do\345\362\2270*\232\233\10\233\236\177lV\330\275\t"..., 8192) = 2736
write(4, "\306:x\372\21\226\375E{\2711\n\343\234do\345\362\2270*\232\233\10\233\236\177lV\330\275\t"..., 2736) = 2736
select(4, [3], NULL, NULL, {0, 950000}) = 1 (in [3], left {0, 949912})
read(3, "\10\313,|\275P\221u\2500\21\2018a\2u\220\255Z\201\201\302\t>\0\225\7\0\312x\371q"..., 8192) = 2736
write(4, "\10\313,|\275P\221u\2500\21\2018a\2u\220\255Z\201\201\302\t>\0\225\7\0\312x\371q"..., 2736) = 2736
select(4, [3], NULL, NULL, {0, 950000}) = 1 (in [3], left {0, 949910})
read(3, "\303\353e\264\345\227\346zs2\32M\372\255(\320\335-\202\225]\342\332Pj.\5\34\2\333iA"..., 8192) = 2736
write(4, "\303\353e\264\345\227\346zs2\32M\372\255(\320\335-\202\225]\342\332Pj.\5\34\2\333iA"..., 2736) = 2736
select(4, [3], NULL, NULL, {0, 950000}) = 1 (in [3], left {0, 949908})
read(3, "#7\205\367\26\332P\2\220\242u6\262\2\365\4\251\320\245t(\247\0zcC\23tU \310\251"..., 8192) = 2736
write(4, "#7\205\367\26\332P\2\220\242u6\262\2\365\4\251\320\245t(\247\0zcC\23tU \310\251"..., 2736) = 2736
select(4, [3], NULL, NULL, {0, 950000}) = 1 (in [3], left {0, 949407})
read(3, "\250\2D\261\306}b3;\207m\216<]q&\307\334%\223R\205\255\247\t\246\251\1:\20\22\245"..., 8192) = 1368
write(4, "\250\2D\261\306}b3;\207m\216<]q&\307\334%\223R\205\255\247\t\246\251\1:\20\22\245"..., 1368) = 1368
select(4, [3], NULL, NULL, {0, 950000}) = 1 (in [3], left {0, 949996})
read(3, "So\374\273\344\207\350\334U\246\255FcXh\353\240\177\255/0\0\231\31\234xB\307U\316:\371"..., 8192) = 2736
write(4, "So\374\273\344\207\350\334U\246\255FcXh\353\240\177\255/0\0\231\31\234xB\307U\316:\371"..., 2736) = 2736
select(4, [3], NULL, NULL, {0, 950000}) = 1 (in [3], left {0, 949996})
read(3, "\226\353\37\345<\261\347\241;\356}K\304\273\355\26\272+]\316\212\341O\245u\205\246P\355A=\336"..., 8192) = 2736
write(4, "\226\353\37\345<\261\347\241;\356}K\304\273\355\26\272+]\316\212\341O\245u\205\246P\355A=\336"..., 2736) = 2736
select(4, [3], NULL, NULL, {0, 950000}) = 1 (in [3], left {0, 949997})
read(3, "\262\234'\346\367\305\314>\2215\3636\254\214\245\344\"\356?P\331:i\251\273\245\31t\341\350\215\\"..., 8192) = 2736
write(4, "\262\234'\346\367\305\314>\2215\3636\254\214\245\344\"\356?P\331:i\251\273\245\31t\341\350\215\\"..., 2736) = 2736
select(4, [3], NULL, NULL, {0, 950000}) = 1 (in [3], left {0, 949996})
read(3, "0i\335\223j\223+\235\336\343I]\32\326\262\5[U\24\213\0\352*q\275.&x\16\362t\341"..., 8192) = 1368
write(4, "0i\335\223j\223+\235\336\343I]\32\326\262\5[U\24\213\0\352*q\275.&x\16\362t\341"..., 1368) = 1368
select(4, [3], NULL, NULL, {0, 950000}) = 1 (in [3], left {0, 949996})
read(3, "\320\231\313\243\325\217\266.b\215\"\220\250\3340&\23\330\17l]\304\257b)X\3350\202\222\221/"..., 8192) = 1368
write(4, "\320\231\313\243\325\217\266.b\215\"\220\250\3340&\23\330\17l]\304\257b)X\3350\202\222\221/"..., 1368) = 1368
select(4, [3], NULL, NULL, {0, 950000}) = 1 (in [3], left {0, 903650})
read(3, "uH\34\2\263\306p5I9q\4\255CsA\255\25\4\211\246a)H\2308\270\271\222\254\6\221"..., 8192) = 1368
write(4, "uH\34\2\263\306p5I9q\4\255CsA\255\25\4\211\246a)H\2308\270\271\222\254\6\221"..., 1368) = 1368
select(4, [3], NULL, NULL, {0, 950000}) = 1 (in [3], left {0, 949675})
read(3, "8)\2272\271H4\244\211\200g5(\231\367O\10|\244\323\260B\35_4\256G\256\333N\313t"..., 8192) = 4104
write(4, "8)\2272\271H4\244\211\200g5(\231\367O\10|\244\323\260B\35_4\256G\256\333N\313t"..., 4096) = 4096
write(4, "\322]\311\223\24\25]\331", 8) = 8
select(4, [3], NULL, NULL, {0, 950000}) = 1 (in [3], left {0, 949994})
read(3, "G\336\257\212y\3279(-4U1\322q1\243\216\35\21KR\214\363\254\217\300\320\256\374\333m\310"..., 8192) = 5472
write(4, "G\336\257\212y\3279(-4U1\322q1\243\216\35\21KR\214\363\254\217\300\320\256\374\333m\310"..., 4096) = 4096
write(4, ":\263$\260\222\226\312\2\227\251\"m\250\351:\270H*Q\261\211t\340)\312\363\370\231uk\37\226"..., 1376) = 1376
select(4, [3], NULL, NULL, {0, 950000}) = 1 (in [3], left {0, 949659})
read(3, "s0u\211N,T\262\224\3759~\230ex\360\25$,JP\225\256\272\212\201\t^B\202\20\1"..., 8192) = 2736
write(4, "s0u\211N,T\262\224\3759~\230ex\360\25$,JP\225\256\272\212\201\t^B\202\20\1"..., 2736) = 2736
select(4, [3], NULL, NULL, {0, 950000}) = 1 (in [3], left {0, 949994})
read(3, "\2\24\3303\23\4E\375\203\222\225\31\36\372*\210\264\257\267\25\n\rE\307\24\206VBC\215\310\225"..., 8192) = 4104
write(4, "\2\24\3303\23\4E\375\203\222\225\31\36\372*\210\264\257\267\25\n\rE\307\24\206VBC\215\310\225"..., 4096) = 4096
