stat("/home/bearface/website_output/www.ucla.edu/img/mobile", 0x7fff13a300a0) = -1 ENOENT (No such file or directory)
mkdir("/home/bearface/website_output/www.ucla.edu/img/mobile", 0777) = 0
open("/home/bearface/website_output/www.ucla.edu/img/mobile/sprites-mobile.png", O_WRONLY|O_CREAT|O_TRUNC, 0666) = 4
write(2, "Saving to: \342\200\230/home/bearface/web"..., 90) = 90
write(2, "\n", 1)                       = 1
write(2, "\r", 1)                       = 1
write(2, " 0% [                           "..., 79) = 79
select(4, [3], NULL, NULL, {0, 950000}) = 1 (in [3], left {0, 949994})
read(3, "\211PNG\r\n\32\n\0\0\0\rIHDR\0\0\2X\0\0\2X\10\6\0\0\0\276f\230"..., 8192) = 3695
fstat(4, {st_mode=S_IFREG|0644, st_size=0, ...}) = 0
mmap(NULL, 4096, PROT_READ|PROT_WRITE, MAP_PRIVATE|MAP_ANONYMOUS, -1, 0) = 0x7f6529c37000
write(4, "\211PNG\r\n\32\n\0\0\0\rIHDR\0\0\2X\0\0\2X\10\6\0\0\0\276f\230"..., 3695) = 3695
select(4, [3], NULL, NULL, {0, 950000}) = 1 (in [3], left {0, 886521})
read(3, "\304xye\352A\233\217c\311\332\177T7t\330\252Y}\305\266\267_\273+\306\313\253\2676\261\371"..., 8192) = 1368
write(4, "\304xye\352A\233\217c\311\332\177T7t\330\252Y}\305\266\267_\273+\306\313\253\2676\261\371"..., 1368) = 1368
select(4, [3], NULL, NULL, {0, 950000}) = 1 (in [3], left {0, 949315})
read(3, "\212\5\0\351\242R\274\316 s\353\300\316\342\277GO\353D\243W\227\2264}\334@\361r\217\26\341"..., 8192) = 1368
write(4, "\212\5\0\351\242R\274\316 s\353\300\316\342\277GO\353D\243W\227\2264}\334@\361r\217\26\341"..., 1368) = 1368
select(4, [3], NULL, NULL, {0, 950000}) = 1 (in [3], left {0, 949329})
read(3, "\377\234e\255\2?oZ\212^\31\30-\361g\25\0\371\311\324\350^\324\244\201\345G\233\23\334\271\326"..., 8192) = 1368
write(4, "\377\234e\255\2?oZ\212^\31\30-\361g\25\0\371\311\324\350^\324\244\201\345G\233\23\334\271\326"..., 1368) = 1368
select(4, [3], NULL, NULL, {0, 950000}) = 1 (in [3], left {0, 949997})
read(3, "\327\201\307\30\246\210+i6\\\272^f\344V\324\3200\364\232@\272\n\367ZD-I\356\326\216\255"..., 8192) = 1368
write(4, "\327\201\307\30\246\210+i6\\\272^f\344V\324\3200\364\232@\272\n\367ZD-I\356\326\216\255"..., 1368) = 1368
select(4, [3], NULL, NULL, {0, 950000}) = 1 (in [3], left {0, 948467})
read(3, "\351\335O\377C\237\207\3\377x\276\224\216,6Oj\347h\27P&\233\366\2376^\276\245\257\355\32"..., 8192) = 2736
write(4, "\351\335O\377C\237\207\3\377x\276\224\216,6Oj\347h\27P&\233\366\2376^\276\245\257\355\32"..., 2736) = 2736
select(4, [3], NULL, NULL, {0, 950000}) = 1 (in [3], left {0, 888739})
read(3, "}})\352\225W\250\317\266mT\273G\17|\n\365\354\315<G\277o>@\207Ne\323\352\235G"..., 8192) = 1368
write(4, "}})\352\225W\250\317\266mT\273G\17|\n\365\354\315<G\277o>@\207Ne\323\352\235G"..., 1368) = 1368
select(4, [3], NULL, NULL, {0, 950000}) = 1 (in [3], left {0, 949890})
read(3, "^\6\207\227\314\261\5\27\32\345\334,\3Sf\254\26s\267\200\313\344\3\355\5\222c\372S\272\205\v"..., 8192) = 1368
write(4, "^\6\207\227\314\261\5\27\32\345\334,\3Sf\254\26s\267\200\313\344\3\355\5\222c\372S\272\205\v"..., 1368) = 1368
select(4, [3], NULL, NULL, {0, 950000}) = 1 (in [3], left {0, 947164})
read(3, "\205\220k\5\0\0@\331reM8\274\364\327\363\364\347J/2\317C2\315=2\275\315\332\260W"..., 8192) = 2736
write(4, "\205\220k\5\0\0@\331reM8\274\364\327\363\364\347J/2\317C2\315=2\275\315\332\260W"..., 2736) = 2736
select(4, [3], NULL, NULL, {0, 950000}) = 1 (in [3], left {0, 949995})
read(3, "\263%\364Of1-;TD'r\3134\325\7>\336\3365\272O\rpd\211\243X,W\\y"..., 8192) = 4104
write(4, "\263%\364Of1-;TD'r\3134\325\7>\336\3365\272O\rpd\211\243X,W\\y"..., 4096) = 4096
write(4, "zy\335:\305\277\227\35", 8)   = 8
select(4, [3], NULL, NULL, {0, 950000}) = 1 (in [3], left {0, 949996})
read(3, "\352K\377\225\3079U\257\257\272J\317\367\253E7F\371[](}kV\t\315\336\232OY2\311"..., 8192) = 2736
write(4, "\352K\377\225\3079U\257\257\272J\317\367\253E7F\371[](}kV\t\315\336\232OY2\311"..., 2736) = 2736
select(4, [3], NULL, NULL, {0, 950000}) = 1 (in [3], left {0, 949997})
read(3, "\361\2549\310\325\365%\353\311\313\376f\265\302\f\2225\273n\261br\326xHk\3163\3\304!."..., 8192) = 1368
write(4, "\361\2549\310\325\365%\353\311\313\376f\265\302\f\2225\273n\261br\326xHk\3163\3\304!."..., 1368) = 1368
select(4, [3], NULL, NULL, {0, 950000}) = 1 (in [3], left {0, 949282})
read(3, "\263\37\370\n&\316\251/X\217\361H\217\234\275[\3014;\233\212\320K\367\2373v\201\321\203\v\275"..., 8192) = 1368
write(4, "\263\37\370\n&\316\251/X\217\361H\217\234\275[\3014;\233\212\320K\367\2373v\201\321\203\v\275"..., 1368) = 1368
select(4, [3], NULL, NULL, {0, 950000}) = 1 (in [3], left {0, 949997})
read(3, "\322F\303W\252\301cd\307\272\262\343\2^\256[\305\337/\214\275,\24\t\351e\274\310\32\344\275\265"..., 8192) = 1368
write(4, "\322F\303W\252\301cd\307\272\262\343\2^\256[\305\337/\214\275,\24\t\351e\274\310\32\344\275\265"..., 1368) = 1368
select(4, [3], NULL, NULL, {0, 950000}) = 1 (in [3], left {0, 892138})
read(3, "\034466AKKK\320\233\362\253\353\376z\314=\263\257{\260\267\250\273#\316_\247\0179>\\"..., 8192) = 2736
write(4, "\034466AKKK\320\233\362\253\353\376z\314=\263\257{\260\267\250\273#\316_\247\0179>\\"..., 2736) = 2736
select(4, [3], NULL, NULL, {0, 950000}) = 1 (in [3], left {0, 949995})
read(3, "Ct\243\361\23#\270\fyo\342\277\16\333k\27\321\305\211C\3631]\201\3602y#\4\203\211B"..., 8192) = 2736
write(4, "Ct\243\361\23#\270\fyo\342\277\16\333k\27\321\305\211C\3631]\201\3602y#\4\203\211B"..., 2736) = 2736
select(4, [3], NULL, NULL, {0, 950000}) = 1 (in [3], left {0, 945909})
read(3, "\325Z\236V/#B\36zO\353\370\265\301kd{\351*\20\262B81\267i\347c\322\212\2013"..., 8192) = 1368
write(4, "\325Z\236V/#B\36zO\353\370\265\301kd{\351*\20\262B81\267i\347c\322\212\2013"..., 1368) = 1368
write(2, "\r", 1)                       = 1
write(2, "67% [=========================> "..., 79) = 79
select(4, [3], NULL, NULL, {0, 950000}) = 1 (in [3], left {0, 949993})
read(3, "\330j\321\"\370}_\321\320\224Y\\\333\260\324\315\246\36H\177\305\177\26\374\332\250A\300\364\273\217\245"..., 8192) = 2736
write(4, "\330j\321\"\370}_\321\320\224Y\\\333\260\324\315\246\36H\177\305\177\26\374\332\250A\300\364\273\217\245"..., 2736) = 2736
select(4, [3], NULL, NULL, {0, 950000}) = 1 (in [3], left {0, 949995})
read(3, "\366\355e\367>\272\315\345\247\36\263K,\22^o9r\222\231,\234{\335\35\213\352\232\323_\351e"..., 8192) = 2736
write(4, "\366\355e\367>\272\315\345\247\36\263K,\22^o9r\222\231,\234{\335\35\213\352\232\323_\351e"..., 2736) = 2736
select(4, [3], NULL, NULL, {0, 950000}) = 1 (in [3], left {0, 949996})
read(3, "\321c\300aJ\202$\177\357\6H#\224\264\302\325\32\217\273\\C;|h\222\204\267M\0\225\23b"..., 8192) = 2736
write(4, "\321c\300aJ\202$\177\357\6H#\224\264\302\325\32\217\273\\C;|h\222\204\267M\0\225\23b"..., 2736) = 2736
select(4, [3], NULL, NULL, {0, 950000}) = 1 (in [3], left {0, 949994})
read(3, "\210\200cb|\323\273\231\306on\1\260\226K\30\247\0048\255\221\231\1+\31\262su_\344\232g"..., 8192) = 2736
write(4, "\210\200cb|\323\273\231\306on\1\260\226K\30\247\0048\255\221\231\1+\31\262su_\344\232g"..., 2736) = 2736
