read(3, "edu\" title=\"\">Global</a></li>\n<l"..., 8192) = 80
write(4, "edu\" title=\"\">Global</a></li>\n<l"..., 80) = 80
select(4, [3], NULL, NULL, {0, 950000}) = 1 (in [3], left {0, 949545})
read(3, "em__research\"><a href=\"http://re"..., 8192) = 2896
write(4, "em__research\"><a href=\"http://re"..., 2896) = 2896
select(4, [3], NULL, NULL, {0, 950000}) = 1 (in [3], left {0, 949994})
read(3, "nts\">For Parents</a></div></div>"..., 8192) = 1368
write(4, "nts\">For Parents</a></div></div>"..., 1368) = 1368
select(4, [3], NULL, NULL, {0, 950000}) = 1 (in [3], left {0, 949786})
read(3, "</div><div class=\"menu-item coun"..., 8192) = 80
write(4, "</div><div class=\"menu-item coun"..., 80) = 80
select(4, [3], NULL, NULL, {0, 950000}) = 1 (in [3], left {0, 949997})
read(3, "les/flash_articles/\">School of M"..., 8192) = 2896
write(4, "les/flash_articles/\">School of M"..., 2896) = 2896
select(4, [3], NULL, NULL, {0, 950000}) = 1 (in [3], left {0, 949997})
read(3, "dmissions.duke.edu/education/env"..., 8192) = 4344
write(4, "dmissions.duke.edu/education/env"..., 4096) = 4096
write(4, "eading\"><a href=\"http://arts.duk"..., 248) = 248
select(4, [3], NULL, NULL, {0, 950000}) = 1 (in [3], left {0, 949997})
read(3, ".edu\">Nasher Museum</a></div><di"..., 8192) = 4344
write(4, ".edu\">Nasher Museum</a></div><di"..., 4096) = 4096
write(4, "-mega-dropdown-research\" class=\""..., 248) = 248
select(4, [3], NULL, NULL, {0, 950000}) = 1 (in [3], left {0, 949773})
read(3, "v class=\"panel-panel panel-col\">"..., 8192) = 2896
write(4, "v class=\"panel-panel panel-col\">"..., 2896) = 2896
select(4, [3], NULL, NULL, {0, 950000}) = 1 (in [3], left {0, 949996})
read(3, "  <div><div class=\"panel-pane pa"..., 8192) = 4344
write(4, "  <div><div class=\"panel-pane pa"..., 4096) = 4096
write(4, "s=\"bigduke-top-feature__word\">\n "..., 248) = 248
select(4, [3], NULL, NULL, {0, 950000}) = 1 (in [3], left {0, 949997})
read(3, "font-weight:bold;font-size:30px;"..., 8192) = 2896
write(4, "font-weight:bold;font-size:30px;"..., 2896) = 2896
select(4, [3], NULL, NULL, {0, 950000}) = 1 (in [3], left {0, 949997})
read(3, "ul>  <li class=\"views-row views-"..., 8192) = 1448
write(4, "ul>  <li class=\"views-row views-"..., 1448) = 1448
select(4, [3], NULL, NULL, {0, 950000}) = 1 (in [3], left {0, 949997})
read(3, ">\n\n      <a href=\"http://today.d"..., 8192) = 2896
write(4, ">\n\n      <a href=\"http://today.d"..., 2896) = 2896
select(4, [3], NULL, NULL, {0, 950000}) = 1 (in [3], left {0, 946809})
read(3, " rel=\"bookmark\">Inviting In the "..., 8192) = 1448
write(4, " rel=\"bookmark\">Inviting In the "..., 1448) = 1448
select(4, [3], NULL, NULL, {0, 950000}) = 1 (in [3], left {0, 949994})
read(3, "kemedicine.org/news_and_publicat"..., 8192) = 2896
write(4, "kemedicine.org/news_and_publicat"..., 2896) = 2896
select(4, [3], NULL, NULL, {0, 950000}) = 1 (in [3], left {0, 949995})
read(3, "th=\"138\" /></noscript>\n    </a>\n"..., 8192) = 1448
write(4, "th=\"138\" /></noscript>\n    </a>\n"..., 1448) = 1448
select(4, [3], NULL, NULL, {0, 950000}) = 1 (in [3], left {0, 949996})
read(3, "e in a young girl's life</p>\n  <"..., 8192) = 2896
write(4, "e in a young girl's life</p>\n  <"..., 2896) = 2896
select(4, [3], NULL, NULL, {0, 950000}) = 1 (in [3], left {0, 949996})
read(3, "s/alaska138.jpg\" height=\"95\" wid"..., 8192) = 2896
write(4, "s/alaska138.jpg\" height=\"95\" wid"..., 2896) = 2896
select(4, [3], NULL, NULL, {0, 950000}) = 1 (in [3], left {0, 949995})
read(3, "div class=\"node__content\">\n    \n"..., 8192) = 1448
write(4, "div class=\"node__content\">\n    \n"..., 1448) = 1448
select(4, [3], NULL, NULL, {0, 950000}) = 1 (in [3], left {0, 949345})
read(3, "=\"http://today.duke.edu/2014/06/"..., 8192) = 2896
write(4, "=\"http://today.duke.edu/2014/06/"..., 2896) = 2896
select(4, [3], NULL, NULL, {0, 950000}) = 1 (in [3], left {0, 949995})
read(3, " More Efficient</a></h3>\n       "..., 8192) = 2896
write(4, " More Efficient</a></h3>\n       "..., 2896) = 2896
select(4, [3], NULL, NULL, {0, 950000}) = 1 (in [3], left {0, 949997})
read(3, "/today.duke.edu/sites/default/fi"..., 8192) = 2896
write(4, "/today.duke.edu/sites/default/fi"..., 2896) = 2896
select(4, [3], NULL, NULL, {0, 950000}) = 1 (in [3], left {0, 949997})
read(3, "-today-feature--full\">\n\n      <a"..., 8192) = 1448
write(4, "-today-feature--full\">\n\n      <a"..., 1448) = 1448
select(4, [3], NULL, NULL, {0, 950000}) = 1 (in [3], left {0, 949997})
read(3, "   <a href=\"http://www.nytimes.c"..., 8192) = 2896
write(4, "   <a href=\"http://www.nytimes.c"..., 2896) = 2896
select(4, [3], NULL, NULL, {0, 950000}) = 1 (in [3], left {0, 949997})
read(3, "ils/soldiercollege_thumb.jpg\" he"..., 8192) = 2896
write(4, "ils/soldiercollege_thumb.jpg\" he"..., 2896) = 2896
select(4, [3], NULL, NULL, {0, 950000}) = 1 (in [3], left {0, 944725})
