write(2, " 0% [                           "..., 79) = 79
select(4, [3], NULL, NULL, {0, 950000}) = 1 (in [3], left {0, 949997})
read(3, "<!DOCTYPE html>\n<html lang=\"en-U"..., 8192) = 4498
fstat(4, {st_mode=S_IFREG|0644, st_size=0, ...}) = 0
mmap(NULL, 4096, PROT_READ|PROT_WRITE, MAP_PRIVATE|MAP_ANONYMOUS, -1, 0) = 0x7ff2d5a6d000
write(4, "<!DOCTYPE html>\n<html lang=\"en-U"..., 4096) = 4096
write(4, " \t\t\t\tvar s = document.getElement"..., 402) = 402
select(4, [3], NULL, NULL, {0, 950000}) = 1 (in [3], left {0, 944705})
read(3, "c=g;m.parentNode.insertBefore(a,"..., 8192) = 532
write(4, "c=g;m.parentNode.insertBefore(a,"..., 532) = 532
select(4, [3], NULL, NULL, {0, 950000}) = 1 (in [3], left {0, 949351})
read(3, "am .description .image {\r\n  back"..., 8192) = 496
write(4, "am .description .image {\r\n  back"..., 496) = 496
select(4, [3], NULL, NULL, {0, 950000}) = 1 (in [3], left {0, 949528})
read(3, "px; display:block;}\r\n\r\n.slb_data"..., 8192) = 1448
write(4, "px; display:block;}\r\n\r\n.slb_data"..., 1448) = 1448
select(4, [3], NULL, NULL, {0, 950000}) = 1 (in [3], left {0, 949293})
read(3, "bg-minify\">-</div>\n\t<div id=\"abo"..., 8192) = 2896
write(4, "bg-minify\">-</div>\n\t<div id=\"abo"..., 2896) = 2896
select(4, [3], NULL, NULL, {0, 950000}) = 1 (in [3], left {0, 949998})
read(3, "maps/?q=\">\n\t\t\t\t\t\t\t\t\t\tPlaces </la"..., 8192) = 1448
write(4, "maps/?q=\">\n\t\t\t\t\t\t\t\t\t\tPlaces </la"..., 1448) = 1448
select(4, [3], NULL, NULL, {0, 950000}) = 1 (in [3], left {0, 949378})
read(3, "v> <!-- #header-top -->\n\n\t\t<nav "..., 8192) = 1448
write(4, "v> <!-- #header-top -->\n\n\t\t<nav "..., 1448) = 1448
select(4, [3], NULL, NULL, {0, 950000}) = 1 (in [3], left {0, 946731})
read(3, "930\" class=\"menu-item menu-item-"..., 8192) = 1368
write(4, "930\" class=\"menu-item menu-item-"..., 1368) = 1368
select(4, [3], NULL, NULL, {0, 950000}) = 1 (in [3], left {0, 949285})
read(3, "rent Students</a></li>\n<li id=\"m"..., 8192) = 80
write(4, "rent Students</a></li>\n<li id=\"m"..., 80) = 80
select(4, [3], NULL, NULL, {0, 950000}) = 1 (in [3], left {0, 949301})
read(3, "post_type menu-item-object-page "..., 8192) = 1448
write(4, "post_type menu-item-object-page "..., 1448) = 1448
select(4, [3], NULL, NULL, {0, 950000}) = 1 (in [3], left {0, 949929})
read(3, "em-34573\" class=\"menu-item menu-"..., 8192) = 1448
write(4, "em-34573\" class=\"menu-item menu-"..., 1448) = 1448
select(4, [3], NULL, NULL, {0, 950000}) = 1 (in [3], left {0, 949538})
read(3, " menu-item-object-custom\"><a hre"..., 8192) = 1448
write(4, " menu-item-object-custom\"><a hre"..., 1448) = 1448
select(4, [3], NULL, NULL, {0, 950000}) = 1 (in [3], left {0, 949896})
read(3, "nu-item-object-custom menu-item-"..., 8192) = 1448
write(4, "nu-item-object-custom menu-item-"..., 1448) = 1448
select(4, [3], NULL, NULL, {0, 950000}) = 1 (in [3], left {0, 949255})
read(3, "\t\t\t\t\t\t\t<div class=\"slide-graphic"..., 8192) = 1448
write(4, "\t\t\t\t\t\t\t<div class=\"slide-graphic"..., 1448) = 1448
select(4, [3], NULL, NULL, {0, 950000}) = 1 (in [3], left {0, 949997})
read(3, "40\" height=\"248\" src=\"http://www"..., 8192) = 1448
write(4, "40\" height=\"248\" src=\"http://www"..., 1448) = 1448
select(4, [3], NULL, NULL, {0, 950000}) = 1 (in [3], left {0, 949929})
read(3, "\t\t\t\t\t\t\t<h1 class=\"title\"><a href"..., 8192) = 1448
write(4, "\t\t\t\t\t\t\t<h1 class=\"title\"><a href"..., 1448) = 1448
select(4, [3], NULL, NULL, {0, 950000}) = 1 (in [3], left {0, 949998})
read(3, "lide-pager-wrapper -->\n\t\t\t\t\t\t<di"..., 8192) = 1448
write(4, "lide-pager-wrapper -->\n\t\t\t\t\t\t<di"..., 1448) = 1448
select(4, [3], NULL, NULL, {0, 950000}) = 1 (in [3], left {0, 949998})
read(3, "g-pros-cons/\">READ MORE >></a></"..., 8192) = 1448
write(4, "g-pros-cons/\">READ MORE >></a></"..., 1448) = 1448
select(4, [3], NULL, NULL, {0, 950000}) = 1 (in [3], left {0, 948964})
read(3, "le/\">Ackland summer exhibition c"..., 8192) = 1448
write(4, "le/\">Ackland summer exhibition c"..., 1448) = 1448
select(4, [3], NULL, NULL, {0, 950000}) = 1 (in [3], left {0, 949998})
read(3, "excerpt\">\n\t\t\t\t\t\t\t\t\t\t\t<h3><a href"..., 8192) = 1368
write(4, "excerpt\">\n\t\t\t\t\t\t\t\t\t\t\t<h3><a href"..., 1368) = 1368
select(4, [3], NULL, NULL, {0, 950000}) = 1 (in [3], left {0, 949492})
read(3, "\">Campus Updates ARCHIVE &raquo;"..., 8192) = 80
write(4, "\">Campus Updates ARCHIVE &raquo;"..., 80) = 80
select(4, [3], NULL, NULL, {0, 950000}) = 1 (in [3], left {0, 949525})
read(3, "eam\">\n\t\t\t\t\t\t\t<h2>Photo Stream\n\t\t"..., 8192) = 1448
write(4, "eam\">\n\t\t\t\t\t\t\t<h2>Photo Stream\n\t\t"..., 1448) = 1448
select(4, [3], NULL, NULL, {0, 950000}) = 1 (in [3], left {0, 949294})
read(3, "s=\"clear\"></div>\n\t\t\t\t\t</div><!--"..., 7047) = 1368
write(4, "s=\"clear\"></div>\n\t\t\t\t\t</div><!--"..., 1368) = 1368
select(4, [3], NULL, NULL, {0, 950000}) = 1 (in [3], left {0, 948787})
read(3, "nt\">\n\t\t\t\t\t<div class=\"date\">\n\t\t\t"..., 5679) = 80
