close(4)                                = 0
munmap(0x7f6529c37000, 4096)            = 0
stat("/etc/localtime", {st_mode=S_IFREG|0644, st_size=3519, ...}) = 0
utime("/home/bearface/website_output/www.ucla.edu/css/fonts/proximanova-regular.eot", [2014/06/30-12:17:39, 2014/05/01-15:09:18]) = 0
write(2, "2014-06-30 12:17:39 (166 KB/s) -"..., 137) = 137
statfs("/home/bearface/website_output/www.ucla.edu/css/fonts", {f_type="EXT2_SUPER_MAGIC", f_bsize=4096, f_blocks=59275954, f_bfree=49141198, f_bavail=46124392, f_files=15065088, f_ffree=14788407, f_fsid={533008265, 2108930253}, f_namelen=255, f_frsize=4096}) = 0
stat("/home/bearface/website_output/www.ucla.edu/css/fonts/proximanova-regular.eot?", 0x7fff13a30660) = -1 ENOENT (No such file or directory)
stat("/home/bearface/website_output/www.ucla.edu/css/fonts/proximanova-regular.eot?", 0x7fff13a306f0) = -1 ENOENT (No such file or directory)
statfs("/home/bearface/website_output/www.ucla.edu/css/fonts", {f_type="EXT2_SUPER_MAGIC", f_bsize=4096, f_blocks=59275954, f_bfree=49141198, f_bavail=46124392, f_files=15065088, f_ffree=14788407, f_fsid={533008265, 2108930253}, f_namelen=255, f_frsize=4096}) = 0
stat("/home/bearface/website_output/www.ucla.edu/css/fonts/proximanova-regular.eot?", 0x7fff13a30660) = -1 ENOENT (No such file or directory)
nanosleep({1, 0}, 0x7fff13a30770)       = 0
stat("/etc/localtime", {st_mode=S_IFREG|0644, st_size=3519, ...}) = 0
write(2, "--2014-06-30 12:17:40--  http://"..., 80) = 80
select(4, [3], NULL, NULL, {0, 1})      = 0 (Timeout)
getpeername(3, {sa_family=AF_INET, sin_port=htons(80), sin_addr=inet_addr("164.67.228.152")}, [16]) = 0
write(2, "Reusing existing connection to w"..., 48) = 48
select(4, NULL, [3], NULL, {900, 0})    = 1 (out [3], left {899, 999997})
write(3, "GET /css/fonts/proximanova-regul"..., 173) = 173
write(2, "HTTP request sent, awaiting resp"..., 40) = 40
select(4, [3], NULL, NULL, {900, 0})    = 1 (in [3], left {899, 933259})
recvfrom(3, "HTTP/1.1 200 OK\r\nContent-Type: a"..., 511, MSG_PEEK, NULL, NULL) = 511
read(3, "HTTP/1.1 200 OK\r\nContent-Type: a"..., 424) = 424
write(2, "200 OK\n", 7)                 = 7
stat("/home/bearface/website_output/www.ucla.edu/css/fonts/proximanova-regular.eot?", 0x7fff13a30190) = -1 ENOENT (No such file or directory)
write(2, "Length: ", 8)                 = 8
write(2, "22911", 5)                    = 5
write(2, " (22K)", 6)                   = 6
write(2, " [application/octet-stream]\n", 28) = 28
stat("/home/bearface/website_output/www.ucla.edu/css/fonts", {st_mode=S_IFDIR|0755, st_size=4096, ...}) = 0
open("/home/bearface/website_output/www.ucla.edu/css/fonts/proximanova-regular.eot?", O_WRONLY|O_CREAT|O_TRUNC, 0666) = 4
write(2, "Saving to: \342\200\230/home/bearface/web"..., 95) = 95
write(2, "\n", 1)                       = 1
write(2, "\r", 1)                       = 1
write(2, " 0% [                           "..., 79) = 79
select(4, [3], NULL, NULL, {0, 950000}) = 1 (in [3], left {0, 949997})
read(3, "\177Y\0\0\223X\0\0\2\0\2\0\4\0\0\0\2\0\5\6\3\0\0\2\0\4\1\0\220\1\0\0"..., 8192) = 3680
fstat(4, {st_mode=S_IFREG|0644, st_size=0, ...}) = 0
mmap(NULL, 4096, PROT_READ|PROT_WRITE, MAP_PRIVATE|MAP_ANONYMOUS, -1, 0) = 0x7f6529c37000
write(4, "\177Y\0\0\223X\0\0\2\0\2\0\4\0\0\0\2\0\5\6\3\0\0\2\0\4\1\0\220\1\0\0"..., 3680) = 3680
select(4, [3], NULL, NULL, {0, 950000}) = 1 (in [3], left {0, 884664})
read(3, "2\327\254p\336'\232Z\36\334\274\311~\377\227s\304\363#\23^\321\10\254\22\341Il\357\345\7\361"..., 8192) = 1368
write(4, "2\327\254p\336'\232Z\36\334\274\311~\377\227s\304\363#\23^\321\10\254\22\341Il\357\345\7\361"..., 1368) = 1368
select(4, [3], NULL, NULL, {0, 950000}) = 1 (in [3], left {0, 949584})
read(3, "\364\252\224\326\32\2t\24&\247\250\247&g\30K\246i\32\332\342\240cRVn\305Jg\353\260\252"..., 8192) = 4104
write(4, "\364\252\224\326\32\2t\24&\247\250\247&g\30K\246i\32\332\342\240cRVn\305Jg\353\260\252"..., 4096) = 4096
write(4, "\355k\3064\321\1\2206", 8)    = 8
select(4, [3], NULL, NULL, {0, 950000}) = 1 (in [3], left {0, 949994})
read(3, "\310\277\202\0\306(e\4\31\300\252RCQc\23O\3560e\365\302L\270\22\317@wT\t\246\340"..., 8192) = 2736
write(4, "\310\277\202\0\306(e\4\31\300\252RCQc\23O\3560e\365\302L\270\22\317@wT\t\246\340"..., 2736) = 2736
select(4, [3], NULL, NULL, {0, 950000}) = 1 (in [3], left {0, 887596})
read(3, "\205\367\352\323\367UB\344e\231\367~\10eR\300\362\326F\335\366\36\313\303j\253i\240\310\214\212\260"..., 8192) = 1368
write(4, "\205\367\352\323\367UB\344e\231\367~\10eR\300\362\326F\335\366\36\313\303j\253i\240\310\214\212\260"..., 1368) = 1368
select(4, [3], NULL, NULL, {0, 950000}) = 1 (in [3], left {0, 949889})
read(3, "MR%\203'r%\177\3460v\356\352\234\213\236HF\330\334\373=q]\230\220\331\227v{u\334"..., 8192) = 1368
write(4, "MR%\203'r%\177\3460v\356\352\234\213\236HF\330\334\373=q]\230\220\331\227v{u\334"..., 1368) = 1368
select(4, [3], NULL, NULL, {0, 950000}) = 1 (in [3], left {0, 949494})
read(3, "7!\375\243nz\30[\263\345\3407\4wN]`(\253\247\246rV\341\24m\261V\205h\302\240"..., 8192) = 1368
write(4, "7!\375\243nz\30[\263\345\3407\4wN]`(\253\247\246rV\341\24m\261V\205h\302\240"..., 1368) = 1368
select(4, [3], NULL, NULL, {0, 950000}) = 1 (in [3], left {0, 949750})
read(3, "\320e\16\314\256T\f/\6p]\270T)\314\\\343\330\246\300\306\fx\350`Ap\251\237\341f@"..., 6919) = 1368
write(4, "\320e\16\314\256T\f/\6p]\270T)\314\\\343\330\246\300\306\fx\350`Ap\251\237\341f@"..., 1368) = 1368
select(4, [3], NULL, NULL, {0, 950000}) = 1 (in [3], left {0, 949997})
read(3, "\260(.\210.^\"\276a\274\v\272D\230\\\26 \0168\323\2145i\325{\370\260}\306\n\\\326"..., 5551) = 2736
write(4, "\260(.\210.^\"\276a\274\v\272D\230\\\26 \0168\323\2145i\325{\370\260}\306\n\\\326"..., 2736) = 2736
select(4, [3], NULL, NULL, {0, 950000}) = 1 (in [3], left {0, 949996})
read(3, "<\275\233\271\251+5\376\302\364=6\31\232\371\304\216&\30A\35\213\247\21\302\20Wx\364\24Ar"..., 2815) = 1368
write(4, "<\275\233\271\251+5\376\302\364=6\31\232\371\304\216&\30A\35\213\247\21\302\20Wx\364\24Ar"..., 1368) = 1368
select(4, [3], NULL, NULL, {0, 950000}) = 1 (in [3], left {0, 949997})
read(3, "\221\t\220\340m'\rV\0\2\20\355\311\256\"\241:\266\210\340\234\236D R&\302[\265\203H\362"..., 1447) = 1447
write(4, "\221\t\220\340m'\rV\0\2\20\355\311\256\"\241:\266\210\340\234\236D R&\302[\265\203H\362"..., 1447) = 1447
write(2, "\r", 1)                       = 1
write(2, "100%[==========================="..., 79) = 79
write(2, "\n\n", 2)                     = 2
close(4)                                = 0
munmap(0x7f6529c37000, 4096)            = 0
