read(3, " -17 119 -75.5t47 -134.5z\" />\n<g"..., 8192) = 1368
write(4, " -17 119 -75.5t47 -134.5z\" />\n<g"..., 1368) = 1368
select(4, [3], NULL, NULL, {0, 950000}) = 1 (in [3], left {0, 949998})
read(3, "114.5 47.5t47.5 114.5t-47.5 114."..., 8192) = 1368
write(4, "114.5 47.5t47.5 114.5t-47.5 114."..., 1368) = 1368
select(4, [3], NULL, NULL, {0, 950000}) = 1 (in [3], left {0, 921698})
read(3, "code=\"&#x2753;\" horiz-adv-x=\"864"..., 8192) = 1368
write(4, "code=\"&#x2753;\" horiz-adv-x=\"864"..., 1368) = 1368
select(4, [3], NULL, NULL, {0, 950000}) = 1 (in [3], left {0, 949615})
read(3, "4q0 -8 -5 -13t-13 -5h-288q-8 0 -"..., 8192) = 1368
write(4, "4q0 -8 -5 -13t-13 -5h-288q-8 0 -"..., 1368) = 1368
select(4, [3], NULL, NULL, {0, 950000}) = 1 (in [3], left {0, 949996})
read(3, "29 -95t95 -229t-95 -229t-229 -95"..., 8192) = 2736
write(4, "29 -95t95 -229t-95 -229t-229 -95"..., 2736) = 2736
select(4, [3], NULL, NULL, {0, 950000}) = 1 (in [3], left {0, 949996})
read(3, "52z\" />\n<glyph unicode=\"&#xe202;"..., 8192) = 2736
write(4, "52z\" />\n<glyph unicode=\"&#xe202;"..., 2736) = 2736
select(4, [3], NULL, NULL, {0, 950000}) = 1 (in [3], left {0, 949997})
read(3, "oriz-adv-x=\"864\" d=\"M252 90q0 38"..., 8192) = 1368
write(4, "oriz-adv-x=\"864\" d=\"M252 90q0 38"..., 1368) = 1368
select(4, [3], NULL, NULL, {0, 950000}) = 1 (in [3], left {0, 949997})
read(3, "0 90q7 5 13 5h252v36q0 8 5 13t13"..., 8192) = 2736
write(4, "0 90q7 5 13 5h252v36q0 8 5 13t13"..., 2736) = 2736
select(4, [3], NULL, NULL, {0, 950000}) = 1 (in [3], left {0, 949997})
read(3, "q0 8 5 13t13 5h180q8 0 13 -5t5 -"..., 8192) = 2736
write(4, "q0 8 5 13t13 5h180q8 0 13 -5t5 -"..., 2736) = 2736
select(4, [3], NULL, NULL, {0, 950000}) = 1 (in [3], left {0, 949959})
read(3, "unicode=\"&#xea13;\" horiz-adv-x=\""..., 8192) = 1368
write(4, "unicode=\"&#xea13;\" horiz-adv-x=\""..., 1368) = 1368
select(4, [3], NULL, NULL, {0, 950000}) = 1 (in [3], left {0, 921366})
read(3, " -13t-13 -5h-288q-8 0 -13 5t-5 1"..., 8192) = 1368
write(4, " -13t-13 -5h-288q-8 0 -13 5t-5 1"..., 1368) = 1368
select(4, [3], NULL, NULL, {0, 950000}) = 1 (in [3], left {0, 949907})
read(3, "3q-3 -13 -17 -13h-111q-9 0 -14 6"..., 8192) = 1368
write(4, "3q-3 -13 -17 -13h-111q-9 0 -14 6"..., 1368) = 1368
select(4, [3], NULL, NULL, {0, 950000}) = 1 (in [3], left {0, 949995})
read(3, "q-12 13 0 25q40 40 96 40t95 -40q"..., 8192) = 4104
write(4, "q-12 13 0 25q40 40 96 40t95 -40q"..., 4096) = 4096
write(4, "de=\"&#xf", 8)                = 8
select(4, [3], NULL, NULL, {0, 950000}) = 1 (in [3], left {0, 949996})
read(3, "073;\" horiz-adv-x=\"864\" d=\"M810 "..., 8192) = 2736
write(4, "073;\" horiz-adv-x=\"864\" d=\"M810 "..., 2736) = 2736
select(4, [3], NULL, NULL, {0, 950000}) = 1 (in [3], left {0, 949997})
read(3, "0 8 -5 13t-13 5h-216q-8 0 -13 -5"..., 8192) = 2736
write(4, "0 8 -5 13t-13 5h-216q-8 0 -13 -5"..., 2736) = 2736
select(4, [3], NULL, NULL, {0, 950000}) = 1 (in [3], left {0, 949998})
read(3, "57.5 36l-16 18q2 1 5.5 5t13 20.5"..., 8192) = 1368
write(4, "57.5 36l-16 18q2 1 5.5 5t13 20.5"..., 1368) = 1368
select(4, [3], NULL, NULL, {0, 950000}) = 1 (in [3], left {0, 949997})
read(3, "9t60 -14.5t24 -37.5q0 -26 -32 -4"..., 8192) = 2736
write(4, "9t60 -14.5t24 -37.5q0 -26 -32 -4"..., 2736) = 2736
select(4, [3], NULL, NULL, {0, 950000}) = 1 (in [3], left {0, 949998})
read(3, "-22 -16 -38t-38 -16h-540q-22 0 -"..., 8192) = 2736
write(4, "-22 -16 -38t-38 -16h-540q-22 0 -"..., 2736) = 2736
select(4, [3], NULL, NULL, {0, 950000}) = 1 (in [3], left {0, 949416})
read(3, " -16t-16 -38t16 -38t38 -16zM612 "..., 8192) = 1368
write(4, " -16t-16 -38t16 -38t38 -16zM612 "..., 1368) = 1368
select(4, [3], NULL, NULL, {0, 950000}) = 1 (in [3], left {0, 949998})
read(3, "3 6q-71 82 -71 189q0 119 84.5 20"..., 8192) = 1368
write(4, "3 6q-71 82 -71 189q0 119 84.5 20"..., 1368) = 1368
select(4, [3], NULL, NULL, {0, 950000}) = 1 (in [3], left {0, 949997})
read(3, "38 16t-16 38v324q0 22 16 38t38 1"..., 8192) = 2736
write(4, "38 16t-16 38v324q0 22 16 38t38 1"..., 2736) = 2736
select(4, [3], NULL, NULL, {0, 950000}) = 1 (in [3], left {0, 949998})
read(3, "-179 -126.5 -305.5t-305.5 -126.5"..., 8192) = 1368
write(4, "-179 -126.5 -305.5t-305.5 -126.5"..., 1368) = 1368
select(4, [3], NULL, NULL, {0, 950000}) = 1 (in [3], left {0, 949998})
read(3, "\"580\" d=\"M534 0h-461v624h456v-76"..., 8192) = 1368
write(4, "\"580\" d=\"M534 0h-461v624h456v-76"..., 1368) = 1368
select(4, [3], NULL, NULL, {0, 950000}) = 1 (in [3], left {0, 924021})
read(3, "27.5t-95 74t-54 103.5t-18.5 120q"..., 8192) = 1368
write(4, "27.5t-95 74t-54 103.5t-18.5 120q"..., 1368) = 1368
select(4, [3], NULL, NULL, {0, 950000}) = 1 (in [3], left {0, 949994})
read(3, ".5 93.5t-111.5 33.5q-27 0 -50.5 "..., 6888) = 4104
write(4, ".5 93.5t-111.5 33.5q-27 0 -50.5 "..., 4096) = 4096
