write(4, "04004-2.00391\r\n\t\tc-0.33008-0.006"..., 1380) = 1380
select(4, [3], NULL, NULL, {0, 950000}) = 1 (in [3], left {0, 949996})
read(3, "-0.24463l-2.06543-0.01904l0.1933"..., 8192) = 1380
write(4, "-0.24463l-2.06543-0.01904l0.1933"..., 1380) = 1380
select(4, [3], NULL, NULL, {0, 950000}) = 1 (in [3], left {0, 948355})
read(3, "5439-0.01953-0.5332-0.01123-0.74"..., 8192) = 1380
write(4, "5439-0.01953-0.5332-0.01123-0.74"..., 1380) = 1380
select(4, [3], NULL, NULL, {0, 950000}) = 1 (in [3], left {0, 948434})
read(3, "1172-0.61084,0.72656-1.45654,0.6"..., 8192) = 1380
write(4, "1172-0.61084,0.72656-1.45654,0.6"..., 1380) = 1380
select(4, [3], NULL, NULL, {0, 950000}) = 1 (in [3], left {0, 949997})
read(3, "3623,0.37207-3.3335-0.71289-4.57"..., 8192) = 4140
write(4, "3623,0.37207-3.3335-0.71289-4.57"..., 4096) = 4096
write(4, "gon fill=\"#FFFFFF\" points=\"43.16"..., 44) = 44
select(4, [3], NULL, NULL, {0, 950000}) = 1 (in [3], left {0, 949267})
read(3, "4 48.34082,114.18262 48.82227,11"..., 5512) = 1380
write(4, "4 48.34082,114.18262 48.82227,11"..., 1380) = 1380
select(4, [3], NULL, NULL, {0, 950000}) = 1 (in [3], left {0, 931659})
read(3, ".2959\r\n\t\tc0.87109,0,1.63574,0.49"..., 4132) = 1380
write(4, ".2959\r\n\t\tc0.87109,0,1.63574,0.49"..., 1380) = 1380
select(4, [3], NULL, NULL, {0, 950000}) = 1 (in [3], left {0, 948659})
read(3, "27,1.07422-0.47168,1.46289-0.180"..., 2752) = 2752
write(4, "27,1.07422-0.47168,1.46289-0.180"..., 2752) = 2752
write(2, "\r", 1)                       = 1
write(2, "100%[==========================="..., 79) = 79
write(2, "\n\n", 2)                     = 2
close(4)                                = 0
munmap(0x7f094575f000, 4096)            = 0
stat("/etc/localtime", {st_mode=S_IFREG|0644, st_size=3519, ...}) = 0
utime("/home/bearface/website_output/www.cornell.edu/assets/core/images/logo-white.svg?1390332815", [2014/06/30-12:35:24, 2014/06/26-08:54:27]) = 0
write(2, "2014-06-30 12:35:24 (257 KB/s) -"..., 151) = 151
statfs("/home/bearface/website_output/www.cornell.edu/assets/core/images", {f_type="EXT2_SUPER_MAGIC", f_bsize=4096, f_blocks=59275954, f_bfree=49112942, f_bavail=46096136, f_files=15065088, f_ffree=14787859, f_fsid={533008265, 2108930253}, f_namelen=255, f_frsize=4096}) = 0
stat("/home/bearface/website_output/www.cornell.edu/assets/core/images/logo-red.svg?1390332815", 0x7fff66db0aa0) = -1 ENOENT (No such file or directory)
stat("/home/bearface/website_output/www.cornell.edu/assets/core/images/logo-red.svg?1390332815", 0x7fff66db0b30) = -1 ENOENT (No such file or directory)
statfs("/home/bearface/website_output/www.cornell.edu/assets/core/images", {f_type="EXT2_SUPER_MAGIC", f_bsize=4096, f_blocks=59275954, f_bfree=49112942, f_bavail=46096136, f_files=15065088, f_ffree=14787859, f_fsid={533008265, 2108930253}, f_namelen=255, f_frsize=4096}) = 0
stat("/home/bearface/website_output/www.cornell.edu/assets/core/images/logo-red.svg?1390332815", 0x7fff66db0aa0) = -1 ENOENT (No such file or directory)
nanosleep({1, 0}, 0x7fff66db0bb0)       = 0
stat("/etc/localtime", {st_mode=S_IFREG|0644, st_size=3519, ...}) = 0
write(2, "--2014-06-30 12:35:25--  http://"..., 91) = 91
select(4, [3], NULL, NULL, {0, 1})      = 0 (Timeout)
getpeername(3, {sa_family=AF_INET, sin_port=htons(80), sin_addr=inet_addr("132.236.204.10")}, [16]) = 0
write(2, "Reusing existing connection to w"..., 51) = 51
select(4, NULL, [3], NULL, {900, 0})    = 1 (out [3], left {899, 999994})
write(3, "GET /assets/core/images/logo-red"..., 241) = 241
write(2, "HTTP request sent, awaiting resp"..., 40) = 40
select(4, [3], NULL, NULL, {900, 0})    = 1 (in [3], left {899, 970288})
recvfrom(3, "HTTP/1.1 200 OK\r\nSet-Cookie: cor"..., 511, MSG_PEEK, NULL, NULL) = 511
read(3, "HTTP/1.1 200 OK\r\nSet-Cookie: cor"..., 380) = 380
write(2, "200 OK\n", 7)                 = 7
stat("/home/bearface/website_output/www.cornell.edu/assets/core/images/logo-red.svg?1390332815", 0x7fff66db0590) = -1 ENOENT (No such file or directory)
write(2, "Length: ", 8)                 = 8
write(2, "21744", 5)                    = 5
write(2, " (21K)", 6)                   = 6
write(2, " [image/svg+xml]\n", 17)      = 17
stat("/home/bearface/website_output/www.cornell.edu/assets/core/images", {st_mode=S_IFDIR|0755, st_size=4096, ...}) = 0
open("/home/bearface/website_output/www.cornell.edu/assets/core/images/logo-red.svg?1390332815", O_WRONLY|O_CREAT|O_TRUNC, 0666) = 4
write(2, "Saving to: \342\200\230/home/bearface/web"..., 106) = 106
write(2, "\n", 1)                       = 1
write(2, "\r", 1)                       = 1
write(2, " 0% [                           "..., 79) = 79
select(4, [3], NULL, NULL, {0, 950000}) = 1 (in [3], left {0, 949997})
read(3, "<?xml version=\"1.0\" encoding=\"ut"..., 8192) = 1051
fstat(4, {st_mode=S_IFREG|0644, st_size=0, ...}) = 0
mmap(NULL, 4096, PROT_READ|PROT_WRITE, MAP_PRIVATE|MAP_ANONYMOUS, -1, 0) = 0x7f094575f000
write(4, "<?xml version=\"1.0\" encoding=\"ut"..., 1051) = 1051
select(4, [3], NULL, NULL, {0, 950000}) = 1 (in [3], left {0, 927097})
read(3, "11,0v-17.6875\r\n\t\tc0.07666,0,0.15"..., 8192) = 1380
write(4, "11,0v-17.6875\r\n\t\tc0.07666,0,0.15"..., 1380) = 1380
select(4, [3], NULL, NULL, {0, 950000}) = 1 (in [3], left {0, 949607})
read(3, ",0,0.36719,0,0.53516,0l0.00195,1"..., 8192) = 1380
write(4, ",0,0.36719,0,0.53516,0l0.00195,1"..., 1380) = 1380
select(4, [3], NULL, NULL, {0, 950000}) = 1 (in [3], left {0, 949996})
read(3, "9834\r\n\t\tc0.01709-0.22217,0.01172"..., 8192) = 1380
write(4, "9834\r\n\t\tc0.01709-0.22217,0.01172"..., 1380) = 1380
select(4, [3], NULL, NULL, {0, 950000}) = 1 (in [3], left {0, 949997})
