select(4, [3], NULL, NULL, {0, 1})      = 0 (Timeout)
getpeername(3, {sa_family=AF_INET, sin_port=htons(80), sin_addr=inet_addr("128.122.119.202")}, [16]) = 0
write(2, "Reusing existing connection to w"..., 47) = 47
select(4, NULL, [3], NULL, {900, 0})    = 1 (out [3], left {899, 999986})
write(3, "GET /common/images/arrowBlueUp.g"..., 224) = 224
write(2, "HTTP request sent, awaiting resp"..., 40) = 40
select(4, [3], NULL, NULL, {900, 0})    = 1 (in [3], left {899, 971574})
recvfrom(3, "HTTP/1.1 200 OK\r\nDate: Mon, 30 J"..., 511, MSG_PEEK, NULL, NULL) = 411
read(3, "HTTP/1.1 200 OK\r\nDate: Mon, 30 J"..., 359) = 359
write(2, "200 OK\n", 7)                 = 7
stat("/home/bearface/website_output/www.nyu.edu/common/images/arrowBlueUp.gif", {st_mode=S_IFREG|0644, st_size=52, ...}) = 0
write(2, "Length: ", 8)                 = 8
write(2, "52", 2)                       = 2
write(2, " [image/gif]\n", 13)          = 13
stat("/home/bearface/website_output/www.nyu.edu/common/images", {st_mode=S_IFDIR|0755, st_size=4096, ...}) = 0
open("/home/bearface/website_output/www.nyu.edu/common/images/arrowBlueUp.gif", O_WRONLY|O_CREAT|O_TRUNC, 0666) = 4
write(2, "Saving to: \342\200\230/home/bearface/web"..., 89) = 89
write(2, "\n", 1)                       = 1
write(2, "\r", 1)                       = 1
write(2, " 0% [                           "..., 79) = 79
select(4, [3], NULL, NULL, {0, 950000}) = 1 (in [3], left {0, 949994})
read(3, "GIF89a\6\0\7\0\200\0\0\377\377\377Sp\233!\371\4\0\0\0\0\0,\0\0\0\0"..., 52) = 52
fstat(4, {st_mode=S_IFREG|0644, st_size=0, ...}) = 0
mmap(NULL, 4096, PROT_READ|PROT_WRITE, MAP_PRIVATE|MAP_ANONYMOUS, -1, 0) = 0x7f6a77ed4000
write(4, "GIF89a\6\0\7\0\200\0\0\377\377\377Sp\233!\371\4\0\0\0\0\0,\0\0\0\0"..., 52) = 52
write(2, "\r", 1)                       = 1
write(2, "100%[==========================="..., 79) = 79
write(2, "\n\n", 2)                     = 2
close(4)                                = 0
munmap(0x7f6a77ed4000, 4096)            = 0
stat("/etc/localtime", {st_mode=S_IFREG|0644, st_size=3519, ...}) = 0
utime("/home/bearface/website_output/www.nyu.edu/common/images/arrowBlueUp.gif", [2014/06/30-12:09:54, 2014/02/21-16:48:12]) = 0
write(2, "2014-06-30 12:09:54 (229 KB/s) -"..., 126) = 126
statfs("/home/bearface/website_output/www.nyu.edu/common/images/about", {f_type="EXT2_SUPER_MAGIC", f_bsize=4096, f_blocks=59275954, f_bfree=49158065, f_bavail=46141259, f_files=15065088, f_ffree=14788921, f_fsid={533008265, 2108930253}, f_namelen=255, f_frsize=4096}) = 0
stat("/home/bearface/website_output/www.nyu.edu/common/images/about/grayBar.gif", {st_mode=S_IFREG|0644, st_size=44, ...}) = 0
lstat("/home/bearface/website_output/www.nyu.edu/common/images/about/grayBar.gif", {st_mode=S_IFREG|0644, st_size=44, ...}) = 0
stat("/home/bearface/website_output/www.nyu.edu/common/images/about/grayBar.gif", {st_mode=S_IFREG|0644, st_size=44, ...}) = 0
statfs("/home/bearface/website_output/www.nyu.edu/common/images/about", {f_type="EXT2_SUPER_MAGIC", f_bsize=4096, f_blocks=59275954, f_bfree=49158065, f_bavail=46141259, f_files=15065088, f_ffree=14788921, f_fsid={533008265, 2108930253}, f_namelen=255, f_frsize=4096}) = 0
stat("/home/bearface/website_output/www.nyu.edu/common/images/about/grayBar.gif", {st_mode=S_IFREG|0644, st_size=44, ...}) = 0
lstat("/home/bearface/website_output/www.nyu.edu/common/images/about/grayBar.gif", {st_mode=S_IFREG|0644, st_size=44, ...}) = 0
nanosleep({1, 0}, 0x7fff7afecca0)       = 0
stat("/etc/localtime", {st_mode=S_IFREG|0644, st_size=3519, ...}) = 0
write(2, "--2014-06-30 12:09:55--  http://"..., 76) = 76
select(4, [3], NULL, NULL, {0, 1})      = 0 (Timeout)
getpeername(3, {sa_family=AF_INET, sin_port=htons(80), sin_addr=inet_addr("128.122.119.202")}, [16]) = 0
write(2, "Reusing existing connection to w"..., 47) = 47
select(4, NULL, [3], NULL, {900, 0})    = 1 (out [3], left {899, 999991})
write(3, "GET /common/images/about/grayBar"..., 226) = 226
write(2, "HTTP request sent, awaiting resp"..., 40) = 40
select(4, [3], NULL, NULL, {900, 0})    = 1 (in [3], left {899, 938265})
recvfrom(3, "HTTP/1.1 200 OK\r\nDate: Mon, 30 J"..., 511, MSG_PEEK, NULL, NULL) = 403
read(3, "HTTP/1.1 200 OK\r\nDate: Mon, 30 J"..., 359) = 359
write(2, "200 OK\n", 7)                 = 7
stat("/home/bearface/website_output/www.nyu.edu/common/images/about/grayBar.gif", {st_mode=S_IFREG|0644, st_size=44, ...}) = 0
write(2, "Length: ", 8)                 = 8
write(2, "44", 2)                       = 2
write(2, " [image/gif]\n", 13)          = 13
stat("/home/bearface/website_output/www.nyu.edu/common/images/about", {st_mode=S_IFDIR|0755, st_size=4096, ...}) = 0
open("/home/bearface/website_output/www.nyu.edu/common/images/about/grayBar.gif", O_WRONLY|O_CREAT|O_TRUNC, 0666) = 4
write(2, "Saving to: \342\200\230/home/bearface/web"..., 91) = 91
write(2, "\n", 1)                       = 1
write(2, "\r", 1)                       = 1
write(2, " 0% [                           "..., 79) = 79
select(4, [3], NULL, NULL, {0, 950000}) = 1 (in [3], left {0, 949993})
read(3, "GIF89a\1\0\v\0\200\0\0\340\340\340\0\0\0!\371\4\0\0\0\0\0,\0\0\0\0"..., 44) = 44
fstat(4, {st_mode=S_IFREG|0644, st_size=0, ...}) = 0
mmap(NULL, 4096, PROT_READ|PROT_WRITE, MAP_PRIVATE|MAP_ANONYMOUS, -1, 0) = 0x7f6a77ed4000
write(4, "GIF89a\1\0\v\0\200\0\0\340\340\340\0\0\0!\371\4\0\0\0\0\0,\0\0\0\0"..., 44) = 44
write(2, "\r", 1)                       = 1
write(2, "100%[==========================="..., 79) = 79
write(2, "\n\n", 2)                     = 2
close(4)                                = 0
munmap(0x7f6a77ed4000, 4096)            = 0
stat("/etc/localtime", {st_mode=S_IFREG|0644, st_size=3519, ...}) = 0
utime("/home/bearface/website_output/www.nyu.edu/common/images/about/grayBar.gif", [2014/06/30-12:09:55, 2014/02/21-16:47:53]) = 0
