stat("/home/bearface/website_output/www.nyu.edu/common/images", {st_mode=S_IFDIR|0755, st_size=4096, ...}) = 0
open("/home/bearface/website_output/www.nyu.edu/common/images/warningYellow.gif", O_WRONLY|O_CREAT|O_TRUNC, 0666) = 4
write(2, "Saving to: \342\200\230/home/bearface/web"..., 91) = 91
write(2, "\n", 1)                       = 1
write(2, "\r", 1)                       = 1
write(2, " 0% [                           "..., 79) = 79
select(4, [3], NULL, NULL, {0, 950000}) = 1 (in [3], left {0, 949992})
read(3, "GIF89a\22\0\20\0\346L\0\373\343\\\373\346o\373\344i\373\336:LI9\374\345b\373"..., 585) = 585
fstat(4, {st_mode=S_IFREG|0644, st_size=0, ...}) = 0
mmap(NULL, 4096, PROT_READ|PROT_WRITE, MAP_PRIVATE|MAP_ANONYMOUS, -1, 0) = 0x7f6a77ed4000
write(4, "GIF89a\22\0\20\0\346L\0\373\343\\\373\346o\373\344i\373\336:LI9\374\345b\373"..., 585) = 585
write(2, "\r", 1)                       = 1
write(2, "100%[==========================="..., 79) = 79
write(2, "\n\n", 2)                     = 2
close(4)                                = 0
munmap(0x7f6a77ed4000, 4096)            = 0
stat("/etc/localtime", {st_mode=S_IFREG|0644, st_size=3519, ...}) = 0
utime("/home/bearface/website_output/www.nyu.edu/common/images/warningYellow.gif", [2014/06/30-12:09:12, 2014/02/21-16:48:13]) = 0
write(2, "2014-06-30 12:09:12 (2.23 MB/s) "..., 131) = 131
statfs("/home/bearface/website_output/www.nyu.edu/common/images", {f_type="EXT2_SUPER_MAGIC", f_bsize=4096, f_blocks=59275954, f_bfree=49160679, f_bavail=46143873, f_files=15065088, f_ffree=14788956, f_fsid={533008265, 2108930253}, f_namelen=255, f_frsize=4096}) = 0
stat("/home/bearface/website_output/www.nyu.edu/common/images/utilsLeft2.gif", {st_mode=S_IFREG|0644, st_size=237, ...}) = 0
lstat("/home/bearface/website_output/www.nyu.edu/common/images/utilsLeft2.gif", {st_mode=S_IFREG|0644, st_size=237, ...}) = 0
stat("/home/bearface/website_output/www.nyu.edu/common/images/utilsLeft2.gif", {st_mode=S_IFREG|0644, st_size=237, ...}) = 0
statfs("/home/bearface/website_output/www.nyu.edu/common/images", {f_type="EXT2_SUPER_MAGIC", f_bsize=4096, f_blocks=59275954, f_bfree=49160679, f_bavail=46143873, f_files=15065088, f_ffree=14788956, f_fsid={533008265, 2108930253}, f_namelen=255, f_frsize=4096}) = 0
stat("/home/bearface/website_output/www.nyu.edu/common/images/utilsLeft2.gif", {st_mode=S_IFREG|0644, st_size=237, ...}) = 0
lstat("/home/bearface/website_output/www.nyu.edu/common/images/utilsLeft2.gif", {st_mode=S_IFREG|0644, st_size=237, ...}) = 0
nanosleep({1, 0}, 0x7fff7afecca0)       = 0
stat("/etc/localtime", {st_mode=S_IFREG|0644, st_size=3519, ...}) = 0
write(2, "--2014-06-30 12:09:13--  http://"..., 73) = 73
select(4, [3], NULL, NULL, {0, 1})      = 0 (Timeout)
getpeername(3, {sa_family=AF_INET, sin_port=htons(80), sin_addr=inet_addr("128.122.119.202")}, [16]) = 0
write(2, "Reusing existing connection to w"..., 47) = 47
select(4, NULL, [3], NULL, {900, 0})    = 1 (out [3], left {899, 999997})
write(3, "GET /common/images/utilsLeft2.gi"..., 223) = 223
write(2, "HTTP request sent, awaiting resp"..., 40) = 40
select(4, [3], NULL, NULL, {900, 0})    = 1 (in [3], left {899, 970870})
recvfrom(3, "HTTP/1.1 200 OK\r\nDate: Mon, 30 J"..., 511, MSG_PEEK, NULL, NULL) = 511
read(3, "HTTP/1.1 200 OK\r\nDate: Mon, 30 J"..., 360) = 360
write(2, "200 OK\n", 7)                 = 7
stat("/home/bearface/website_output/www.nyu.edu/common/images/utilsLeft2.gif", {st_mode=S_IFREG|0644, st_size=237, ...}) = 0
write(2, "Length: ", 8)                 = 8
write(2, "237", 3)                      = 3
write(2, " [image/gif]\n", 13)          = 13
stat("/home/bearface/website_output/www.nyu.edu/common/images", {st_mode=S_IFDIR|0755, st_size=4096, ...}) = 0
open("/home/bearface/website_output/www.nyu.edu/common/images/utilsLeft2.gif", O_WRONLY|O_CREAT|O_TRUNC, 0666) = 4
write(2, "Saving to: \342\200\230/home/bearface/web"..., 88) = 88
write(2, "\n", 1)                       = 1
write(2, "\r", 1)                       = 1
write(2, " 0% [                           "..., 79) = 79
select(4, [3], NULL, NULL, {0, 950000}) = 1 (in [3], left {0, 949997})
read(3, "GIF89a\23\0\33\0\304\0\0F\37]M\vv<\23TE\36\\B\20`H\16k="..., 237) = 237
fstat(4, {st_mode=S_IFREG|0644, st_size=0, ...}) = 0
mmap(NULL, 4096, PROT_READ|PROT_WRITE, MAP_PRIVATE|MAP_ANONYMOUS, -1, 0) = 0x7f6a77ed4000
write(4, "GIF89a\23\0\33\0\304\0\0F\37]M\vv<\23TE\36\\B\20`H\16k="..., 237) = 237
write(2, "\r", 1)                       = 1
write(2, "100%[==========================="..., 79) = 79
write(2, "\n\n", 2)                     = 2
close(4)                                = 0
munmap(0x7f6a77ed4000, 4096)            = 0
stat("/etc/localtime", {st_mode=S_IFREG|0644, st_size=3519, ...}) = 0
utime("/home/bearface/website_output/www.nyu.edu/common/images/utilsLeft2.gif", [2014/06/30-12:09:13, 2014/02/21-16:48:13]) = 0
write(2, "2014-06-30 12:09:13 (1.12 MB/s) "..., 128) = 128
statfs("/home/bearface/website_output/www.nyu.edu/common/images", {f_type="EXT2_SUPER_MAGIC", f_bsize=4096, f_blocks=59275954, f_bfree=49160619, f_bavail=46143813, f_files=15065088, f_ffree=14788955, f_fsid={533008265, 2108930253}, f_namelen=255, f_frsize=4096}) = 0
stat("/home/bearface/website_output/www.nyu.edu/common/images/utilsRight2.gif", {st_mode=S_IFREG|0644, st_size=225, ...}) = 0
lstat("/home/bearface/website_output/www.nyu.edu/common/images/utilsRight2.gif", {st_mode=S_IFREG|0644, st_size=225, ...}) = 0
stat("/home/bearface/website_output/www.nyu.edu/common/images/utilsRight2.gif", {st_mode=S_IFREG|0644, st_size=225, ...}) = 0
statfs("/home/bearface/website_output/www.nyu.edu/common/images", {f_type="EXT2_SUPER_MAGIC", f_bsize=4096, f_blocks=59275954, f_bfree=49160619, f_bavail=46143813, f_files=15065088, f_ffree=14788955, f_fsid={533008265, 2108930253}, f_namelen=255, f_frsize=4096}) = 0
stat("/home/bearface/website_output/www.nyu.edu/common/images/utilsRight2.gif", {st_mode=S_IFREG|0644, st_size=225, ...}) = 0
lstat("/home/bearface/website_output/www.nyu.edu/common/images/utilsRight2.gif", {st_mode=S_IFREG|0644, st_size=225, ...}) = 0
nanosleep({1, 0}, 0x7fff7afecca0)       = 0
stat("/etc/localtime", {st_mode=S_IFREG|0644, st_size=3519, ...}) = 0
write(2, "--2014-06-30 12:09:14--  http://"..., 74) = 74
select(4, [3], NULL, NULL, {0, 1})      = 0 (Timeout)
getpeername(3, {sa_family=AF_INET, sin_port=htons(80), sin_addr=inet_addr("128.122.119.202")}, [16]) = 0
write(2, "Reusing existing connection to w"..., 47) = 47
