recvfrom(3, "\r\n", 127, MSG_PEEK, NULL, NULL) = 2
read(3, "\r\n", 2)                      = 2
write(2, "\r", 1)                       = 1
write(2, "    [ <=>                       "..., 79) = 79
write(2, "\n\n", 2)                     = 2
close(4)                                = 0
munmap(0x7f6529c37000, 4096)            = 0
stat("/etc/localtime", {st_mode=S_IFREG|0644, st_size=3519, ...}) = 0
utime("/home/bearface/website_output/www.ucla.edu/css/fonts/proximanova-regular.woff", [2014/06/30-12:17:41, 2014/05/01-15:09:18]) = 0
write(2, "2014-06-30 12:17:41 (186 KB/s) -"..., 132) = 132
statfs("/home/bearface/website_output/www.ucla.edu/css/fonts", {f_type="EXT2_SUPER_MAGIC", f_bsize=4096, f_blocks=59275954, f_bfree=49141176, f_bavail=46124370, f_files=15065088, f_ffree=14788405, f_fsid={533008265, 2108930253}, f_namelen=255, f_frsize=4096}) = 0
stat("/home/bearface/website_output/www.ucla.edu/css/fonts/proximanova-regular.ttf", 0x7fff13a30660) = -1 ENOENT (No such file or directory)
stat("/home/bearface/website_output/www.ucla.edu/css/fonts/proximanova-regular.ttf", 0x7fff13a306f0) = -1 ENOENT (No such file or directory)
statfs("/home/bearface/website_output/www.ucla.edu/css/fonts", {f_type="EXT2_SUPER_MAGIC", f_bsize=4096, f_blocks=59275954, f_bfree=49141176, f_bavail=46124370, f_files=15065088, f_ffree=14788405, f_fsid={533008265, 2108930253}, f_namelen=255, f_frsize=4096}) = 0
stat("/home/bearface/website_output/www.ucla.edu/css/fonts/proximanova-regular.ttf", 0x7fff13a30660) = -1 ENOENT (No such file or directory)
nanosleep({1, 0}, 0x7fff13a30770)       = 0
stat("/etc/localtime", {st_mode=S_IFREG|0644, st_size=3519, ...}) = 0
write(2, "--2014-06-30 12:17:42--  http://"..., 79) = 79
select(4, [3], NULL, NULL, {0, 1})      = 0 (Timeout)
getpeername(3, {sa_family=AF_INET, sin_port=htons(80), sin_addr=inet_addr("164.67.228.152")}, [16]) = 0
write(2, "Reusing existing connection to w"..., 48) = 48
select(4, NULL, [3], NULL, {900, 0})    = 1 (out [3], left {899, 999996})
write(3, "GET /css/fonts/proximanova-regul"..., 172) = 172
write(2, "HTTP request sent, awaiting resp"..., 40) = 40
select(4, [3], NULL, NULL, {900, 0})    = 1 (in [3], left {899, 924020})
recvfrom(3, "HTTP/1.1 200 OK\r\nContent-Type: t"..., 511, MSG_PEEK, NULL, NULL) = 511
read(3, "HTTP/1.1 200 OK\r\nContent-Type: t"..., 393) = 393
write(2, "200 OK\n", 7)                 = 7
stat("/home/bearface/website_output/www.ucla.edu/css/fonts/proximanova-regular.ttf", 0x7fff13a30190) = -1 ENOENT (No such file or directory)
write(2, "Length: ", 8)                 = 8
write(2, "unspecified", 11)             = 11
write(2, " [text/plain]\n", 14)         = 14
stat("/home/bearface/website_output/www.ucla.edu/css/fonts", {st_mode=S_IFDIR|0755, st_size=4096, ...}) = 0
open("/home/bearface/website_output/www.ucla.edu/css/fonts/proximanova-regular.ttf", O_WRONLY|O_CREAT|O_TRUNC, 0666) = 4
write(2, "Saving to: \342\200\230/home/bearface/web"..., 94) = 94
write(2, "\n", 1)                       = 1
write(2, "\r", 1)                       = 1
write(2, "    [<=>                        "..., 79) = 79
select(4, [3], NULL, NULL, {900, 0})    = 1 (in [3], left {899, 999997})
recvfrom(3, "008000\r\n\0\1\0\0\0\23\1\0\0\4\0000FFTM]\327\213\306\0\0\1<"..., 127, MSG_PEEK, NULL, NULL) = 127
read(3, "008000\r\n", 8)                = 8
select(4, [3], NULL, NULL, {0, 950000}) = 1 (in [3], left {0, 949997})
read(3, "\0\1\0\0\0\23\1\0\0\4\0000FFTM]\327\213\306\0\0\1<\0\0\0\34GDEF"..., 8192) = 3703
fstat(4, {st_mode=S_IFREG|0644, st_size=0, ...}) = 0
mmap(NULL, 4096, PROT_READ|PROT_WRITE, MAP_PRIVATE|MAP_ANONYMOUS, -1, 0) = 0x7f6529c37000
write(4, "\0\1\0\0\0\23\1\0\0\4\0000FFTM]\327\213\306\0\0\1<\0\0\0\34GDEF"..., 3703) = 3703
select(4, [3], NULL, NULL, {0, 950000}) = 1 (in [3], left {0, 885597})
read(3, "\0\0\0\0\0\0\0\0\0\0\0\0\0\0\0\0\0\0\0\377\327\0\0\0\0\0\0\0\0\0\0\0"..., 8192) = 2736
write(4, "\0\0\0\0\0\0\0\0\0\0\0\0\0\0\0\0\0\0\0\377\327\0\0\0\0\0\0\0\0\0\0\0"..., 2736) = 2736
select(4, [3], NULL, NULL, {0, 950000}) = 1 (in [3], left {0, 949994})
read(3, "\0\0\0\0\0\0\0\0\0\0\0\0\0\0\0\0\0\0\0\0\0\0\0\0\0\0\0\0\0\377\362\0"..., 8192) = 5472
write(4, "\0\0\0\0\0\0\0\0\0\0\0\0\0\0\0\0\0\0\0\0\0\0\0\0\0\0\0\0\0\377\362\0"..., 4096) = 4096
write(4, "\1\0\1\0\21\0\2\0\1\0\23\0\34\0\0\0\3\0\2\0\34\0&\0\1\0\26\0\1\0,\0"..., 1376) = 1376
select(4, [3], NULL, NULL, {0, 950000}) = 1 (in [3], left {0, 884559})
read(3, "\0\0\0z\0\0\0\0\0\0\0\3\335\5V\0\230\0q\0\177\0\205\0\211\0\317\0\231\0\252\0"..., 8192) = 1368
write(4, "\0\0\0z\0\0\0\0\0\0\0\3\335\5V\0\230\0q\0\177\0\205\0\211\0\317\0\231\0\252\0"..., 1368) = 1368
select(4, [3], NULL, NULL, {0, 950000}) = 1 (in [3], left {0, 949994})
read(3, "*\16\351\260*\20\261&\1+\262\5\17/222\264%\r\0/\4+\262\21\32=222\260"..., 8192) = 4104
write(4, "*\16\351\260*\20\261&\1+\262\5\17/222\264%\r\0/\4+\262\21\32=222\260"..., 4096) = 4096
write(4, "\02299\0\261\f\6\21", 8)      = 8
select(4, [3], NULL, NULL, {0, 950000}) = 1 (in [3], left {0, 949994})
read(3, "\22\260\017901\27>\0017\16\1#\"&54632\26\25\24\6\7\0034632\26\25"..., 8192) = 6840
write(4, "\22\260\017901\27>\0017\16\1#\"&54632\26\25\24\6\7\0034632\26\25"..., 4096) = 4096
write(4, "\6\21\22\260\002901\0233\t\0013\1#\22\303\1\315\1\315\302\375\331\323\5V\373d\4\234\372"..., 2744) = 2744
select(4, [3], NULL, NULL, {0, 950000}) = 1 (in [3], left {0, 949996})
read(3, "/\260\7\326\261\n\t\351\263\36\7\20\16+\261\26\20\351\261\35\1+\261\n\7\21\22\261\23\03199"..., 8192) = 1368
write(4, "/\260\7\326\261\n\t\351\263\36\7\20\16+\261\26\20\351\261\35\1+\261\n\7\21\22\261\23\03199"..., 1368) = 1368
select(4, [3], NULL, NULL, {0, 950000}) = 1 (in [3], left {0, 888183})
read(3, "\0+\261\32\5\351\1\260,/\260\16\326\261\35\r\351\260\35\20\261\7\1+\261$\r\351\261-\1+"..., 7177) = 1368
write(4, "\0+\261\32\5\351\1\260,/\260\16\326\261\35\r\351\260\35\20\261\7\1+\261$\r\351\261-\1+"..., 1368) = 1368
select(4, [3], NULL, NULL, {0, 950000}) = 1 (in [3], left {0, 949994})
read(3, "\240\377\327\1\20\5\177\0\3\0\35\0\1\260\4/\260\0\326\264\3\r\0\"\4+\264\3\r\0\"\4"..., 5809) = 1368
write(4, "\240\377\327\1\20\5\177\0\3\0\35\0\1\260\4/\260\0\326\264\3\r\0\"\4+\264\3\r\0\"\4"..., 1368) = 1368
select(4, [3], NULL, NULL, {0, 950000}) = 1 (in [3], left {0, 947830})
read(3, "467\23\24\36\00232>\00254.\2#\"\16\0027a\237;\226\\Z\226;\240^\237/"..., 4441) = 1368
