read(3, "\261\21S\322-I\256B\342L\f\361\2460\2'\277Tz\316\"T\34\n\270\370hSb\251/X"..., 7586) = 1360
write(4, "\261\21S\322-I\256B\342L\f\361\2460\2'\277Tz\316\"T\34\n\270\370hSb\251/X"..., 1360) = 1360
select(4, [3], NULL, NULL, {0, 950000}) = 1 (in [3], left {0, 949997})
read(3, " \301\242\343s3\334\366\372\262\202\224\310\235m\t#\336\246\204'\257l7\357]l\324\31\221\212&"..., 6226) = 1360
write(4, " \301\242\343s3\334\366\372\262\202\224\310\235m\t#\336\246\204'\257l7\357]l\324\31\221\212&"..., 1360) = 1360
select(4, [3], NULL, NULL, {0, 950000}) = 1 (in [3], left {0, 949998})
read(3, "P\306\367j\337v1;J\302\367|\356<h4\352\327\311c\221\327\24\0L\21\262\271\227\226\226\260"..., 4866) = 1360
write(4, "P\306\367j\337v1;J\302\367|\356<h4\352\327\311c\221\327\24\0L\21\262\271\227\226\226\260"..., 1360) = 1360
select(4, [3], NULL, NULL, {0, 950000}) = 1 (in [3], left {0, 949903})
read(3, "\343\6Y-\305F\270\246\201.\237\247\203\0332\315Z\205F\36\374\303V\224\300\fL\".\10\342\260"..., 3506) = 1360
write(4, "\343\6Y-\305F\270\246\201.\237\247\203\0332\315Z\205F\36\374\303V\224\300\fL\".\10\342\260"..., 1360) = 1360
select(4, [3], NULL, NULL, {0, 950000}) = 1 (in [3], left {0, 947852})
read(3, "#\16\261Z\10\227\300p7\306\303\2\0\16\342\225\341\347\37\366:\213\331i\0'\222[\5\234\310\22"..., 2146) = 1360
write(4, "#\16\261Z\10\227\300p7\306\303\2\0\16\342\225\341\347\37\366:\213\331i\0'\222[\5\234\310\22"..., 1360) = 1360
select(4, [3], NULL, NULL, {0, 950000}) = 1 (in [3], left {0, 949998})
read(3, "\255]\222\25\212L\203b]\252dW\256\3\4\255O\32\312n.EX\204\307\30\204\262\350\230\f\n"..., 786) = 786
write(4, "\255]\222\25\212L\203b]\252dW\256\3\4\255O\32\312n.EX\204\307\30\204\262\350\230\f\n"..., 786) = 786
write(2, "\r", 1)                       = 1
write(2, "100%[==========================="..., 79) = 79
write(2, "\n\n", 2)                     = 2
close(4)                                = 0
munmap(0x7f76b35a5000, 4096)            = 0
stat("/etc/localtime", {st_mode=S_IFREG|0644, st_size=3519, ...}) = 0
utime("/home/bearface/website_output/www.usc.edu/x/usc_homepage/assets/css/fonts/ProximaNova-BoldIt-webfont.eot", [2014/06/30-12:15:01, 2011/12/21-18:58:18]) = 0
write(2, "2014-06-30 12:15:01 (258 KB/s) -"..., 165) = 165
statfs("/home/bearface/website_output/www.usc.edu/x/usc_homepage/assets/css/fonts", {f_type="EXT2_SUPER_MAGIC", f_bsize=4096, f_blocks=59275954, f_bfree=49147736, f_bavail=46130930, f_files=15065088, f_ffree=14788562, f_fsid={533008265, 2108930253}, f_namelen=255, f_frsize=4096}) = 0
stat("/home/bearface/website_output/www.usc.edu/x/usc_homepage/assets/css/fonts/ProximaNova-BoldIt-webfont.eot?", 0x7fff959168a0) = -1 ENOENT (No such file or directory)
stat("/home/bearface/website_output/www.usc.edu/x/usc_homepage/assets/css/fonts/ProximaNova-BoldIt-webfont.eot?", 0x7fff95916930) = -1 ENOENT (No such file or directory)
statfs("/home/bearface/website_output/www.usc.edu/x/usc_homepage/assets/css/fonts", {f_type="EXT2_SUPER_MAGIC", f_bsize=4096, f_blocks=59275954, f_bfree=49147736, f_bavail=46130930, f_files=15065088, f_ffree=14788562, f_fsid={533008265, 2108930253}, f_namelen=255, f_frsize=4096}) = 0
stat("/home/bearface/website_output/www.usc.edu/x/usc_homepage/assets/css/fonts/ProximaNova-BoldIt-webfont.eot?", 0x7fff959168a0) = -1 ENOENT (No such file or directory)
nanosleep({1, 0}, 0x7fff959169b0)       = 0
stat("/etc/localtime", {st_mode=S_IFREG|0644, st_size=3519, ...}) = 0
write(2, "--2014-06-30 12:15:02--  http://"..., 108) = 108
select(4, [3], NULL, NULL, {0, 1})      = 1 (in [3], left {0, 0})
close(3)                                = 0
write(2, "Connecting to www.usc.edu (www.u"..., 63) = 63
socket(PF_INET, SOCK_STREAM, IPPROTO_IP) = 3
connect(3, {sa_family=AF_INET, sin_port=htons(80), sin_addr=inet_addr("128.125.253.146")}, 16) = 0
write(2, "connected.\n", 11)            = 11
select(4, NULL, [3], NULL, {900, 0})    = 1 (out [3], left {899, 999996})
write(3, "GET /x/usc_homepage/assets/css/f"..., 260) = 260
write(2, "HTTP request sent, awaiting resp"..., 40) = 40
select(4, [3], NULL, NULL, {900, 0})    = 1 (in [3], left {899, 925719})
recvfrom(3, "HTTP/1.1 200 OK\r\nDate: Mon, 30 J"..., 511, MSG_PEEK, NULL, NULL) = 329
read(3, "HTTP/1.1 200 OK\r\nDate: Mon, 30 J"..., 329) = 329
write(2, "200 OK\n", 7)                 = 7
stat("/home/bearface/website_output/www.usc.edu/x/usc_homepage/assets/css/fonts/ProximaNova-BoldIt-webfont.eot?", 0x7fff959163d0) = -1 ENOENT (No such file or directory)
write(2, "Length: ", 8)                 = 8
write(2, "22646", 5)                    = 5
write(2, " (22K)", 6)                   = 6
write(2, " [text/plain]\n", 14)         = 14
stat("/home/bearface/website_output/www.usc.edu/x/usc_homepage/assets/css/fonts", {st_mode=S_IFDIR|0755, st_size=4096, ...}) = 0
open("/home/bearface/website_output/www.usc.edu/x/usc_homepage/assets/css/fonts/ProximaNova-BoldIt-webfont.eot?", O_WRONLY|O_CREAT|O_TRUNC, 0666) = 4
write(2, "Saving to: \342\200\230/home/bearface/web"..., 123) = 123
write(2, "\n", 1)                       = 1
write(2, "\r", 1)                       = 1
write(2, " 0% [                           "..., 79) = 79
select(4, [3], NULL, NULL, {0, 950000}) = 1 (in [3], left {0, 949997})
read(3, "vX\0\0\202W\0\0\2\0\2\0\4\0\0\0\2\0\5\6\3\0\0\2\0\4\243\377\274\2\0\0"..., 8192) = 4180
fstat(4, {st_mode=S_IFREG|0644, st_size=0, ...}) = 0
mmap(NULL, 4096, PROT_READ|PROT_WRITE, MAP_PRIVATE|MAP_ANONYMOUS, -1, 0) = 0x7f76b35a5000
write(4, "vX\0\0\202W\0\0\2\0\2\0\4\0\0\0\2\0\5\6\3\0\0\2\0\4\243\377\274\2\0\0"..., 4096) = 4096
write(4, "\356\251\223}\245r\266\267u\237\2245\326\256\343A\320j\257\3\226m\241wV\rG\321\v\\\234\246"..., 84) = 84
select(4, [3], NULL, NULL, {0, 950000}) = 1 (in [3], left {0, 886334})
read(3, "\235\356\tS\25t\314\356\372\333\0316\370,P0\220p*]\327sI\311\216z\240/+\251+\363"..., 8192) = 1360
write(4, "\235\356\tS\25t\314\356\372\333\0316\370,P0\220p*]\327sI\311\216z\240/+\251+\363"..., 1360) = 1360
select(4, [3], NULL, NULL, {0, 950000}) = 1 (in [3], left {0, 949609})
read(3, "\245 1R)<\231\324\26\344\204+Y\227\244\224\355%.pp\236[@\362\267\304\27I\214K\211"..., 8192) = 1360
write(4, "\245 1R)<\231\324\26\344\204+Y\227\244\224\355%.pp\236[@\362\267\304\27I\214K\211"..., 1360) = 1360
select(4, [3], NULL, NULL, {0, 950000}) = 1 (in [3], left {0, 948958})
read(3, "\242RF\303\\d\25\1d@7nQ\6;i\351I\7\357Hv\332\2\10\202\223\317\370\20\1\270"..., 8192) = 1260
write(4, "\242RF\303\\d\25\1d@7nQ\6;i\351I\7\357Hv\332\2\10\202\223\317\370\20\1\270"..., 1260) = 1260
select(4, [3], NULL, NULL, {0, 950000}) = 1 (in [3], left {0, 949020})
read(3, " \v\346}\262\351%\275\34\350H\350S\233Xn\7\6'\352*UL\360\311\261#\243x\347;|"..., 8192) = 1360
write(4, " \v\346}\262\351%\275\34\350H\350S\233Xn\7\6'\352*UL\360\311\261#\243x\347;|"..., 1360) = 1360
