write(2, "\n\n", 2)                     = 2
close(4)                                = 0
munmap(0x7feb0e058000, 4096)            = 0
stat("/etc/localtime", {st_mode=S_IFREG|0644, st_size=3519, ...}) = 0
utime("/home/bearface/website_output/www.berkeley.edu/js/popup.js", [2014/06/30-12:12:48, 2008/02/04-19:16:00]) = 0
write(2, "2014-06-30 12:12:48 (1.77 MB/s) "..., 116) = 116
statfs("/home/bearface/website_output/www.berkeley.edu/js", {f_type="EXT2_SUPER_MAGIC", f_bsize=4096, f_blocks=59275954, f_bfree=49151601, f_bavail=46134795, f_files=15065088, f_ffree=14788702, f_fsid={533008265, 2108930253}, f_namelen=255, f_frsize=4096}) = 0
stat("/home/bearface/website_output/www.berkeley.edu/js/getyear.js", 0x7ffffe5e1610) = -1 ENOENT (No such file or directory)
stat("/home/bearface/website_output/www.berkeley.edu/js/getyear.js", 0x7ffffe5e16a0) = -1 ENOENT (No such file or directory)
statfs("/home/bearface/website_output/www.berkeley.edu/js", {f_type="EXT2_SUPER_MAGIC", f_bsize=4096, f_blocks=59275954, f_bfree=49151601, f_bavail=46134795, f_files=15065088, f_ffree=14788702, f_fsid={533008265, 2108930253}, f_namelen=255, f_frsize=4096}) = 0
stat("/home/bearface/website_output/www.berkeley.edu/js/getyear.js", 0x7ffffe5e1610) = -1 ENOENT (No such file or directory)
nanosleep({1, 0}, 0x7ffffe5e1720)       = 0
stat("/etc/localtime", {st_mode=S_IFREG|0644, st_size=3519, ...}) = 0
write(2, "--2014-06-30 12:12:49--  http://"..., 63) = 63
select(4, [3], NULL, NULL, {0, 1})      = 0 (Timeout)
getpeername(3, {sa_family=AF_INET, sin_port=htons(80), sin_addr=inet_addr("169.229.216.200")}, [16]) = 0
write(2, "Reusing existing connection to w"..., 52) = 52
select(4, NULL, [3], NULL, {900, 0})    = 1 (out [3], left {899, 999995})
write(3, "GET /js/getyear.js HTTP/1.1\r\nRef"..., 158) = 158
write(2, "HTTP request sent, awaiting resp"..., 40) = 40
select(4, [3], NULL, NULL, {900, 0})    = 1 (in [3], left {899, 915240})
recvfrom(3, "HTTP/1.1 200 OK\r\nDate: Mon, 30 J"..., 511, MSG_PEEK, NULL, NULL) = 511
read(3, "HTTP/1.1 200 OK\r\nDate: Mon, 30 J"..., 373) = 373
write(2, "200 OK\n", 7)                 = 7
stat("/home/bearface/website_output/www.berkeley.edu/js/getyear.js", 0x7ffffe5e1140) = -1 ENOENT (No such file or directory)
write(2, "Length: ", 8)                 = 8
write(2, "151", 3)                      = 3
write(2, " [application/javascript]\n", 26) = 26
stat("/home/bearface/website_output/www.berkeley.edu/js", {st_mode=S_IFDIR|0755, st_size=4096, ...}) = 0
open("/home/bearface/website_output/www.berkeley.edu/js/getyear.js", O_WRONLY|O_CREAT|O_TRUNC, 0666) = 4
write(2, "Saving to: \342\200\230/home/bearface/web"..., 78) = 78
write(2, "\n", 1)                       = 1
write(2, "\r", 1)                       = 1
write(2, " 0% [                           "..., 79) = 79
select(4, [3], NULL, NULL, {0, 950000}) = 1 (in [3], left {0, 949992})
read(3, "// Captures current year for foo"..., 151) = 151
fstat(4, {st_mode=S_IFREG|0644, st_size=0, ...}) = 0
mmap(NULL, 4096, PROT_READ|PROT_WRITE, MAP_PRIVATE|MAP_ANONYMOUS, -1, 0) = 0x7feb0e058000
write(4, "// Captures current year for foo"..., 151) = 151
write(2, "\r", 1)                       = 1
write(2, "100%[==========================="..., 79) = 79
write(2, "\n\n", 2)                     = 2
close(4)                                = 0
munmap(0x7feb0e058000, 4096)            = 0
stat("/etc/localtime", {st_mode=S_IFREG|0644, st_size=3519, ...}) = 0
utime("/home/bearface/website_output/www.berkeley.edu/js/getyear.js", [2014/06/30-12:12:49, 2008/02/04-19:16:00]) = 0
write(2, "2014-06-30 12:12:49 (513 KB/s) -"..., 117) = 117
statfs("/home/bearface/website_output/www.berkeley.edu/style", 0x7ffffe5e15c0) = -1 ENOENT (No such file or directory)
statfs("/home/bearface/website_output/www.berkeley.edu", {f_type="EXT2_SUPER_MAGIC", f_bsize=4096, f_blocks=59275954, f_bfree=49151598, f_bavail=46134792, f_files=15065088, f_ffree=14788701, f_fsid={533008265, 2108930253}, f_namelen=255, f_frsize=4096}) = 0
stat("/home/bearface/website_output/www.berkeley.edu/style/home-wide980.css", 0x7ffffe5e1610) = -1 ENOENT (No such file or directory)
stat("/home/bearface/website_output/www.berkeley.edu/style/home-wide980.css", 0x7ffffe5e16a0) = -1 ENOENT (No such file or directory)
statfs("/home/bearface/website_output/www.berkeley.edu/style", 0x7ffffe5e15c0) = -1 ENOENT (No such file or directory)
statfs("/home/bearface/website_output/www.berkeley.edu", {f_type="EXT2_SUPER_MAGIC", f_bsize=4096, f_blocks=59275954, f_bfree=49151598, f_bavail=46134792, f_files=15065088, f_ffree=14788701, f_fsid={533008265, 2108930253}, f_namelen=255, f_frsize=4096}) = 0
stat("/home/bearface/website_output/www.berkeley.edu/style/home-wide980.css", 0x7ffffe5e1610) = -1 ENOENT (No such file or directory)
nanosleep({1, 0}, 0x7ffffe5e1720)       = 0
stat("/etc/localtime", {st_mode=S_IFREG|0644, st_size=3519, ...}) = 0
write(2, "--2014-06-30 12:12:50--  http://"..., 72) = 72
select(4, [3], NULL, NULL, {0, 1})      = 0 (Timeout)
getpeername(3, {sa_family=AF_INET, sin_port=htons(80), sin_addr=inet_addr("169.229.216.200")}, [16]) = 0
write(2, "Reusing existing connection to w"..., 52) = 52
select(4, NULL, [3], NULL, {900, 0})    = 1 (out [3], left {899, 999994})
write(3, "GET /style/home-wide980.css HTTP"..., 167) = 167
write(2, "HTTP request sent, awaiting resp"..., 40) = 40
select(4, [3], NULL, NULL, {900, 0})    = 1 (in [3], left {899, 900204})
recvfrom(3, "HTTP/1.1 200 OK\r\nDate: Mon, 30 J"..., 511, MSG_PEEK, NULL, NULL) = 511
read(3, "HTTP/1.1 200 OK\r\nDate: Mon, 30 J"..., 377) = 377
write(2, "200 OK\n", 7)                 = 7
stat("/home/bearface/website_output/www.berkeley.edu/style/home-wide980.css", 0x7ffffe5e1140) = -1 ENOENT (No such file or directory)
write(2, "Length: ", 8)                 = 8
write(2, "9947", 4)                     = 4
write(2, " (9.7K)", 7)                  = 7
write(2, " [text/css]\n", 12)           = 12
stat("/home/bearface/website_output/www.berkeley.edu/style", 0x7ffffe5e1130) = -1 ENOENT (No such file or directory)
stat("/home", {st_mode=S_IFDIR|0755, st_size=4096, ...}) = 0
stat("/home/bearface", {st_mode=S_IFDIR|0755, st_size=4096, ...}) = 0
