select(4, [3], NULL, NULL, {0, 1})      = 0 (Timeout)
getpeername(3, {sa_family=AF_INET, sin_port=htons(80), sin_addr=inet_addr("198.101.129.15")}, [16]) = 0
write(2, "Reusing existing connection to w"..., 52) = 52
select(4, NULL, [3], NULL, {900, 0})    = 1 (out [3], left {899, 999994})
write(3, "GET /js/libs/modernizr.js HTTP/1"..., 331) = 331
write(2, "HTTP request sent, awaiting resp"..., 40) = 40
select(4, [3], NULL, NULL, {900, 0})    = 1 (in [3], left {899, 969061})
recvfrom(3, "HTTP/1.1 200 OK\r\nDate: Mon, 30 J"..., 511, MSG_PEEK, NULL, NULL) = 511
read(3, "HTTP/1.1 200 OK\r\nDate: Mon, 30 J"..., 364) = 364
write(2, "200 OK\n", 7)                 = 7
stat("/home/bearface/website_output/www.uchicago.edu/js/libs/modernizr.js", 0x7fff7e3ef1b0) = -1 ENOENT (No such file or directory)
write(2, "Length: ", 8)                 = 8
write(2, "5893", 4)                     = 4
write(2, " (5.8K)", 7)                  = 7
write(2, " [application/javascript]\n", 26) = 26
stat("/home/bearface/website_output/www.uchicago.edu/js/libs", 0x7fff7e3ef1a0) = -1 ENOENT (No such file or directory)
stat("/home", {st_mode=S_IFDIR|0755, st_size=4096, ...}) = 0
stat("/home/bearface", {st_mode=S_IFDIR|0755, st_size=4096, ...}) = 0
stat("/home/bearface/website_output", {st_mode=S_IFDIR|0755, st_size=4096, ...}) = 0
stat("/home/bearface/website_output/www.uchicago.edu", {st_mode=S_IFDIR|0755, st_size=4096, ...}) = 0
stat("/home/bearface/website_output/www.uchicago.edu/js", 0x7fff7e3ef0c0) = -1 ENOENT (No such file or directory)
mkdir("/home/bearface/website_output/www.uchicago.edu/js", 0777) = 0
stat("/home/bearface/website_output/www.uchicago.edu/js/libs", 0x7fff7e3ef0c0) = -1 ENOENT (No such file or directory)
mkdir("/home/bearface/website_output/www.uchicago.edu/js/libs", 0777) = 0
open("/home/bearface/website_output/www.uchicago.edu/js/libs/modernizr.js", O_WRONLY|O_CREAT|O_TRUNC, 0666) = 4
write(2, "Saving to: \342\200\230/home/bearface/web"..., 85) = 85
write(2, "\n", 1)                       = 1
write(2, "\r", 1)                       = 1
write(2, " 0% [                           "..., 79) = 79
select(4, [3], NULL, NULL, {0, 950000}) = 1 (in [3], left {0, 949995})
read(3, "/* Modernizr 2.7.1 (Custom Build"..., 5893) = 3732
fstat(4, {st_mode=S_IFREG|0644, st_size=0, ...}) = 0
mmap(NULL, 4096, PROT_READ|PROT_WRITE, MAP_PRIVATE|MAP_ANONYMOUS, -1, 0) = 0x7fcea595e000
write(4, "/* Modernizr 2.7.1 (Custom Build"..., 3732) = 3732
select(4, [3], NULL, NULL, {0, 950000}) = 1 (in [3], left {0, 923513})
read(3, "=c||n(a);var d=c.frag.cloneNode("..., 2161) = 2161
write(4, "=c||n(a);var d=c.frag.cloneNode("..., 2161) = 2161
write(2, "\r", 1)                       = 1
write(2, "100%[==========================="..., 79) = 79
write(2, "\n\n", 2)                     = 2
close(4)                                = 0
munmap(0x7fcea595e000, 4096)            = 0
stat("/etc/localtime", {st_mode=S_IFREG|0644, st_size=3519, ...}) = 0
utime("/home/bearface/website_output/www.uchicago.edu/js/libs/modernizr.js", [2014/06/30-12:28:11, 2014/01/27-14:30:22]) = 0
write(2, "2014-06-30 12:28:11 (211 KB/s) -"..., 126) = 126
statfs("/home/bearface/website_output/www.uchicago.edu/c", 0x7fff7e3ef630) = -1 ENOENT (No such file or directory)
statfs("/home/bearface/website_output/www.uchicago.edu", {f_type="EXT2_SUPER_MAGIC", f_bsize=4096, f_blocks=59275954, f_bfree=49123913, f_bavail=46107107, f_files=15065088, f_ffree=14788093, f_fsid={533008265, 2108930253}, f_namelen=255, f_frsize=4096}) = 0
stat("/home/bearface/website_output/www.uchicago.edu/c/base_styles.min.css?updated=201406242014", 0x7fff7e3ef680) = -1 ENOENT (No such file or directory)
stat("/home/bearface/website_output/www.uchicago.edu/c/base_styles.min.css?updated=201406242014", 0x7fff7e3ef710) = -1 ENOENT (No such file or directory)
statfs("/home/bearface/website_output/www.uchicago.edu/c", 0x7fff7e3ef630) = -1 ENOENT (No such file or directory)
statfs("/home/bearface/website_output/www.uchicago.edu", {f_type="EXT2_SUPER_MAGIC", f_bsize=4096, f_blocks=59275954, f_bfree=49123913, f_bavail=46107107, f_files=15065088, f_ffree=14788093, f_fsid={533008265, 2108930253}, f_namelen=255, f_frsize=4096}) = 0
stat("/home/bearface/website_output/www.uchicago.edu/c/base_styles.min.css?updated=201406242014", 0x7fff7e3ef680) = -1 ENOENT (No such file or directory)
nanosleep({1, 0}, 0x7fff7e3ef790)       = 0
stat("/etc/localtime", {st_mode=S_IFREG|0644, st_size=3519, ...}) = 0
write(2, "--2014-06-30 12:28:12--  http://"..., 92) = 92
select(4, [3], NULL, NULL, {0, 1})      = 0 (Timeout)
getpeername(3, {sa_family=AF_INET, sin_port=htons(80), sin_addr=inet_addr("198.101.129.15")}, [16]) = 0
write(2, "Reusing existing connection to w"..., 52) = 52
select(4, NULL, [3], NULL, {900, 0})    = 1 (out [3], left {899, 999998})
write(3, "GET /c/base_styles.min.css?updat"..., 353) = 353
write(2, "HTTP request sent, awaiting resp"..., 40) = 40
select(4, [3], NULL, NULL, {900, 0})    = 1 (in [3], left {899, 968007})
recvfrom(3, "HTTP/1.1 200 OK\r\nDate: Mon, 30 J"..., 511, MSG_PEEK, NULL, NULL) = 511
read(3, "HTTP/1.1 200 OK\r\nDate: Mon, 30 J"..., 353) = 353
write(2, "200 OK\n", 7)                 = 7
stat("/home/bearface/website_output/www.uchicago.edu/c/base_styles.min.css?updated=201406242014", 0x7fff7e3ef1b0) = -1 ENOENT (No such file or directory)
write(2, "Length: ", 8)                 = 8
write(2, "198557", 6)                   = 6
write(2, " (194K)", 7)                  = 7
write(2, " [text/css]\n", 12)           = 12
stat("/home/bearface/website_output/www.uchicago.edu/c", 0x7fff7e3ef1a0) = -1 ENOENT (No such file or directory)
stat("/home", {st_mode=S_IFDIR|0755, st_size=4096, ...}) = 0
stat("/home/bearface", {st_mode=S_IFDIR|0755, st_size=4096, ...}) = 0
stat("/home/bearface/website_output", {st_mode=S_IFDIR|0755, st_size=4096, ...}) = 0
stat("/home/bearface/website_output/www.uchicago.edu", {st_mode=S_IFDIR|0755, st_size=4096, ...}) = 0
