write(4, "\324\20e1\303\232\214\22\261`{_\316\36;\277\2546\317\273\355p\265S*^\320l\2624\nB"..., 1368) = 1368
select(4, [3], NULL, NULL, {0, 950000}) = 1 (in [3], left {0, 949995})
read(3, "\341\37\267\370\365x\330zGP@\5L\210\326H\307\0\244O\343\307\277\307 \250\23\215vw\241\356"..., 8192) = 4104
write(4, "\341\37\267\370\365x\330zGP@\5L\210\326H\307\0\244O\343\307\277\307 \250\23\215vw\241\356"..., 4096) = 4096
write(4, "\330\376Q\7\273\356!A", 8)    = 8
select(4, [3], NULL, NULL, {0, 950000}) = 1 (in [3], left {0, 942915})
read(3, "\352<\3271X\7\236*\253\250\222@\30\363 O?^\24\265\273\315\201o=\322JP\200&\0\2"..., 8192) = 1368
write(4, "\352<\3271X\7\236*\253\250\222@\30\363 O?^\24\265\273\315\201o=\322JP\200&\0\2"..., 1368) = 1368
select(4, [3], NULL, NULL, {0, 950000}) = 1 (in [3], left {0, 949670})
read(3, "\223\226@4\211\340\f\221\311F\210\226]\273\330\210\347\251\"\212\301\334T\326\"\252cZ\245\356\354\201"..., 8192) = 1368
write(4, "\223\226@4\211\340\f\221\311F\210\226]\273\330\210\347\251\"\212\301\334T\326\"\252cZ\245\356\354\201"..., 1368) = 1368
select(4, [3], NULL, NULL, {0, 950000}) = 1 (in [3], left {0, 949995})
read(3, "\267\353Z\324\322\244\232\304\263C\31\344I2x\260v\335\21`\5\352\5&\"\332\331m[\333\0303"..., 8192) = 2736
write(4, "\267\353Z\324\322\244\232\304\263C\31\344I2x\260v\335\21`\5\352\5&\"\332\331m[\333\0303"..., 2736) = 2736
select(4, [3], NULL, NULL, {0, 950000}) = 1 (in [3], left {0, 947736})
read(3, "cn\2279\315\22\343\3625i\22\361%\27\352\213\337\245\372R\345\306\264\6\275s\2e^\361G\2"..., 8192) = 1368
write(4, "cn\2279\315\22\343\3625i\22\361%\27\352\213\337\245\372R\345\306\264\6\275s\2e^\361G\2"..., 1368) = 1368
select(4, [3], NULL, NULL, {0, 950000}) = 1 (in [3], left {0, 949994})
read(3, "\25\214Ia\31s\217h?\210\343|\213gP#{\254\373\263P\10\202\16\307\332\233\273\357j\333\240"..., 8192) = 2736
write(4, "\25\214Ia\31s\217h?\210\343|\213gP#{\254\373\263P\10\202\16\307\332\233\273\357j\333\240"..., 2736) = 2736
select(4, [3], NULL, NULL, {0, 950000}) = 1 (in [3], left {0, 949997})
read(3, "\366\tV\375@`D\314\345\315P\325\17\nFW\335\371\27s\33\212\267\275\317y\270\n\3X\r\327"..., 8192) = 1368
write(4, "\366\tV\375@`D\314\345\315P\325\17\nFW\335\371\27s\33\212\267\275\317y\270\n\3X\r\327"..., 1368) = 1368
select(4, [3], NULL, NULL, {0, 950000}) = 1 (in [3], left {0, 946901})
read(3, "\0\306\260`\23\353\302\327\361=\277\3628\5\370\307G\333\277e\314\16\267\377\0k\202\307\362ab\17"..., 8192) = 1368
write(4, "\0\306\260`\23\353\302\327\361=\277\3628\5\370\307G\333\277e\314\16\267\377\0k\202\307\362ab\17"..., 1368) = 1368
select(4, [3], NULL, NULL, {0, 950000}) = 1 (in [3], left {0, 949278})
read(3, "}q\341O\177\351=6\246\307\275u\226\334\346\252\23\233\300H\216K\17\235/\326{\206\323\255\f\267"..., 8192) = 1368
write(4, "}q\341O\177\351=6\246\307\275u\226\334\346\252\23\233\300H\216K\17\235/\326{\206\323\255\f\267"..., 1368) = 1368
select(4, [3], NULL, NULL, {0, 950000}) = 1 (in [3], left {0, 949996})
read(3, "\v\224\217\3111\254r\217\336\277\275\343t}\315\273m\273\247\26\31\351r6\340t\271\0\245L\250k"..., 8192) = 1368
write(4, "\v\224\217\3111\254r\217\336\277\275\343t}\315\273m\273\247\26\31\351r6\340t\271\0\245L\250k"..., 1368) = 1368
select(4, [3], NULL, NULL, {0, 950000}) = 1 (in [3], left {0, 948674})
read(3, "\315\270\"\225`\\\262f+\6\277R\300\221\32\202t\220\232\255-\326\4J\366\224\\\273\27Z\355:"..., 8192) = 1368
write(4, "\315\270\"\225`\\\262f+\6\277R\300\221\32\202t\220\232\255-\326\4J\366\224\\\273\27Z\355:"..., 1368) = 1368
select(4, [3], NULL, NULL, {0, 950000}) = 1 (in [3], left {0, 949996})
read(3, "\272\216V3\325Y\215e\nF:bm8\5B\230v^\301\0223\261\271Z+\353fd\365VR"..., 8192) = 8192
write(4, "\272\216V3\325Y\215e\nF:bm8\5B\230v^\301\0223\261\271Z+\353fd\365VR"..., 4096) = 4096
write(4, "\25\v\346x\363\254L\264\333\271\375/q \217VehB2\250\6x4\22\255\220\224\233\0\35\372"..., 4096) = 4096
select(4, [3], NULL, NULL, {0, 950000}) = 1 (in [3], left {0, 949996})
read(3, "\273\371?w\357\226\273n\367{\2332f(\246\302\21\347\231\367i\21\34\375\7\10\7w\327n$\373"..., 8192) = 4120
write(4, "\273\371?w\357\226\273n\367{\2332f(\246\302\21\347\231\367i\21\34\375\7\10\7w\327n$\373"..., 4096) = 4096
write(4, "a\336Vk@L\f\262a \23\265\227\210\n\324\345\211\354\221\233.\336$", 24) = 24
select(4, [3], NULL, NULL, {0, 950000}) = 1 (in [3], left {0, 949994})
read(3, "\200U\25$\246\2108\311&{\220rQ\371\17`\255\203\262\355k\206K+\233\35qX\251\255\5,"..., 8192) = 2736
write(4, "\200U\25$\246\2108\311&{\220rQ\371\17`\255\203\262\355k\206K+\233\35qX\251\255\5,"..., 2736) = 2736
select(4, [3], NULL, NULL, {0, 950000}) = 1 (in [3], left {0, 945541})
read(3, "C\214\370\327\222\317\315x\3266\220\215<\22%\306\324\24]\27\2361#-\177\361\341\236\306\314\334\215"..., 8192) = 1368
write(4, "C\214\370\327\222\317\315x\3266\220\215<\22%\306\324\24]\27\2361#-\177\361\341\236\306\314\334\215"..., 1368) = 1368
select(4, [3], NULL, NULL, {0, 950000}) = 1 (in [3], left {0, 949796})
read(3, "\\\271e\271,9\345\315\31h\t9B\16\0\361\201;\374\2202\373\313\26\367\26a\356\fg\335\234"..., 8192) = 1368
write(4, "\\\271e\271,9\345\315\31h\t9B\16\0\361\201;\374\2202\373\313\26\367\26a\356\fg\335\234"..., 1368) = 1368
select(4, [3], NULL, NULL, {0, 950000}) = 1 (in [3], left {0, 949995})
read(3, "V\257b\352\3159e\326\356\306\346\255W)\7 >9\201\30!\266\6\t\26\356\213\255\276\331j\275"..., 8192) = 2736
write(4, "V\257b\352\3159e\326\356\306\346\255W)\7 >9\201\30!\266\6\t\26\356\213\255\276\331j\275"..., 2736) = 2736
select(4, [3], NULL, NULL, {0, 950000}) = 1 (in [3], left {0, 947535})
read(3, "R\352\265\241\2\361\247\217\211\257\31\341\4\225\200e\7L\24\0`\340(\n\352@\367\330\3036\10\252"..., 8192) = 1368
write(4, "R\352\265\241\2\361\247\217\211\257\31\341\4\225\200e\7L\24\0`\340(\n\352@\367\330\3036\10\252"..., 1368) = 1368
select(4, [3], NULL, NULL, {0, 950000}) = 1 (in [3], left {0, 949224})
read(3, "\275\250k\\3IH\10\275\374\277E\234\26\370\257\300;M\303\331\335;\266\333\367\17k3\260;V"..., 8192) = 1368
write(4, "\275\250k\\3IH\10\275\374\277E\234\26\370\257\300;M\303\331\335;\266\333\367\17k3\260;V"..., 1368) = 1368
select(4, [3], NULL, NULL, {0, 950000}) = 1 (in [3], left {0, 949995})
read(3, "\245K\316%]tw,\256r\305\345\214\0\24LjI\342\346\331wP\333\10\\\342\305Z\211\212\225"..., 8192) = 2736
write(4, "\245K\316%]tw,\256r\305\345\214\0\24LjI\342\346\331wP\333\10\\\342\305Z\211\212\225"..., 2736) = 2736
select(4, [3], NULL, NULL, {0, 950000}) = 1 (in [3], left {0, 946425})
read(3, "\220w\221\312U\241\347Z\376\335\201\232~\202\23\34\304\320#\\\204\205\232\220\252%B\243\271_\332\377"..., 8192) = 1368
write(4, "\220w\221\312U\241\347Z\376\335\201\232~\202\23\34\304\320#\\\204\205\232\220\252%B\243\271_\332\377"..., 1368) = 1368
select(4, [3], NULL, NULL, {0, 950000}) = 1 (in [3], left {0, 949730})
read(3, "t\2721\240\354Z\277V\246\333\32\26\325\327\272os\0@=\302\341x/\242\361Y\213\204\265\207\366"..., 8192) = 1368
write(4, "t\2721\240\354Z\277V\246\333\32\26\325\327\272os\0@=\302\341x/\242\361Y\213\204\265\207\366"..., 1368) = 1368
select(4, [3], NULL, NULL, {0, 950000}) = 1 (in [3], left {0, 948534})
read(3, "t\312\341[5\242\253\31_\253n\347ye\345\254\334\263dQp0\10\31\6\231\367 \230\25\210\317"..., 8192) = 1368
write(4, "t\312\341[5\242\253\31_\253n\347ye\345\254\334\263dQp0\10\31\6\231\367 \230\25\210\317"..., 1368) = 1368
select(4, [3], NULL, NULL, {0, 950000}) = 1 (in [3], left {0, 949601})
read(3, "\214Ox\213'e\352\233\326n\22\357NRA\2\332\360#\4\22(\0+DD\216t|\337\361\373"..., 8192) = 1368
