read(3, "\376\260.\256\3229\231r\363sy\352\240Y\243\300\23\333\340\35\352:~t\355\36\2763`\363}\223"..., 8192) = 1368
write(4, "\376\260.\256\3229\231r\363sy\352\240Y\243\300\23\333\340\35\352:~t\355\36\2763`\363}\223"..., 1368) = 1368
select(4, [3], NULL, NULL, {0, 950000}) = 1 (in [3], left {0, 936745})
read(3, "\246Q\" \16\37#\10KF9G\5.\247\272myKa\270\366\233\25\253\236\236\220\1v\222t"..., 8192) = 1368
write(4, "\246Q\" \16\37#\10KF9G\5.\247\272myKa\270\366\233\25\253\236\236\220\1v\222t"..., 1368) = 1368
select(4, [3], NULL, NULL, {0, 950000}) = 1 (in [3], left {0, 949762})
read(3, "N\230M\352\240\21\376\36\227\375\355\376\3136]\363\220\3401\314\363\367\317\357t\206\367\223\360}\2453"..., 8192) = 1368
write(4, "N\230M\352\240\21\376\36\227\375\355\376\3136]\363\220\3401\314\363\367\317\357t\206\367\223\360}\2453"..., 1368) = 1368
select(4, [3], NULL, NULL, {0, 950000}) = 1 (in [3], left {0, 949997})
read(3, "\334\2700\354\255Y\33N\270\n{\272\201\256\207\360J\26b\226r\233\3511\351\232\306\264\316\365B "..., 8192) = 2736
write(4, "\334\2700\354\255Y\33N\270\n{\272\201\256\207\360J\26b\226r\233\3511\351\232\306\264\316\365B "..., 2736) = 2736
select(4, [3], NULL, NULL, {0, 950000}) = 1 (in [3], left {0, 949996})
read(3, "m\31\325\23\3223\327\220D\231\t\313Vm\221\303<e\313w[^\214\4\364\370\4,^\t}:"..., 8192) = 1368
write(4, "m\31\325\23\3223\327\220D\231\t\313Vm\221\303<e\313w[^\214\4\364\370\4,^\t}:"..., 1368) = 1368
select(4, [3], NULL, NULL, {0, 950000}) = 1 (in [3], left {0, 949997})
read(3, "\31\\\273+K\263\270\275\241\306Jf\rc\305\2\233\6\251\200\0214\220\326\34\366\224\34\277y\204\346"..., 8192) = 1368
write(4, "\31\\\273+K\263\270\275\241\306Jf\rc\305\2\233\6\251\200\0214\220\326\34\366\224\34\277y\204\346"..., 1368) = 1368
select(4, [3], NULL, NULL, {0, 950000}) = 1 (in [3], left {0, 948712})
read(3, "\t6\357\260s:j\303Y\2632\240\323I\216\34\\\\I\220\312\304\325V\10\2656;\36\247\32\353"..., 8192) = 4104
write(4, "\t6\357\260s:j\303Y\2632\240\323I\216\34\\\\I\220\312\304\325V\10\2656;\36\247\32\353"..., 4096) = 4096
write(4, "\341^\367m\231d\347\346", 8)  = 8
select(4, [3], NULL, NULL, {0, 950000}) = 1 (in [3], left {0, 949451})
read(3, "\306\327=\215\264\217\241\202[ \313\211M\324\10\272:w\363XR\230\210\342\6\267\316\344KLN\260"..., 8192) = 1368
write(4, "\306\327=\215\264\217\241\202[ \313\211M\324\10\272:w\363XR\230\210\342\6\267\316\344KLN\260"..., 1368) = 1368
select(4, [3], NULL, NULL, {0, 950000}) = 1 (in [3], left {0, 949997})
read(3, "\234\331\212ErXW\362\346\201\263\7@O\0A\372;\4F\354y\232\232\315\32\302\200)\331fc"..., 8192) = 1368
write(4, "\234\331\212ErXW\362\346\201\263\7@O\0A\372;\4F\354y\232\232\315\32\302\200)\331fc"..., 1368) = 1368
select(4, [3], NULL, NULL, {0, 950000}) = 1 (in [3], left {0, 949997})
read(3, "9\3\357\256*^N\224\354(-2\311\22\374\346L\226*\335O\f\3772\10<\374T\221\25U]"..., 8192) = 2736
write(4, "9\3\357\256*^N\224\354(-2\311\22\374\346L\226*\335O\f\3772\10<\374T\221\25U]"..., 2736) = 2736
select(4, [3], NULL, NULL, {0, 950000}) = 1 (in [3], left {0, 949997})
read(3, "\266p\256\202+`=N\1\225\377\327w\235ZQ\363\243\2205f\351\0\372\2|\364\243n\227>\17"..., 8192) = 1368
write(4, "\266p\256\202+`=N\1\225\377\327w\235ZQ\363\243\2205f\351\0\372\2|\364\243n\227>\17"..., 1368) = 1368
select(4, [3], NULL, NULL, {0, 950000}) = 1 (in [3], left {0, 949997})
read(3, "eQ\2228x:\25\33\300G\224\331r\315\275VW\352\240nH\262C\266\316\202d\331\2618\353\210"..., 8192) = 2736
write(4, "eQ\2228x:\25\33\300G\224\331r\315\275VW\352\240nH\262C\266\316\202d\331\2618\353\210"..., 2736) = 2736
select(4, [3], NULL, NULL, {0, 950000}) = 1 (in [3], left {0, 949997})
read(3, "\31c*\315T\366\330Yf\306U\5\357f\212\2364@\370\177\6\301\33\265i,-C\211~\37\341"..., 8192) = 2736
write(4, "\31c*\315T\366\330Yf\306U\5\357f\212\2364@\370\177\6\301\33\265i,-C\211~\37\341"..., 2736) = 2736
select(4, [3], NULL, NULL, {0, 950000}) = 1 (in [3], left {0, 949941})
read(3, "\v\344\250v\221!s\236>\234\312\307\2\1a(c\272\17\216S\273\340\f[G\234\377E\224\320{"..., 8192) = 1368
write(4, "\v\344\250v\221!s\236>\234\312\307\2\1a(c\272\17\216S\273\340\f[G\234\377E\224\320{"..., 1368) = 1368
select(4, [3], NULL, NULL, {0, 950000}) = 1 (in [3], left {0, 949997})
read(3, "o\321oS\357^\277?U:\365\312\313\313\17o\357\2\254HpD\241W\0100\205\254\367q^?"..., 8192) = 2736
write(4, "o\321oS\357^\277?U:\365\312\313\313\17o\357\2\254HpD\241W\0100\205\254\367q^?"..., 2736) = 2736
select(4, [3], NULL, NULL, {0, 950000}) = 1 (in [3], left {0, 949997})
read(3, ".8h\262;\246c\253\326\322\317\37Rw[\335\200\341W\235b\n\240\326\205\207>m>:\224\311"..., 8192) = 1368
write(4, ".8h\262;\246c\253\326\322\317\37Rw[\335\200\341W\235b\n\240\326\205\207>m>:\224\311"..., 1368) = 1368
select(4, [3], NULL, NULL, {0, 950000}) = 1 (in [3], left {0, 949383})
read(3, "u&\35\32^d\16\35H\302\2s\255\274\32c\275\321\267\243\215U\t\205d\305\241\372,\0-p"..., 8192) = 1368
write(4, "u&\35\32^d\16\35H\302\2s\255\274\32c\275\321\267\243\215U\t\205d\305\241\372,\0-p"..., 1368) = 1368
select(4, [3], NULL, NULL, {0, 950000}) = 1 (in [3], left {0, 938950})
read(3, "\25vD\256\377\333\227/\254\n\"\f\217\356\275\251\363\374|}\264\217{;\366\354\267\210\246\352\\\244"..., 8192) = 1368
write(4, "\25vD\256\377\333\227/\254\n\"\f\217\356\275\251\363\374|}\264\217{;\366\354\267\210\246\352\\\244"..., 1368) = 1368
select(4, [3], NULL, NULL, {0, 950000}) = 1 (in [3], left {0, 949602})
read(3, "\5b\212\315\316\307\260\231\351\25\262\274J\3551O\327,\364\215t\6}\330\211\366\320\276\17=\363d"..., 8192) = 1368
write(4, "\5b\212\315\316\307\260\231\351\25\262\274J\3551O\327,\364\215t\6}\330\211\366\320\276\17=\363d"..., 1368) = 1368
select(4, [3], NULL, NULL, {0, 950000}) = 1 (in [3], left {0, 949997})
read(3, "\fc5\35\30\314)\377\364\341\224\372\223\16.\35\206]\337+0\233E\252N{\334jz\222\270I"..., 8192) = 1368
write(4, "\fc5\35\30\314)\377\364\341\224\372\223\16.\35\206]\337+0\233E\252N{\334jz\222\270I"..., 1368) = 1368
select(4, [3], NULL, NULL, {0, 950000}) = 1 (in [3], left {0, 949997})
read(3, "\243\2~\250al66\367\336\336pu\241{\353\242F\37'\320dM\336\7>\261\321\2517\23t"..., 8192) = 2736
write(4, "\243\2~\250al66\367\336\336pu\241{\353\242F\37'\320dM\336\7>\261\321\2517\23t"..., 2736) = 2736
select(4, [3], NULL, NULL, {0, 950000}) = 1 (in [3], left {0, 949997})
read(3, "\\\372\241\356\346\371T\375\22D\n\251\3050v\247\342\223\215z\230\217\320\364%\365\346i\202\371J\333"..., 8192) = 1368
write(4, "\\\372\241\356\346\371T\375\22D\n\251\3050v\247\342\223\215z\230\217\320\364%\365\346i\202\371J\333"..., 1368) = 1368
select(4, [3], NULL, NULL, {0, 950000}) = 1 (in [3], left {0, 948852})
read(3, "b\357\234\223\17\364\303li\324^\267\235\271Xh)\216\372\267\372\371a\230\337\36\363\327k\35`r"..., 8192) = 2736
write(4, "b\357\234\223\17\364\303li\324^\267\235\271Xh)\216\372\267\372\371a\230\337\36\363\327k\35`r"..., 2736) = 2736
select(4, [3], NULL, NULL, {0, 950000}) = 1 (in [3], left {0, 949994})
read(3, "G~\16\210\240\315r(W.\224\360\351\366Ef\216\240\7\333Q\262\365~\277\336\232~z*_l"..., 8192) = 1368
write(4, "G~\16\210\240\315r(W.\224\360\351\366Ef\216\240\7\333Q\262\365~\277\336\232~z*_l"..., 1368) = 1368
select(4, [3], NULL, NULL, {0, 950000}) = 1 (in [3], left {0, 949232})
read(3, "\205\253\323i~l\316L \365\223\227\347O\277\177y\273=\36E\346\221\306\306\301\323\371\345TR\340"..., 8192) = 1368
write(4, "\205\253\323i~l\316L \365\223\227\347O\277\177y\273=\36E\346\221\306\306\301\323\371\345TR\340"..., 1368) = 1368
