write(4, " d=\"M190 16V-184H63V483H190V190Q"..., 2736) = 2736
select(4, [3], NULL, NULL, {0, 950000}) = 1 (in [3], left {0, 921733})
read(3, " horiz-adv-x=\"684\" d=\"M406 723H3"..., 8192) = 1368
write(4, " horiz-adv-x=\"684\" d=\"M406 723H3"..., 1368) = 1368
select(4, [3], NULL, NULL, {0, 950000}) = 1 (in [3], left {0, 949476})
read(3, "417 719ZM324 746T343 746T375\n760"..., 8192) = 1368
write(4, "417 719ZM324 746T343 746T375\n760"..., 1368) = 1368
select(4, [3], NULL, NULL, {0, 950000}) = 1 (in [3], left {0, 949996})
read(3, "0T197 710Q168 710 149 730T129 77"..., 8192) = 2736
write(4, "0T197 710Q168 710 149 730T129 77"..., 2736) = 2736
select(4, [3], NULL, NULL, {0, 950000}) = 1 (in [3], left {0, 949996})
read(3, " 333T633 85T382 -12ZM291 114T382"..., 8192) = 2736
write(4, " 333T633 85T382 -12ZM291 114T382"..., 2736) = 2736
select(4, [3], NULL, NULL, {0, 950000}) = 1 (in [3], left {0, 949997})
read(3, "312V0ZM251 74Q322 74 353 116V176"..., 8192) = 1368
write(4, "312V0ZM251 74Q322 74 353 116V176"..., 1368) = 1368
select(4, [3], NULL, NULL, {0, 950000}) = 1 (in [3], left {0, 949996})
read(3, "4Z\" />\n<glyph unicode=\"&#xe4;\" g"..., 8192) = 2736
write(4, "4Z\" />\n<glyph unicode=\"&#xe4;\" g"..., 2736) = 2736
select(4, [3], NULL, NULL, {0, 950000}) = 1 (in [3], left {0, 949997})
read(3, "-12 105 58T32 242Q32 349 102 422"..., 8192) = 1368
write(4, "-12 105 58T32 242Q32 349 102 422"..., 1368) = 1368
select(4, [3], NULL, NULL, {0, 950000}) = 1 (in [3], left {0, 949995})
read(3, "85 576Q177 581 124 613L193 716Q2"..., 8192) = 4104
write(4, "85 576Q177 581 124 613L193 716Q2"..., 4096) = 4096
write(4, "583\" d=\"", 8)               = 8
select(4, [3], NULL, NULL, {0, 950000}) = 1 (in [3], left {0, 949995})
read(3, "M339 -12Q248 -12 190 62V-184H63V"..., 8192) = 1368
write(4, "M339 -12Q248 -12 190 62V-184H63V"..., 1368) = 1368
select(4, [3], NULL, NULL, {0, 950000}) = 1 (in [3], left {0, 949695})
read(3, "ph unicode=\"&#x103;\" glyph-name="..., 8192) = 2736
write(4, "ph unicode=\"&#x103;\" glyph-name="..., 2736) = 2736
select(4, [3], NULL, NULL, {0, 950000}) = 1 (in [3], left {0, 949995})
read(3, "me=\"cdotaccent\" horiz-adv-x=\"499"..., 8192) = 2736
write(4, "me=\"cdotaccent\" horiz-adv-x=\"499"..., 2736) = 2736
select(4, [3], NULL, NULL, {0, 950000}) = 1 (in [3], left {0, 949995})
read(3, "6L182 833Q226 771 302 771Q376 77"..., 8192) = 2736
write(4, "6L182 833Q226 771 302 771Q376 77"..., 2736) = 2736
select(4, [3], NULL, NULL, {0, 950000}) = 1 (in [3], left {0, 923837})
read(3, "4T394 30V79Q334 3 245 3Q151 3 92"..., 8192) = 1368
write(4, "4T394 30V79Q334 3 245 3Q151 3 92"..., 1368) = 1368
select(4, [3], NULL, NULL, {0, 950000}) = 1 (in [3], left {0, 949619})
read(3, "T343 826T391 846Q418 846 438 826"..., 8192) = 1368
write(4, "T343 826T391 846Q418 846 438 826"..., 1368) = 1368
select(4, [3], NULL, NULL, {0, 950000}) = 1 (in [3], left {0, 949995})
read(3, "0T435 -151T353 -185T261 -196ZM28"..., 8192) = 4104
write(4, "0T435 -151T353 -185T261 -196ZM28"..., 4096) = 4096
write(4, "374 -79T", 8)                 = 8
select(4, [3], NULL, NULL, {0, 950000}) = 1 (in [3], left {0, 949996})
read(3, "395 -138ZM637 0H462L260\n267L208 "..., 8192) = 6840
write(4, "395 -138ZM637 0H462L260\n267L208 "..., 4096) = 4096
write(4, "\n382 190 325V0H63V483H190V420Q25"..., 2744) = 2744
select(4, [3], NULL, NULL, {0, 950000}) = 1 (in [3], left {0, 949996})
read(3, "11 136L868 55Q793 -12 669 -12Q54"..., 8192) = 1368
write(4, "11 136L868 55Q793 -12 669 -12Q54"..., 1368) = 1368
select(4, [3], NULL, NULL, {0, 950000}) = 1 (in [3], left {0, 949799})
read(3, "-57Q209 -57 230 -79T251 -138ZM19"..., 8192) = 2736
write(4, "-57Q209 -57 230 -79T251 -138ZM19"..., 2736) = 2736
select(4, [3], NULL, NULL, {0, 950000}) = 1 (in [3], left {0, 949997})
read(3, "09 505 51T316 -12L300 -51Q317\n-4"..., 8192) = 1368
write(4, "09 505 51T316 -12L300 -51Q317\n-4"..., 1368) = 1368
select(4, [3], NULL, NULL, {0, 950000}) = 1 (in [3], left {0, 949997})
read(3, "0 429L379 342Q356 366 318 382T23"..., 8192) = 2736
write(4, "0 429L379 342Q356 366 318 382T23"..., 2736) = 2736
select(4, [3], NULL, NULL, {0, 950000}) = 1 (in [3], left {0, 949997})
read(3, "83H516V0ZM470 562H107V634H470V56"..., 8192) = 1368
write(4, "83H516V0ZM470 562H107V634H470V56"..., 1368) = 1368
select(4, [3], NULL, NULL, {0, 950000}) = 1 (in [3], left {0, 949997})
read(3, "71Q210 199 251 157T367 114T482 1"..., 8192) = 2736
write(4, "71Q210 199 251 157T367 114T482 1"..., 2736) = 2736
select(4, [3], NULL, NULL, {0, 950000}) = 1 (in [3], left {0, 949997})
read(3, "accent\" horiz-adv-x=\"479\" d=\"M43"..., 8192) = 1368
write(4, "accent\" horiz-adv-x=\"479\" d=\"M43"..., 1368) = 1368
select(4, [3], NULL, NULL, {0, 950000}) = 1 (in [3], left {0, 949997})
read(3, " 532Q552 457 488 404Q543 337 543"..., 8192) = 2736
