rt_sigprocmask(SIG_BLOCK, NULL, [], 8)  = 0
setitimer(ITIMER_REAL, {it_interval={0, 0}, it_value={900, 0}}, NULL) = 0
read(4, "\27\3\1\5S", 5)                = 5
read(4, "\343\5\227\332\270&\t#!\364\274b\5\363\33f\253\355\266\37L{.\2~\16\234\3426n\250\306"..., 1363) = 1363
setitimer(ITIMER_REAL, {it_interval={0, 0}, it_value={0, 0}}, NULL) = 0
rt_sigaction(SIGALRM, {SIG_DFL, [ALRM], SA_RESTORER|SA_RESTART, 0x7f094452eff0}, {0x42c180, [ALRM], SA_RESTORER|SA_RESTART, 0x7f094452eff0}, 8) = 0
write(3, "\354 \32!n\223\224,k\0\33\357bl\210\364T\"\26\224\332 \211h\377\0008\210VBa\267"..., 1347) = 1347
select(5, [4], NULL, NULL, {0, 950000}) = 1 (in [4], left {0, 949994})
rt_sigaction(SIGALRM, {0x42c180, [ALRM], SA_RESTORER|SA_RESTART, 0x7f094452eff0}, {SIG_DFL, [ALRM], SA_RESTORER|SA_RESTART, 0x7f094452eff0}, 8) = 0
rt_sigprocmask(SIG_BLOCK, NULL, [], 8)  = 0
setitimer(ITIMER_REAL, {it_interval={0, 0}, it_value={900, 0}}, NULL) = 0
read(4, "\27\3\1\5S", 5)                = 5
read(4, "\23\347!Y\24\360\201\365\231\377\254\23>\207S\250\325\224\361!f\247\22\304C\312Kd\vW\262\251"..., 1363) = 1363
setitimer(ITIMER_REAL, {it_interval={0, 0}, it_value={0, 0}}, NULL) = 0
rt_sigaction(SIGALRM, {SIG_DFL, [ALRM], SA_RESTORER|SA_RESTART, 0x7f094452eff0}, {0x42c180, [ALRM], SA_RESTORER|SA_RESTART, 0x7f094452eff0}, 8) = 0
write(3, "q\336\2246R|4U\n\254\0249d\272Q\331T.\372\313\304\16\202\263\252|\221\346\31\274E\v"..., 1347) = 1347
select(5, [4], NULL, NULL, {0, 950000}) = 1 (in [4], left {0, 949995})
rt_sigaction(SIGALRM, {0x42c180, [ALRM], SA_RESTORER|SA_RESTART, 0x7f094452eff0}, {SIG_DFL, [ALRM], SA_RESTORER|SA_RESTART, 0x7f094452eff0}, 8) = 0
rt_sigprocmask(SIG_BLOCK, NULL, [], 8)  = 0
setitimer(ITIMER_REAL, {it_interval={0, 0}, it_value={900, 0}}, NULL) = 0
read(4, "\27\3\1\5S", 5)                = 5
read(4, "m\323\227e\314SL%H\21g\346J\33\6x\5D\331/Nf\316\262*\366f\10$b\233H"..., 1363) = 1363
setitimer(ITIMER_REAL, {it_interval={0, 0}, it_value={0, 0}}, NULL) = 0
rt_sigaction(SIGALRM, {SIG_DFL, [ALRM], SA_RESTORER|SA_RESTART, 0x7f094452eff0}, {0x42c180, [ALRM], SA_RESTORER|SA_RESTART, 0x7f094452eff0}, 8) = 0
write(3, "\251e_\347\374\31\350\3558D\340}\333\313{\207\331\271\326\345\317\211\363y\214\254\334L\205{\242d"..., 1347) = 1347
select(5, [4], NULL, NULL, {0, 950000}) = 1 (in [4], left {0, 949981})
rt_sigaction(SIGALRM, {0x42c180, [ALRM], SA_RESTORER|SA_RESTART, 0x7f094452eff0}, {SIG_DFL, [ALRM], SA_RESTORER|SA_RESTART, 0x7f094452eff0}, 8) = 0
rt_sigprocmask(SIG_BLOCK, NULL, [], 8)  = 0
setitimer(ITIMER_REAL, {it_interval={0, 0}, it_value={900, 0}}, NULL) = 0
read(4, "\27\3\1\5S", 5)                = 5
read(4, "h\337\214\5]\366I9j\371K)\365\213\26W\25\242`,k\342\225\215\247\20u\205\331zKc"..., 1363) = 1363
setitimer(ITIMER_REAL, {it_interval={0, 0}, it_value={0, 0}}, NULL) = 0
rt_sigaction(SIGALRM, {SIG_DFL, [ALRM], SA_RESTORER|SA_RESTART, 0x7f094452eff0}, {0x42c180, [ALRM], SA_RESTORER|SA_RESTART, 0x7f094452eff0}, 8) = 0
write(3, "\366\277!\235\306\362i\225\214\315\3225\236HU\6\214\264K\314u\0mZu\321\223\243\2\v\20\252"..., 1347) = 1347
select(5, [4], NULL, NULL, {0, 950000}) = 1 (in [4], left {0, 949995})
rt_sigaction(SIGALRM, {0x42c180, [ALRM], SA_RESTORER|SA_RESTART, 0x7f094452eff0}, {SIG_DFL, [ALRM], SA_RESTORER|SA_RESTART, 0x7f094452eff0}, 8) = 0
rt_sigprocmask(SIG_BLOCK, NULL, [], 8)  = 0
setitimer(ITIMER_REAL, {it_interval={0, 0}, it_value={900, 0}}, NULL) = 0
read(4, "\27\3\1\5S", 5)                = 5
read(4, "\320\253C\224\267\276+`!\334\232w\237\177]\204\355\17)@Z\217\316\37s@\315\240\272<\341\31"..., 1363) = 1363
setitimer(ITIMER_REAL, {it_interval={0, 0}, it_value={0, 0}}, NULL) = 0
rt_sigaction(SIGALRM, {SIG_DFL, [ALRM], SA_RESTORER|SA_RESTART, 0x7f094452eff0}, {0x42c180, [ALRM], SA_RESTORER|SA_RESTART, 0x7f094452eff0}, 8) = 0
write(3, "`\230\26\367\4\273\214\235G\311\203\367\230\7\n\314\226=\331\261\1771\367i\306N\262\244H\206\304\367"..., 1347) = 1347
select(5, [4], NULL, NULL, {0, 950000}) = 1 (in [4], left {0, 949995})
rt_sigaction(SIGALRM, {0x42c180, [ALRM], SA_RESTORER|SA_RESTART, 0x7f094452eff0}, {SIG_DFL, [ALRM], SA_RESTORER|SA_RESTART, 0x7f094452eff0}, 8) = 0
rt_sigprocmask(SIG_BLOCK, NULL, [], 8)  = 0
setitimer(ITIMER_REAL, {it_interval={0, 0}, it_value={900, 0}}, NULL) = 0
read(4, "\27\3\1\5S", 5)                = 5
read(4, "\241@Y\2\0343\344N\351\261[\311\222\356|\361g1*/P\35j\263[\322pr-\17;\376"..., 1363) = 1363
setitimer(ITIMER_REAL, {it_interval={0, 0}, it_value={0, 0}}, NULL) = 0
rt_sigaction(SIGALRM, {SIG_DFL, [ALRM], SA_RESTORER|SA_RESTART, 0x7f094452eff0}, {0x42c180, [ALRM], SA_RESTORER|SA_RESTART, 0x7f094452eff0}, 8) = 0
write(3, "f_}KU\354\206ILm\313\304n\257\nb\316\335\26\366\354L\261\r\204\315u\266\v\260D\316"..., 1347) = 1347
select(5, [4], NULL, NULL, {0, 950000}) = 1 (in [4], left {0, 949995})
rt_sigaction(SIGALRM, {0x42c180, [ALRM], SA_RESTORER|SA_RESTART, 0x7f094452eff0}, {SIG_DFL, [ALRM], SA_RESTORER|SA_RESTART, 0x7f094452eff0}, 8) = 0
rt_sigprocmask(SIG_BLOCK, NULL, [], 8)  = 0
setitimer(ITIMER_REAL, {it_interval={0, 0}, it_value={900, 0}}, NULL) = 0
read(4, "\27\3\1\5S", 5)                = 5
read(4, "\255\3746\3\326\243\271\315L\356\f\246\254/\274~)\25\252\204\356n\n%\262]{\207\325a$\34"..., 1363) = 1363
setitimer(ITIMER_REAL, {it_interval={0, 0}, it_value={0, 0}}, NULL) = 0
rt_sigaction(SIGALRM, {SIG_DFL, [ALRM], SA_RESTORER|SA_RESTART, 0x7f094452eff0}, {0x42c180, [ALRM], SA_RESTORER|SA_RESTART, 0x7f094452eff0}, 8) = 0
write(3, ",\363'E\214\32x\264+9\362\37\223\222\353\215d\304pI\24\0313yNj\323\312\342r\247\214"..., 1347) = 1347
select(5, [4], NULL, NULL, {0, 950000}) = 1 (in [4], left {0, 949995})
rt_sigaction(SIGALRM, {0x42c180, [ALRM], SA_RESTORER|SA_RESTART, 0x7f094452eff0}, {SIG_DFL, [ALRM], SA_RESTORER|SA_RESTART, 0x7f094452eff0}, 8) = 0
rt_sigprocmask(SIG_BLOCK, NULL, [], 8)  = 0
setitimer(ITIMER_REAL, {it_interval={0, 0}, it_value={900, 0}}, NULL) = 0
read(4, "\27\3\1\5S", 5)                = 5
read(4, "\204\260Cv\244\325\356\361PA\340\2523v\2.\301\351\243u\0\207\225\320\252x\202\310\324\25\21\223"..., 1363) = 1363
setitimer(ITIMER_REAL, {it_interval={0, 0}, it_value={0, 0}}, NULL) = 0
rt_sigaction(SIGALRM, {SIG_DFL, [ALRM], SA_RESTORER|SA_RESTART, 0x7f094452eff0}, {0x42c180, [ALRM], SA_RESTORER|SA_RESTART, 0x7f094452eff0}, 8) = 0
write(3, ";|\336\372\315\350\3475zk\314\227\371~\366\241kE\235L\203\307zy\252\222\277n\252\226nv"..., 1347) = 1347
select(5, [4], NULL, NULL, {0, 950000}) = 1 (in [4], left {0, 949995})
rt_sigaction(SIGALRM, {0x42c180, [ALRM], SA_RESTORER|SA_RESTART, 0x7f094452eff0}, {SIG_DFL, [ALRM], SA_RESTORER|SA_RESTART, 0x7f094452eff0}, 8) = 0
rt_sigprocmask(SIG_BLOCK, NULL, [], 8)  = 0
setitimer(ITIMER_REAL, {it_interval={0, 0}, it_value={900, 0}}, NULL) = 0
read(4, "\27\3\1\5S", 5)                = 5
