select(4, NULL, [3], NULL, {900, 0})    = 1 (out [3], left {899, 999994})
write(3, "GET /img/target/home_main_img.jp"..., 185) = 185
write(2, "HTTP request sent, awaiting resp"..., 40) = 40
select(4, [3], NULL, NULL, {900, 0})    = 1 (in [3], left {899, 920098})
recvfrom(3, "HTTP/1.1 200 OK\r\nDate: Mon, 30 J"..., 511, MSG_PEEK, NULL, NULL) = 364
read(3, "HTTP/1.1 200 OK\r\nDate: Mon, 30 J"..., 364) = 364
write(2, "200 OK\n", 7)                 = 7
stat("/home/bearface/website_output/www.berkeley.edu/img/target/home_main_img.jpg", 0x7ffffe5e1140) = -1 ENOENT (No such file or directory)
write(2, "Length: ", 8)                 = 8
write(2, "61878", 5)                    = 5
write(2, " (60K)", 6)                   = 6
write(2, " [image/jpeg]\n", 14)         = 14
stat("/home/bearface/website_output/www.berkeley.edu/img/target", 0x7ffffe5e1130) = -1 ENOENT (No such file or directory)
stat("/home", {st_mode=S_IFDIR|0755, st_size=4096, ...}) = 0
stat("/home/bearface", {st_mode=S_IFDIR|0755, st_size=4096, ...}) = 0
stat("/home/bearface/website_output", {st_mode=S_IFDIR|0755, st_size=4096, ...}) = 0
stat("/home/bearface/website_output/www.berkeley.edu", {st_mode=S_IFDIR|0755, st_size=4096, ...}) = 0
stat("/home/bearface/website_output/www.berkeley.edu/img", {st_mode=S_IFDIR|0755, st_size=4096, ...}) = 0
stat("/home/bearface/website_output/www.berkeley.edu/img/target", 0x7ffffe5e1050) = -1 ENOENT (No such file or directory)
mkdir("/home/bearface/website_output/www.berkeley.edu/img/target", 0777) = 0
open("/home/bearface/website_output/www.berkeley.edu/img/target/home_main_img.jpg", O_WRONLY|O_CREAT|O_TRUNC, 0666) = 4
write(2, "Saving to: \342\200\230/home/bearface/web"..., 93) = 93
write(2, "\n", 1)                       = 1
write(2, "\r", 1)                       = 1
write(2, " 0% [                           "..., 79) = 79
select(4, [3], NULL, NULL, {0, 950000}) = 1 (in [3], left {0, 949997})
read(3, "\377\330\377\340\0\20JFIF\0\1\2\0\0d\0d\0\0\377\341\ruhttp://n"..., 8192) = 1368
fstat(4, {st_mode=S_IFREG|0644, st_size=0, ...}) = 0
mmap(NULL, 4096, PROT_READ|PROT_WRITE, MAP_PRIVATE|MAP_ANONYMOUS, -1, 0) = 0x7feb0e058000
write(4, "\377\330\377\340\0\20JFIF\0\1\2\0\0d\0d\0\0\377\341\ruhttp://n"..., 1368) = 1368
select(4, [3], NULL, NULL, {0, 950000}) = 1 (in [3], left {0, 949760})
read(3, "               \n                "..., 8192) = 1368
write(4, "               \n                "..., 1368) = 1368
select(4, [3], NULL, NULL, {0, 950000}) = 1 (in [3], left {0, 949678})
read(3, "                                "..., 8192) = 1368
write(4, "                                "..., 1368) = 1368
select(4, [3], NULL, NULL, {0, 950000}) = 1 (in [3], left {0, 949918})
read(3, "\"\331~;\25\346\201P\360\265\253\22\274\251\th\272\31\325\26Np\330\206Xgm\300\37\32\215\331"..., 8192) = 1368
write(4, "\"\331~;\25\346\201P\360\265\253\22\274\251\th\272\31\325\26Np\330\206Xgm\300\37\32\215\331"..., 1368) = 1368
select(4, [3], NULL, NULL, {0, 950000}) = 1 (in [3], left {0, 949908})
read(3, "\357+\4\331\3=\263\17\2425\300\275\263\342\330\27\36297\346:\316\320L\2512\20\223\21>\221\n"..., 8192) = 1368
write(4, "\357+\4\331\3=\263\17\2425\300\275\263\342\330\27\36297\346:\316\320L\2512\20\223\21>\221\n"..., 1368) = 1368
select(4, [3], NULL, NULL, {0, 950000}) = 1 (in [3], left {0, 949998})
read(3, "z}\235\20m\231\211\365#\366\250\264\270\310\213\261\0X\202B\207\304W%\312\300\202\335\327Q\201 "..., 8192) = 1160
write(4, "z}\235\20m\231\211\365#\366\250\264\270\310\213\261\0X\202B\207\304W%\312\300\202\335\327Q\201 "..., 1160) = 1160
select(4, [3], NULL, NULL, {0, 950000}) = 1 (in [3], left {0, 949998})
read(3, "\327\312\365\344\316\267\333\325{5\265\31\305\202\353\27\312\25\211W\331\362&\213)u\313@\230\310\272J"..., 8192) = 1368
write(4, "\327\312\365\344\316\267\333\325{5\265\31\305\202\353\27\312\25\211W\331\362&\213)u\313@\230\310\272J"..., 1368) = 1368
select(4, [3], NULL, NULL, {0, 950000}) = 1 (in [3], left {0, 949998})
read(3, "\336\27^\243\217\377\0L?\204~\v\221\233\357?5\21\\v\324\262j\300e\5\322#\241\n\n\35"..., 8192) = 1368
write(4, "\336\27^\243\217\377\0L?\204~\v\221\233\357?5\21\\v\324\262j\300e\5\322#\241\n\n\35"..., 1368) = 1368
select(4, [3], NULL, NULL, {0, 950000}) = 1 (in [3], left {0, 949998})
read(3, "5\345\346\215\235 6\277\216\253\266\342k\224)&GRz(W\372\251\314w\351:\273|\rqp"..., 8192) = 1368
write(4, "5\345\346\215\235 6\277\216\253\266\342k\224)&GRz(W\372\251\314w\351:\273|\rqp"..., 1368) = 1368
select(4, [3], NULL, NULL, {0, 950000}) = 1 (in [3], left {0, 949952})
read(3, "\363\t\223[DoT\271\221R\322J\320\302Sw\25d\365)\354;\327K\314\373\227\23\215\231\242\321"..., 8192) = 1368
write(4, "\363\t\223[DoT\271\221R\322J\320\302Sw\25d\365)\354;\327K\314\373\227\23\215\231\242\321"..., 1368) = 1368
select(4, [3], NULL, NULL, {0, 950000}) = 1 (in [3], left {0, 949998})
read(3, "\256\215\273\277\350\353\226\262\246\320+\313\373p\340R\2436\317;\315\0271\350B\17\354L4v<\353"..., 8192) = 1368
write(4, "\256\215\273\277\350\353\226\262\246\320+\313\373p\340R\2436\317;\315\0271\350B\17\354L4v<\353"..., 1368) = 1368
select(4, [3], NULL, NULL, {0, 950000}) = 1 (in [3], left {0, 949998})
read(3, "\330\221\245\352\305S \26T\214\232J\334\340\334fW2\224\324e\351\20m.\271\264^\336\27\353j"..., 8192) = 1160
write(4, "\330\221\245\352\305S \26T\214\232J\334\340\334fW2\224\324e\351\20m.\271\264^\336\27\353j"..., 1160) = 1160
select(4, [3], NULL, NULL, {0, 950000}) = 1 (in [3], left {0, 949998})
read(3, "\310/Aa\337\305\360>:\332Z)\16m\26?\33u4X\310\0\353@\5\22\223\356\f\274\254\325"..., 8192) = 1368
write(4, "\310/Aa\337\305\360>:\332Z)\16m\26?\33u4X\310\0\353@\5\22\223\356\f\274\254\325"..., 1368) = 1368
select(4, [3], NULL, NULL, {0, 950000}) = 1 (in [3], left {0, 949998})
read(3, "\333k\275\311\321N\251\r\272(\364L\0179\310rD\312y7\214\t\334R\257\244~=\352\346o5"..., 8192) = 1368
write(4, "\333k\275\311\321N\251\r\272(\364L\0179\310rD\312y7\214\t\334R\257\244~=\352\346o5"..., 1368) = 1368
select(4, [3], NULL, NULL, {0, 950000}) = 1 (in [3], left {0, 949919})
read(3, "D8\352\244\20\375(\361\224V\316\333\371\257q{\326\20\242Vj\17E`e\2461\341\ty\5J"..., 8192) = 1368
write(4, "D8\352\244\20\375(\361\224V\316\333\371\257q{\326\20\242Vj\17E`e\2461\341\ty\5J"..., 1368) = 1368
select(4, [3], NULL, NULL, {0, 950000}) = 1 (in [3], left {0, 949044})
read(3, "H\21\252\244.'E'\366\317&\"f\267\253\351q@\201Y\346^g*D:\273\362\no!\27"..., 8192) = 1368
write(4, "H\21\252\244.'E'\366\317&\"f\267\253\351q@\201Y\346^g*D:\273\362\no!\27"..., 1368) = 1368
