statfs("/home/bearface/website_output/www.usc.edu/x/usc_homepage/assets/css/fonts", {f_type="EXT2_SUPER_MAGIC", f_bsize=4096, f_blocks=59275954, f_bfree=49147696, f_bavail=46130890, f_files=15065088, f_ffree=14788559, f_fsid={533008265, 2108930253}, f_namelen=255, f_frsize=4096}) = 0
stat("/home/bearface/website_output/www.usc.edu/x/usc_homepage/assets/css/fonts/ProximaNova-BoldIt-webfont.svg", 0x7fff959168a0) = -1 ENOENT (No such file or directory)
stat("/home/bearface/website_output/www.usc.edu/x/usc_homepage/assets/css/fonts/ProximaNova-BoldIt-webfont.svg", 0x7fff95916930) = -1 ENOENT (No such file or directory)
statfs("/home/bearface/website_output/www.usc.edu/x/usc_homepage/assets/css/fonts", {f_type="EXT2_SUPER_MAGIC", f_bsize=4096, f_blocks=59275954, f_bfree=49147696, f_bavail=46130890, f_files=15065088, f_ffree=14788559, f_fsid={533008265, 2108930253}, f_namelen=255, f_frsize=4096}) = 0
stat("/home/bearface/website_output/www.usc.edu/x/usc_homepage/assets/css/fonts/ProximaNova-BoldIt-webfont.svg", 0x7fff959168a0) = -1 ENOENT (No such file or directory)
nanosleep({1, 0}, 0x7fff959169b0)       = 0
stat("/etc/localtime", {st_mode=S_IFREG|0644, st_size=3519, ...}) = 0
write(2, "--2014-06-30 12:15:06--  http://"..., 107) = 107
select(4, [3], NULL, NULL, {0, 1})      = 1 (in [3], left {0, 0})
close(3)                                = 0
write(2, "Connecting to www.usc.edu (www.u"..., 63) = 63
socket(PF_INET, SOCK_STREAM, IPPROTO_IP) = 3
connect(3, {sa_family=AF_INET, sin_port=htons(80), sin_addr=inet_addr("128.125.253.146")}, 16) = 0
write(2, "connected.\n", 11)            = 11
select(4, NULL, [3], NULL, {900, 0})    = 1 (out [3], left {899, 999996})
write(3, "GET /x/usc_homepage/assets/css/f"..., 259) = 259
write(2, "HTTP request sent, awaiting resp"..., 40) = 40
select(4, [3], NULL, NULL, {900, 0})    = 1 (in [3], left {899, 932710})
recvfrom(3, "HTTP/1.1 200 OK\r\nDate: Mon, 30 J"..., 511, MSG_PEEK, NULL, NULL) = 332
read(3, "HTTP/1.1 200 OK\r\nDate: Mon, 30 J"..., 332) = 332
write(2, "200 OK\n", 7)                 = 7
stat("/home/bearface/website_output/www.usc.edu/x/usc_homepage/assets/css/fonts/ProximaNova-BoldIt-webfont.svg", 0x7fff959163d0) = -1 ENOENT (No such file or directory)
write(2, "Length: ", 8)                 = 8
write(2, "56125", 5)                    = 5
write(2, " (55K)", 6)                   = 6
write(2, " [image/svg+xml]\n", 17)      = 17
stat("/home/bearface/website_output/www.usc.edu/x/usc_homepage/assets/css/fonts", {st_mode=S_IFDIR|0755, st_size=4096, ...}) = 0
open("/home/bearface/website_output/www.usc.edu/x/usc_homepage/assets/css/fonts/ProximaNova-BoldIt-webfont.svg", O_WRONLY|O_CREAT|O_TRUNC, 0666) = 4
write(2, "Saving to: \342\200\230/home/bearface/web"..., 122) = 122
write(2, "\n", 1)                       = 1
write(2, "\r", 1)                       = 1
write(2, " 0% [                           "..., 79) = 79
select(4, [3], NULL, NULL, {0, 950000}) = 1 (in [3], left {0, 949994})
read(3, "<?xml version=\"1.0\" standalone=\""..., 8192) = 4180
fstat(4, {st_mode=S_IFREG|0644, st_size=0, ...}) = 0
mmap(NULL, 4096, PROT_READ|PROT_WRITE, MAP_PRIVATE|MAP_ANONYMOUS, -1, 0) = 0x7f76b35a5000
write(4, "<?xml version=\"1.0\" standalone=\""..., 4096) = 4096
write(4, " 145.5t-134.5 405.5zM383 512q0 -"..., 84) = 84
select(4, [3], NULL, NULL, {0, 950000}) = 1 (in [3], left {0, 886581})
read(3, "40 278.5q0 127 -55.5 201.5t-170."..., 8192) = 1360
write(4, "40 278.5q0 127 -55.5 201.5t-170."..., 1360) = 1360
select(4, [3], NULL, NULL, {0, 950000}) = 1 (in [3], left {0, 949379})
read(3, "5q-102 133 -295 133q-139 0 -239."..., 8192) = 1360
write(4, "5q-102 133 -295 133q-139 0 -239."..., 1360) = 1360
select(4, [3], NULL, NULL, {0, 950000}) = 1 (in [3], left {0, 949998})
read(3, "0 106 -45t43 -108q0 -74 -53 -127"..., 8192) = 1260
write(4, "0 106 -45t43 -108q0 -74 -53 -127"..., 1260) = 1260
select(4, [3], NULL, NULL, {0, 950000}) = 1 (in [3], left {0, 949998})
read(3, "7t397.5 110q287 0 466 -182.5t179"..., 8192) = 1360
write(4, "7t397.5 110q287 0 466 -182.5t179"..., 1360) = 1360
select(4, [3], NULL, NULL, {0, 950000}) = 1 (in [3], left {0, 949997})
read(3, "177 -422q0 -111 -30 -218t-98.5 -"..., 8192) = 1360
write(4, "177 -422q0 -111 -30 -218t-98.5 -"..., 1360) = 1360
select(4, [3], NULL, NULL, {0, 950000}) = 1 (in [3], left {0, 949998})
read(3, "ph unicode=\"M\" horiz-adv-x=\"1751"..., 8192) = 1360
write(4, "ph unicode=\"M\" horiz-adv-x=\"1751"..., 1360) = 1360
select(4, [3], NULL, NULL, {0, 950000}) = 1 (in [3], left {0, 949998})
read(3, " 58.5t64.5 152.5q0 68 -51 113t-1"..., 8192) = 1360
write(4, " 58.5t64.5 152.5q0 68 -51 113t-1"..., 1360) = 1360
select(4, [3], NULL, NULL, {0, 950000}) = 1 (in [3], left {0, 949997})
read(3, " 256h1027l-50 -233l-825 -877h645"..., 8192) = 1460
write(4, " 256h1027l-50 -233l-825 -877h645"..., 1460) = 1460
select(4, [3], NULL, NULL, {0, 950000}) = 1 (in [3], left {0, 949998})
read(3, "nicode=\"d\" horiz-adv-x=\"1200\" d="..., 8192) = 1360
write(4, "nicode=\"d\" horiz-adv-x=\"1200\" d="..., 1360) = 1360
select(4, [3], NULL, NULL, {0, 950000}) = 1 (in [3], left {0, 949975})
read(3, "10 41 10 61q0 127 -170 127q-115 "..., 8192) = 1360
write(4, "10 41 10 61q0 127 -170 127q-115 "..., 1360) = 1360
select(4, [3], NULL, NULL, {0, 950000}) = 1 (in [3], left {0, 949998})
read(3, "5\" d=\"M55 424q0 238 164 414t408 "..., 8192) = 1360
write(4, "5\" d=\"M55 424q0 238 164 414t408 "..., 1360) = 1360
select(4, [3], NULL, NULL, {0, 950000}) = 1 (in [3], left {0, 949997})
read(3, "261 46.5t-206 132.5z\" />\n<glyph "..., 8192) = 1360
write(4, "261 46.5t-206 132.5z\" />\n<glyph "..., 1360) = 1360
select(4, [3], NULL, NULL, {0, 950000}) = 1 (in [3], left {0, 949958})
