read(3, "\203\312vh*\1\374\203\t`X\243\0207P\250\273Y\243\177\rz\220\7\24\261\203\223eg\204g"..., 8192) = 2736
write(4, "\203\312vh*\1\374\203\t`X\243\0207P\250\273Y\243\177\rz\220\7\24\261\203\223eg\204g"..., 2736) = 2736
select(4, [3], NULL, NULL, {0, 950000}) = 1 (in [3], left {0, 949997})
read(3, "\354\333\276\356\373\276\360\33\277\362;\277\364[\277\366{\277\370\233\277\372\273\277\374\333\277\376\373\277\0\34"..., 8192) = 1368
write(4, "\354\333\276\356\373\276\360\33\277\362;\277\364[\277\366{\277\370\233\277\372\273\277\374\333\277\376\373\277\0\34"..., 1368) = 1368
select(4, [3], NULL, NULL, {0, 950000}) = 1 (in [3], left {0, 949996})
read(3, "\3i\302\35I\262\226\3\307h\342\32\5Y\f\5x\351\251vLR d\0\0321m\350\f\34."..., 8192) = 1368
write(4, "\3i\302\35I\262\226\3\307h\342\32\5Y\f\5x\351\251vLR d\0\0321m\350\f\34."..., 1368) = 1368
select(4, [3], NULL, NULL, {0, 950000}) = 1 (in [3], left {0, 949544})
read(3, "\324@Z\0Hy\242\30\207\360G\212\214\202\211fh\177\246u\202@\310p\37774\301\27\210`X"..., 8192) = 1368
write(4, "\324@Z\0Hy\242\30\207\360G\212\214\202\211fh\177\246u\202@\310p\37774\301\27\210`X"..., 1368) = 1368
select(4, [3], NULL, NULL, {0, 950000}) = 1 (in [3], left {0, 949997})
read(3, "\233\20\372+\301\34|/A&[\343{1/\314\2767\f\35&;\20\374\233\20\231K\301\23\f\304"..., 8192) = 2736
write(4, "\233\20\372+\301\34|/A&[\343{1/\314\2767\f\35&;\20\374\233\20\231K\301\23\f\304"..., 2736) = 2736
select(4, [3], NULL, NULL, {0, 950000}) = 1 (in [3], left {0, 949997})
read(3, "\237n\33D\344\361\f\255\16\33\342\2*\23\373\351\306\236u\312\251\316\237[7[\327\317^Q8|"..., 8192) = 2736
write(4, "\237n\33D\344\361\f\255\16\33\342\2*\23\373\351\306\236u\312\251\316\237[7[\327\317^Q8|"..., 2736) = 2736
select(4, [3], NULL, NULL, {0, 950000}) = 1 (in [3], left {0, 949952})
read(3, "OB8t\301@4!\254\1.$\34s\223\233D\2228*M0\261\211Nd\2163\234\361\217E"..., 8192) = 2736
write(4, "OB8t\301@4!\254\1.$\34s\223\233D\2228*M0\261\211Nd\2163\234\361\217E"..., 2736) = 2736
select(4, [3], NULL, NULL, {0, 950000}) = 1 (in [3], left {0, 949995})
read(3, "\227\313\334\346:\367\271\320\215\256t\247K\335\352Z\367\272\330\315\256v\267\313\335\356z\367\273\340\r\257"..., 8192) = 4104
write(4, "\227\313\334\346:\367\271\320\215\256t\247K\335\352Z\367\272\330\315\256v\267\313\335\356z\367\273\340\r\257"..., 4096) = 4096
write(4, "\372*\30\v\n\355jk", 8)       = 8
select(4, [3], NULL, NULL, {0, 950000}) = 1 (in [3], left {0, 949996})
read(3, "C\270\376\303\302\256\274\32d\307(\303V\333\323\256h\10\344\330\t\t\355j\313\255\7\20\204\306\270\343"..., 8192) = 4104
write(4, "C\270\376\303\302\256\274\32d\307(\303V\333\323\256h\10\344\330\t\t\355j\313\255\7\20\204\306\270\343"..., 4096) = 4096
write(4, "\22\37\20\210\246AW\271", 8)  = 8
select(4, [3], NULL, NULL, {0, 950000}) = 1 (in [3], left {0, 949595})
read(3, "\205#K\236L\331d\3\26\2123\37z\f\270\262\347\317\240C'l\2249s#\316OE\253^\315"..., 8192) = 1368
write(4, "\205#K\236L\331d\3\26\2123\37z\f\270\262\347\317\240C'l\2249s#\316OE\253^\315"..., 1368) = 1368
select(4, [3], NULL, NULL, {0, 950000}) = 1 (in [3], left {0, 949996})
read(3, "\351$\273\250\332\224\256\226\265\31\32\354\7v\313\333\335\276u #\f-n\323\2120\341\nd\204\303"..., 8192) = 2736
write(4, "\351$\273\250\332\224\256\226\265\31\32\354\7v\313\333\335\276u #\f-n\323\2120\341\nd\204\303"..., 2736) = 2736
select(4, [3], NULL, NULL, {0, 950000}) = 1 (in [3], left {0, 948486})
read(3, "\237@(\270B\315\221\204K$\204\341\fe\370\217\370\311\241\206\230\23a\6\37758\304\3zG$"..., 8192) = 1368
write(4, "\237@(\270B\315\221\204K$\204\341\fe\370\217\370\311\241\206\230\23a\6\37758\304\3zG$"..., 1368) = 1368
select(4, [3], NULL, NULL, {0, 950000}) = 1 (in [3], left {0, 949668})
read(3, "\243\231\302\375\250\346\233A~ \247\234\253\271\t\347\235x\346\251\347\236|\366\351\347\237\200\6*\350\240"..., 8192) = 2736
write(4, "\243\231\302\375\250\346\233A~ \247\234\253\271\t\347\235x\346\251\347\236|\366\351\347\237\200\6*\350\240"..., 2736) = 2736
select(4, [3], NULL, NULL, {0, 950000}) = 1 (in [3], left {0, 949220})
read(3, "/\357\274\361\267?/=\204\263O/\375\360\326\367\216}\366\271o\317}\355x\177\17\276\367\342\267\356"..., 8192) = 1368
write(4, "/\357\274\361\267?/=\204\263O/\375\360\326\367\216}\366\271o\317}\355x\177\17\276\367\342\267\356"..., 1368) = 1368
select(4, [3], NULL, NULL, {0, 950000}) = 1 (in [3], left {0, 949995})
read(3, "(g\245\362\31-c\25\300\3143\333\32\20\0!\371\4\5\4\0\377\0,\f\1#\0/\1\267\0"..., 8192) = 4104
write(4, "(g\245\362\31-c\25\300\3143\333\32\20\0!\371\4\5\4\0\377\0,\f\1#\0/\1\267\0"..., 4096) = 4096
write(4, "\326h\343\2158\346\250\343", 8) = 8
select(4, [3], NULL, NULL, {0, 950000}) = 1 (in [3], left {0, 949997})
read(3, "\216<\366\350\343\217@\6)\344\220D\26i\344\221H&\251\344\222L6\351\344\223PF)\345\224T"..., 8192) = 4104
write(4, "\216<\366\350\343\217@\6)\344\220D\26i\344\221H&\251\344\222L6\351\344\223PF)\345\224T"..., 4096) = 4096
write(4, "o\377\375\370\347\257\377\376", 8) = 8
select(4, [3], NULL, NULL, {0, 950000}) = 1 (in [3], left {0, 949995})
read(3, "\374\367\357\377\377x\222\204\0\7X\221c\344\344\5\200\303\336\0\27(\t\207\30\20)/\310\36\3\27"..., 8192) = 2736
write(4, "\374\367\357\377\377x\222\204\0\7X\221c\344\344\5\200\303\336\0\27(\t\207\30\20)/\310\36\3\27"..., 2736) = 2736
select(4, [3], NULL, NULL, {0, 950000}) = 1 (in [3], left {0, 949550})
read(3, "\375\367\340\207/\376\370\344\227o\376\371\350\247\257\376\372\354\267\357\376\373\360\307/\377\374\364\327o\377\375"..., 8192) = 2736
write(4, "\375\367\340\207/\376\370\344\227o\376\371\350\247\257\376\372\354\267\357\376\373\360\307/\377\374\364\327o\377\375"..., 2736) = 2736
select(4, [3], NULL, NULL, {0, 950000}) = 1 (in [3], left {0, 949995})
read(3, "w\32w\344-\370\340\204\27n\370\341\210'\256\370\342\2147\356\370\343\220G.\371\344\224Wn\371\345"..., 8192) = 4104
write(4, "w\32w\344-\370\340\204\27n\370\341\210'\256\370\342\2147\356\370\343\220G.\371\344\224Wn\371\345"..., 4096) = 4096
write(4, "\324n\25P\0\326Y\327", 8)     = 8
select(4, [3], NULL, NULL, {0, 950000}) = 1 (in [3], left {0, 949997})
read(3, "\302\365\330d\227m\366\331h\247\255\366\332l\267\355\366\333p\307-\367\334t\327m\367\335x\347\255\367"..., 8192) = 4104
write(4, "\302\365\330d\227m\366\331h\247\255\366\332l\267\355\366\333p\307-\367\334t\327m\367\335x\347\255\367"..., 4096) = 4096
write(4, "\355\3x0;G\275\17", 8)        = 8
select(4, [3], NULL, NULL, {0, 950000}) = 1 (in [3], left {0, 949997})
read(3, "\260#E\17\320\366\32\204\267o\204\360\17.\3\1 E\t\fh\333\353\276\336>\360F\270\0200\360"..., 8192) = 4104
write(4, "\260#E\17\320\366\32\204\267o\204\360\17.\3\1 E\t\fh\333\353\276\336>\360F\270\0200\360"..., 4096) = 4096
write(4, "\254\264\326j\353\255\270\346", 8) = 8
select(4, [3], NULL, NULL, {0, 950000}) = 1 (in [3], left {0, 949996})
read(3, "\252\353\256\274\366\352\353\257\300\6+\354\260\304\26k\354\261\310&\253\354\262\3146\353\354\263\320F+\355"..., 8192) = 1368
write(4, "\252\353\256\274\366\352\353\257\300\6+\354\260\304\26k\354\261\310&\253\354\262\3146\353\354\263\320F+\355"..., 1368) = 1368
select(4, [3], NULL, NULL, {0, 950000}) = 1 (in [3], left {0, 949813})
read(3, "\256\335\273x\363\352\335\313\267\257\337\277\200\3\v\36L\270\260\341\303\210\23+^\314\270\261\343\307\220#"..., 8192) = 2736
write(4, "\256\335\273x\363\352\335\313\267\257\337\277\200\3\v\36L\270\260\341\303\210\23+^\314\270\261\343\307\220#"..., 2736) = 2736
