read(3, "</p>\n  </div>\n\n    </article>\n</"..., 8192) = 2896
write(4, "</p>\n  </div>\n\n    </article>\n</"..., 2896) = 2896
select(4, [3], NULL, NULL, {0, 950000}) = 1 (in [3], left {0, 949995})
read(3, "=\"/sites/all/themes/bigduke/imag"..., 8192) = 8192
write(4, "=\"/sites/all/themes/bigduke/imag"..., 4096) = 4096
write(4, "cal-government-network/2014/jun/"..., 4096) = 4096
select(4, [3], NULL, NULL, {0, 950000}) = 1 (in [3], left {0, 949997})
read(3, "div class=\"node__content\">\n     "..., 8192) = 3392
write(4, "div class=\"node__content\">\n     "..., 3392) = 3392
select(4, [3], NULL, NULL, {0, 950000}) = 1 (in [3], left {0, 949997})
read(3, ":title\" datatype=\"\" class=\"node_"..., 8192) = 1448
write(4, ":title\" datatype=\"\" class=\"node_"..., 1448) = 1448
select(4, [3], NULL, NULL, {0, 950000}) = 1 (in [3], left {0, 949373})
read(3, "rticle>\n</li>\n  <li class=\"views"..., 8192) = 1448
write(4, "rticle>\n</li>\n  <li class=\"views"..., 1448) = 1448
select(4, [3], NULL, NULL, {0, 950000}) = 1 (in [3], left {0, 949997})
read(3, "Undergraduate Research\" src=\"/si"..., 8192) = 1448
write(4, "Undergraduate Research\" src=\"/si"..., 1448) = 1448
select(4, [3], NULL, NULL, {0, 950000}) = 1 (in [3], left {0, 949994})
read(3, "title\" datatype=\"\" class=\"node__"..., 8192) = 2896
write(4, "title\" datatype=\"\" class=\"node__"..., 2896) = 2896
select(4, [3], NULL, NULL, {0, 950000}) = 1 (in [3], left {0, 949996})
read(3, "ts_and_spotlight\">\n            <"..., 8192) = 1448
write(4, "ts_and_spotlight\">\n            <"..., 1448) = 1448
select(4, [3], NULL, NULL, {0, 950000}) = 1 (in [3], left {0, 949996})
read(3, "an>  </div>  \n          <div cla"..., 8192) = 2896
write(4, "an>  </div>  \n          <div cla"..., 2896) = 2896
select(4, [3], NULL, NULL, {0, 950000}) = 1 (in [3], left {0, 949995})
read(3, "4-07-02T19:00:00-04:00\">Jul</spa"..., 8192) = 1448
write(4, "4-07-02T19:00:00-04:00\">Jul</spa"..., 1448) = 1448
select(4, [3], NULL, NULL, {0, 950000}) = 1 (in [3], left {0, 949995})
read(3, " class=\"view-footer\">\n      <a c"..., 8192) = 2896
write(4, " class=\"view-footer\">\n      <a c"..., 2896) = 2896
select(4, [3], NULL, NULL, {0, 950000}) = 1 (in [3], left {0, 949996})
read(3, "><span class=\"spotlight-on--item"..., 8192) = 1448
write(4, "><span class=\"spotlight-on--item"..., 1448) = 1448
select(4, [3], NULL, NULL, {0, 950000}) = 1 (in [3], left {0, 949744})
read(3, "efault/files/duke_forward_400x40"..., 8192) = 1448
write(4, "efault/files/duke_forward_400x40"..., 1448) = 1448
select(4, [3], NULL, NULL, {0, 950000}) = 1 (in [3], left {0, 949996})
read(3, "span class=\"spotlight-on--item__"..., 8192) = 2896
write(4, "span class=\"spotlight-on--item__"..., 2896) = 2896
select(4, [3], NULL, NULL, {0, 950000}) = 1 (in [3], left {0, 949996})
read(3, "ht-on-column-wrapper-2\"><div cla"..., 8192) = 2896
write(4, "ht-on-column-wrapper-2\"><div cla"..., 2896) = 2896
select(4, [3], NULL, NULL, {0, 950000}) = 1 (in [3], left {0, 949997})
read(3, "tem\"><span class=\"spotlight-on--"..., 8192) = 2896
write(4, "tem\"><span class=\"spotlight-on--"..., 2896) = 2896
select(4, [3], NULL, NULL, {0, 950000}) = 1 (in [3], left {0, 949997})
read(3, "</div>\n<div class=\"bigduke-horiz"..., 8192) = 2896
write(4, "</div>\n<div class=\"bigduke-horiz"..., 2896) = 2896
select(4, [3], NULL, NULL, {0, 950000}) = 1 (in [3], left {0, 949997})
read(3, "instagram-post node--full node--"..., 8192) = 2896
write(4, "instagram-post node--full node--"..., 2896) = 2896
select(4, [3], NULL, NULL, {0, 950000}) = 1 (in [3], left {0, 949688})
read(3, "ass=\"horiz-media--image\" src=\"/s"..., 8192) = 1448
write(4, "ass=\"horiz-media--image\" src=\"/s"..., 1448) = 1448
select(4, [3], NULL, NULL, {0, 950000}) = 1 (in [3], left {0, 949996})
read(3, "rk\"></a></h3>\n        \n  \n  <div"..., 8192) = 2896
write(4, "rk\"></a></h3>\n        \n  \n  <div"..., 2896) = 2896
select(4, [3], NULL, NULL, {0, 950000}) = 1 (in [3], left {0, 949997})
read(3, "of=\"sioc:Item foaf:Document\" rol"..., 8192) = 1448
write(4, "of=\"sioc:Item foaf:Document\" rol"..., 1448) = 1448
select(4, [3], NULL, NULL, {0, 950000}) = 1 (in [3], left {0, 949997})
read(3, "/hphotos-xpa1/t51.2885-15/104750"..., 8192) = 1448
write(4, "/hphotos-xpa1/t51.2885-15/104750"..., 1448) = 1448
select(4, [3], NULL, NULL, {0, 950000}) = 1 (in [3], left {0, 949997})
read(3, "    \n  <div class=\"views-field v"..., 8192) = 2896
write(4, "    \n  <div class=\"views-field v"..., 2896) = 2896
select(4, [3], NULL, NULL, {0, 950000}) = 1 (in [3], left {0, 949998})
read(3, " class=\"field-content social-med"..., 8192) = 2896
write(4, " class=\"field-content social-med"..., 2896) = 2896
select(4, [3], NULL, NULL, {0, 950000}) = 1 (in [3], left {0, 949997})
read(3, "eUniv</a></div>  </div>  \n      "..., 8192) = 2896
write(4, "eUniv</a></div>  </div>  \n      "..., 2896) = 2896
