write(3, "GET /search?q=computer+science H"..., 123) = 123
write(2, "HTTP request sent, awaiting resp"..., 40) = 40
select(4, [3], NULL, NULL, {900, 0})    = 1 (in [3], left {899, 941829})
recvfrom(3, "HTTP/1.1 200 OK\r\nDate: Mon, 30 J"..., 511, MSG_PEEK, NULL, NULL) = 511
read(3, "HTTP/1.1 200 OK\r\nDate: Mon, 30 J"..., 511) = 511
select(4, [3], NULL, NULL, {900, 0})    = 1 (in [3], left {899, 999995})
recvfrom(3, "gle.com; HttpOnly\r\nP3P: CP=\"This"..., 512, MSG_PEEK, NULL, NULL) = 512
read(3, "gle.com; HttpOnly\r\nP3P: CP=\"This"..., 282) = 282
write(2, "200 OK\n", 7)                 = 7
stat("/home/bearface/website_output/www.google.com/search?q=computer+science", 0x7fff7a8cdc70) = -1 ENOENT (No such file or directory)
write(2, "Length: ", 8)                 = 8
write(2, "unspecified", 11)             = 11
write(2, " [text/html]\n", 13)          = 13
stat("/home/bearface/website_output/www.google.com", {st_mode=S_IFDIR|0755, st_size=4096, ...}) = 0
open("/home/bearface/website_output/www.google.com/search?q=computer+science", O_WRONLY|O_CREAT|O_TRUNC, 0666) = 4
open("/usr/lib/charset.alias", O_RDONLY|O_NOFOLLOW) = -1 ENOENT (No such file or directory)
write(2, "Saving to: \342\200\230/home/bearface/web"..., 88) = 88
ioctl(2, TIOCGWINSZ, {ws_row=24, ws_col=80, ws_xpixel=0, ws_ypixel=0}) = 0
write(2, "\n", 1)                       = 1
open("/usr/lib/x86_64-linux-gnu/gconv/gconv-modules.cache", O_RDONLY) = 5
fstat(5, {st_mode=S_IFREG|0644, st_size=26258, ...}) = 0
mmap(NULL, 26258, PROT_READ, MAP_SHARED, 5, 0) = 0x7f6bacac2000
close(5)                                = 0
write(2, "\r", 1)                       = 1
write(2, "    [<=>                        "..., 79) = 79
select(4, [3], NULL, NULL, {900, 0})    = 1 (in [3], left {899, 999994})
recvfrom(3, "8000\r\n<!doctype html><html items"..., 127, MSG_PEEK, NULL, NULL) = 127
read(3, "8000\r\n", 6)                  = 6
select(4, [3], NULL, NULL, {0, 950000}) = 1 (in [3], left {0, 949996})
read(3, "<!doctype html><html itemscope=\""..., 8192) = 8192
fstat(4, {st_mode=S_IFREG|0644, st_size=0, ...}) = 0
mmap(NULL, 4096, PROT_READ|PROT_WRITE, MAP_PRIVATE|MAP_ANONYMOUS, -1, 0) = 0x7f6bacac1000
write(4, "<!doctype html><html itemscope=\""..., 8192) = 8192
select(4, [3], NULL, NULL, {0, 950000}) = 1 (in [3], left {0, 949995})
read(3, "ext-decoration:none !important;-"..., 8192) = 4689
write(4, "ext-decoration:none !important;-"..., 4096) = 4096
write(4, "top,#fff,#f8f8f8);background-ima"..., 593) = 593
select(4, [3], NULL, NULL, {0, 950000}) = 1 (in [3], left {0, 939746})
read(3, "px 2px rgba(0,0,0,.1)}#gbmpas{ma"..., 8192) = 2736
write(4, "px 2px rgba(0,0,0,.1)}#gbmpas{ma"..., 2736) = 2736
select(4, [3], NULL, NULL, {0, 950000}) = 1 (in [3], left {0, 949995})
read(3, "gn:center}.nobr{white-space:nowr"..., 8192) = 4104
write(4, "gn:center}.nobr{white-space:nowr"..., 4096) = 4096
write(4, "te-space", 8)                 = 8
select(4, [3], NULL, NULL, {0, 950000}) = 1 (in [3], left {0, 949996})
read(3, ":nowrap}.mslg>td{padding-right:1"..., 8192) = 2736
write(4, ":nowrap}.mslg>td{padding-right:1"..., 2736) = 2736
select(4, [3], NULL, NULL, {0, 950000}) = 1 (in [3], left {0, 949998})
read(3, "-menu-item-text{color:#333}.sfbg"..., 8192) = 1368
write(4, "-menu-item-text{color:#333}.sfbg"..., 1368) = 1368
select(4, [3], NULL, NULL, {0, 950000}) = 1 (in [3], left {0, 948837})
read(3, "t(top,#4d90fe,#4787ed);backgroun"..., 8192) = 2736
write(4, "t(top,#4d90fe,#4787ed);backgroun"..., 2736) = 2736
select(4, [3], NULL, NULL, {0, 950000}) = 1 (in [3], left {0, 949938})
read(3, "=c+1},ia=[],ha=0;p(\"logger\",{il:"..., 6207) = 1368
write(4, "=c+1},ia=[],ha=0;p(\"logger\",{il:"..., 1368) = 1368
select(4, [3], NULL, NULL, {0, 950000}) = 1 (in [3], left {0, 949998})
read(3, "[1],(g=d.libs)&&!d.l&&d.i&&wa(g)"..., 4839) = 1368
write(4, "[1],(g=d.libs)&&!d.l&&d.i&&wa(g)"..., 1368) = 1368
select(4, [3], NULL, NULL, {0, 950000}) = 1 (in [3], left {0, 949935})
read(3, "k.a(\"\"),K=function(a,b){var c=a."..., 3471) = 1368
write(4, "k.a(\"\"),K=function(a,b){var c=a."..., 1368) = 1368
select(4, [3], NULL, NULL, {0, 950000}) = 1 (in [3], left {0, 949888})
read(3, "{},Ta={},P={},Q=void 0,Ya=functi"..., 2103) = 1368
write(4, "{},Ta={},P={},Q=void 0,Ya=functi"..., 1368) = 1368
select(4, [3], NULL, NULL, {0, 950000}) = 1 (in [3], left {0, 949998})
read(3, ";J(Ba.firstChild,\"gbmh\")||ab(Ba,"..., 735) = 735
write(4, ";J(Ba.firstChild,\"gbmh\")||ab(Ba,"..., 735) = 735
select(4, [3], NULL, NULL, {900, 0})    = 1 (in [3], left {899, 999998})
recvfrom(3, "\r\n39c2\r\n{N[a]||(N[a]=[]);N[a].pu"..., 127, MSG_PEEK, NULL, NULL) = 127
read(3, "\r\n", 2)                      = 2
select(4, [3], NULL, NULL, {900, 0})    = 1 (in [3], left {899, 999998})
recvfrom(3, "39c2\r\n{N[a]||(N[a]=[]);N[a].push"..., 127, MSG_PEEK, NULL, NULL) = 127
read(3, "39c2\r\n", 6)                  = 6
select(4, [3], NULL, NULL, {0, 950000}) = 1 (in [3], left {0, 949999})
