write(4, "(c < 128) {string += String.from"..., 4096) = 4096
write(4, "rrentButton = $('<li>' + (page) "..., 1376) = 1376
select(4, [3], NULL, NULL, {0, 950000}) = 1 (in [3], left {0, 923481})
read(3, "al[0] == \"GSAq\")s = nameVal[1];}"..., 8192) = 1368
write(4, "al[0] == \"GSAq\")s = nameVal[1];}"..., 1368) = 1368
select(4, [3], NULL, NULL, {0, 950000}) = 1 (in [3], left {0, 949837})
read(3, "lease. Have fun!*/\n(function(e){"..., 8192) = 1368
write(4, "lease. Have fun!*/\n(function(e){"..., 1368) = 1368
select(4, [3], NULL, NULL, {0, 950000}) = 1 (in [3], left {0, 949997})
read(3, "pauseButton=s.init.uiElements(s."..., 8192) = 2736
write(4, "pauseButton=s.init.uiElements(s."..., 2736) = 2736
select(4, [3], NULL, NULL, {0, 950000}) = 1 (in [3], left {0, 949279})
read(3, "hTag=s.currentFrame.attr(s.getHa"..., 8192) = 2736
write(4, "hTag=s.currentFrame.attr(s.getHa"..., 2736) = 2736
select(4, [3], NULL, NULL, {0, 950000}) = 1 (in [3], left {0, 949939})
read(3, "ouchstartX:-1,touchstartY:-1,tou"..., 8192) = 1368
write(4, "ouchstartX:-1,touchstartY:-1,tou"..., 1368) = 1368
select(4, [3], NULL, NULL, {0, 950000}) = 1 (in [3], left {0, 949996})
read(3, "ransition:\"-ms-\",transition:\"\"},"..., 8192) = 2736
write(4, "ransition:\"-ms-\",transition:\"\"},"..., 2736) = 2736
select(4, [3], NULL, NULL, {0, 950000}) = 1 (in [3], left {0, 949997})
read(3, "ned){var e=this.src;this.src=\"da"..., 8192) = 1368
write(4, "ned){var e=this.src;this.src=\"da"..., 1368) = 1368
select(4, [3], NULL, NULL, {0, 950000}) = 1 (in [3], left {0, 949997})
read(3, ";e.settings.pauseIcon!==undefine"..., 8192) = 2736
write(4, ";e.settings.pauseIcon!==undefine"..., 2736) = 2736
select(4, [3], NULL, NULL, {0, 950000}) = 1 (in [3], left {0, 923721})
read(3, "fault:setTimeout(i,r.settings.tr"..., 8192) = 2736
write(4, "fault:setTimeout(i,r.settings.tr"..., 2736) = 2736
select(4, [3], NULL, NULL, {0, 950000}) = 1 (in [3], left {0, 949994})
read(3, "mberOfFrames?t.currentFrameID+1:"..., 8192) = 2736
write(4, "mberOfFrames?t.currentFrameID+1:"..., 2736) = 2736
select(4, [3], NULL, NULL, {0, 950000}) = 1 (in [3], left {0, 948467})
read(3, "t==\"pfx\"?i:!0}return!1}function "..., 8192) = 2736
write(4, "t==\"pfx\"?i:!0}return!1}function "..., 2736) = 2736
select(4, [3], NULL, NULL, {0, 950000}) = 1 (in [3], left {0, 949995})
read(3, "on-duration: 1s; transition-dura"..., 8192) = 2736
write(4, "on-duration: 1s; transition-dura"..., 2736) = 2736
select(4, [3], NULL, NULL, {0, 950000}) = 1 (in [3], left {0, 949995})
read(3, "unction($){$.fn.hoverIntent=func"..., 8192) = 2736
write(4, "unction($){$.fn.hoverIntent=func"..., 2736) = 2736
select(4, [3], NULL, NULL, {0, 950000}) = 1 (in [3], left {0, 949567})
read(3, "ndexOf(\"scroll\")&&c.bind(j.event"..., 8192) = 1368
write(4, "ndexOf(\"scroll\")&&c.bind(j.event"..., 1368) = 1368
select(4, [3], NULL, NULL, {0, 950000}) = 1 (in [3], left {0, 949996})
read(3, "(b){return a.rightoffold(b,{thre"..., 8192) = 4104
write(4, "(b){return a.rightoffold(b,{thre"..., 4096) = 4096
write(4, "this},a(", 8)                 = 8
select(4, [3], NULL, NULL, {0, 950000}) = 1 (in [3], left {0, 949995})
read(3, "document).on(\"click.modal.data-a"..., 8192) = 4104
write(4, "document).on(\"click.modal.data-a"..., 4096) = 4096
write(4, "y&&typeo", 8)                 = 8
select(4, [3], NULL, NULL, {0, 950000}) = 1 (in [3], left {0, 949994})
read(3, "f b.delay==\"number\"&&(b.delay={s"..., 8192) = 2736
write(4, "f b.delay==\"number\"&&(b.delay={s"..., 2736) = 2736
select(4, [3], NULL, NULL, {0, 950000}) = 1 (in [3], left {0, 924613})
read(3, "\"data-original-title\",a.attr(\"ti"..., 8192) = 1368
write(4, "\"data-original-title\",a.attr(\"ti"..., 1368) = 1368
select(4, [3], NULL, NULL, {0, 950000}) = 1 (in [3], left {0, 949996})
read(3, "ss=\"tooltip\"><div class=\"tooltip"..., 8192) = 1368
write(4, "ss=\"tooltip\"><div class=\"tooltip"..., 1368) = 1368
select(4, [3], NULL, NULL, {0, 950000}) = 1 (in [3], left {0, 949995})
read(3, "({},a.fn.collapse.defaults,c),th"..., 8192) = 2736
write(4, "({},a.fn.collapse.defaults,c),th"..., 2736) = 2736
select(4, [3], NULL, NULL, {0, 950000}) = 1 (in [3], left {0, 948200})
read(3, "()},updater:function(a){return a"..., 8192) = 1368
write(4, "()},updater:function(a){return a"..., 1368) = 1368
select(4, [3], NULL, NULL, {0, 950000}) = 1 (in [3], left {0, 948212})
read(3, "tive\"),this.$menu.html(b),this},"..., 8192) = 8192
write(4, "tive\"),this.$menu.html(b),this},"..., 4096) = 4096
write(4, "rch,#d_medicine,#d_civic,#d_camp"..., 4096) = 4096
select(4, [3], NULL, NULL, {0, 950000}) = 1 (in [3], left {0, 949995})
read(3, "col .module a').gaTrackEvent({ca"..., 6573) = 6573
write(4, "col .module a').gaTrackEvent({ca"..., 4096) = 4096
write(4, "addClass('active');\n\t\t\tif (!sequ"..., 2477) = 2477
