write(2, "Reusing existing connection to w"..., 52) = 52
select(4, NULL, [3], NULL, {900, 0})    = 1 (out [3], left {899, 999997})
write(3, "GET /i/template/greybullet.png H"..., 378) = 378
write(2, "HTTP request sent, awaiting resp"..., 40) = 40
select(4, [3], NULL, NULL, {900, 0})    = 1 (in [3], left {899, 969905})
recvfrom(3, "HTTP/1.1 200 OK\r\nDate: Mon, 30 J"..., 511, MSG_PEEK, NULL, NULL) = 404
read(3, "HTTP/1.1 200 OK\r\nDate: Mon, 30 J"..., 312) = 312
write(2, "200 OK\n", 7)                 = 7
stat("/home/bearface/website_output/www.uchicago.edu/i/template/greybullet.png", 0x7fff7e3ef1b0) = -1 ENOENT (No such file or directory)
write(2, "Length: ", 8)                 = 8
write(2, "92", 2)                       = 2
write(2, " [image/png]\n", 13)          = 13
stat("/home/bearface/website_output/www.uchicago.edu/i/template", {st_mode=S_IFDIR|0755, st_size=4096, ...}) = 0
open("/home/bearface/website_output/www.uchicago.edu/i/template/greybullet.png", O_WRONLY|O_CREAT|O_TRUNC, 0666) = 4
write(2, "Saving to: \342\200\230/home/bearface/web"..., 90) = 90
write(2, "\n", 1)                       = 1
write(2, "\r", 1)                       = 1
write(2, " 0% [                           "..., 79) = 79
select(4, [3], NULL, NULL, {0, 950000}) = 1 (in [3], left {0, 949997})
read(3, "\211PNG\r\n\32\n\0\0\0\rIHDR\0\0\0\6\0\0\0\6\10\6\0\0\0\340\314\357"..., 92) = 92
fstat(4, {st_mode=S_IFREG|0644, st_size=0, ...}) = 0
mmap(NULL, 4096, PROT_READ|PROT_WRITE, MAP_PRIVATE|MAP_ANONYMOUS, -1, 0) = 0x7fcea595e000
write(4, "\211PNG\r\n\32\n\0\0\0\rIHDR\0\0\0\6\0\0\0\6\10\6\0\0\0\340\314\357"..., 92) = 92
write(2, "\r", 1)                       = 1
write(2, "100%[==========================="..., 79) = 79
write(2, "\n\n", 2)                     = 2
close(4)                                = 0
munmap(0x7fcea595e000, 4096)            = 0
stat("/etc/localtime", {st_mode=S_IFREG|0644, st_size=3519, ...}) = 0
utime("/home/bearface/website_output/www.uchicago.edu/i/template/greybullet.png", [2014/06/30-12:29:03, 2013/05/06-11:58:35]) = 0
write(2, "2014-06-30 12:29:03 (775 KB/s) -"..., 127) = 127
statfs("/home/bearface/website_output/www.uchicago.edu/i/template", {f_type="EXT2_SUPER_MAGIC", f_bsize=4096, f_blocks=59275954, f_bfree=49122662, f_bavail=46105856, f_files=15065088, f_ffree=14788035, f_fsid={533008265, 2108930253}, f_namelen=255, f_frsize=4096}) = 0
stat("/home/bearface/website_output/www.uchicago.edu/i/template/end_mark.png", 0x7fff7e3ef680) = -1 ENOENT (No such file or directory)
stat("/home/bearface/website_output/www.uchicago.edu/i/template/end_mark.png", 0x7fff7e3ef710) = -1 ENOENT (No such file or directory)
statfs("/home/bearface/website_output/www.uchicago.edu/i/template", {f_type="EXT2_SUPER_MAGIC", f_bsize=4096, f_blocks=59275954, f_bfree=49122662, f_bavail=46105856, f_files=15065088, f_ffree=14788035, f_fsid={533008265, 2108930253}, f_namelen=255, f_frsize=4096}) = 0
stat("/home/bearface/website_output/www.uchicago.edu/i/template/end_mark.png", 0x7fff7e3ef680) = -1 ENOENT (No such file or directory)
nanosleep({1, 0}, 0x7fff7e3ef790)       = 0
stat("/etc/localtime", {st_mode=S_IFREG|0644, st_size=3519, ...}) = 0
write(2, "--2014-06-30 12:29:04--  http://"..., 73) = 73
select(4, [3], NULL, NULL, {0, 1})      = 0 (Timeout)
getpeername(3, {sa_family=AF_INET, sin_port=htons(80), sin_addr=inet_addr("198.101.129.15")}, [16]) = 0
write(2, "Reusing existing connection to w"..., 52) = 52
select(4, NULL, [3], NULL, {900, 0})    = 1 (out [3], left {899, 999996})
write(3, "GET /i/template/end_mark.png HTT"..., 376) = 376
write(2, "HTTP request sent, awaiting resp"..., 40) = 40
select(4, [3], NULL, NULL, {900, 0})    = 1 (in [3], left {899, 967937})
recvfrom(3, "HTTP/1.1 200 OK\r\nDate: Mon, 30 J"..., 511, MSG_PEEK, NULL, NULL) = 511
read(3, "HTTP/1.1 200 OK\r\nDate: Mon, 30 J"..., 313) = 313
write(2, "200 OK\n", 7)                 = 7
stat("/home/bearface/website_output/www.uchicago.edu/i/template/end_mark.png", 0x7fff7e3ef1b0) = -1 ENOENT (No such file or directory)
write(2, "Length: ", 8)                 = 8
write(2, "657", 3)                      = 3
write(2, " [image/png]\n", 13)          = 13
stat("/home/bearface/website_output/www.uchicago.edu/i/template", {st_mode=S_IFDIR|0755, st_size=4096, ...}) = 0
open("/home/bearface/website_output/www.uchicago.edu/i/template/end_mark.png", O_WRONLY|O_CREAT|O_TRUNC, 0666) = 4
write(2, "Saving to: \342\200\230/home/bearface/web"..., 88) = 88
write(2, "\n", 1)                       = 1
write(2, "\r", 1)                       = 1
write(2, " 0% [                           "..., 79) = 79
select(4, [3], NULL, NULL, {0, 950000}) = 1 (in [3], left {0, 949997})
read(3, "\211PNG\r\n\32\n\0\0\0\rIHDR\0\0\0\37\0\0\0)\10\3\0\0\0\372S\2"..., 657) = 657
fstat(4, {st_mode=S_IFREG|0644, st_size=0, ...}) = 0
mmap(NULL, 4096, PROT_READ|PROT_WRITE, MAP_PRIVATE|MAP_ANONYMOUS, -1, 0) = 0x7fcea595e000
write(4, "\211PNG\r\n\32\n\0\0\0\rIHDR\0\0\0\37\0\0\0)\10\3\0\0\0\372S\2"..., 657) = 657
write(2, "\r", 1)                       = 1
write(2, "100%[==========================="..., 79) = 79
write(2, "\n\n", 2)                     = 2
close(4)                                = 0
munmap(0x7fcea595e000, 4096)            = 0
stat("/etc/localtime", {st_mode=S_IFREG|0644, st_size=3519, ...}) = 0
utime("/home/bearface/website_output/www.uchicago.edu/i/template/end_mark.png", [2014/06/30-12:29:05, 2014/05/19-14:32:14]) = 0
write(2, "2014-06-30 12:29:05 (5.59 MB/s) "..., 128) = 128
statfs("/home/bearface/website_output/www.uchicago.edu/i/template", {f_type="EXT2_SUPER_MAGIC", f_bsize=4096, f_blocks=59275954, f_bfree=49122655, f_bavail=46105849, f_files=15065088, f_ffree=14788034, f_fsid={533008265, 2108930253}, f_namelen=255, f_frsize=4096}) = 0
stat("/home/bearface/website_output/www.uchicago.edu/i/template/end_mark.svg", 0x7fff7e3ef680) = -1 ENOENT (No such file or directory)
stat("/home/bearface/website_output/www.uchicago.edu/i/template/end_mark.svg", 0x7fff7e3ef710) = -1 ENOENT (No such file or directory)
