write(2, "\r", 1)                       = 1
write(2, " 0% [                           "..., 79) = 79
select(4, [3], NULL, NULL, {0, 950000}) = 1 (in [3], left {0, 949996})
read(3, "/**\n * Timeago is a jQuery plugi"..., 6828) = 1044
fstat(4, {st_mode=S_IFREG|0644, st_size=0, ...}) = 0
mmap(NULL, 4096, PROT_READ|PROT_WRITE, MAP_PRIVATE|MAP_ANONYMOUS, -1, 0) = 0x7f094575f000
write(4, "/**\n * Timeago is a jQuery plugi"..., 1044) = 1044
select(4, [3], NULL, NULL, {0, 950000}) = 1 (in [3], left {0, 925738})
read(3, "imestamp));\n    }\n  };\n  var $t "..., 5784) = 1380
write(4, "imestamp));\n    }\n  };\n  var $t "..., 1380) = 1380
select(4, [3], NULL, NULL, {0, 950000}) = 1 (in [3], left {0, 949540})
read(3, "= Math.abs(distanceMillis) / 100"..., 4404) = 4140
write(4, "= Math.abs(distanceMillis) / 100"..., 4096) = 4096
write(4, "     }\n    }\n    return element."..., 44) = 44
select(4, [3], NULL, NULL, {0, 950000}) = 1 (in [3], left {0, 928144})
read(3, "o\");\n  }\n\n  function inWords(dat"..., 264) = 264
write(4, "o\");\n  }\n\n  function inWords(dat"..., 264) = 264
write(2, "\r", 1)                       = 1
write(2, "100%[==========================="..., 79) = 79
write(2, "\n\n", 2)                     = 2
close(4)                                = 0
munmap(0x7f094575f000, 4096)            = 0
stat("/etc/localtime", {st_mode=S_IFREG|0644, st_size=3519, ...}) = 0
utime("/home/bearface/website_output/www.cornell.edu/assets/js/jquery.timeago.js", [2014/06/30-12:35:17, 2014/06/23-12:14:40]) = 0
write(2, "2014-06-30 12:35:17 (136 KB/s) -"..., 132) = 132
statfs("/home/bearface/website_output/www.cornell.edu/assets/core/fonts", 0x7fff66db0a50) = -1 ENOENT (No such file or directory)
statfs("/home/bearface/website_output/www.cornell.edu/assets/core", {f_type="EXT2_SUPER_MAGIC", f_bsize=4096, f_blocks=59275954, f_bfree=49113386, f_bavail=46096580, f_files=15065088, f_ffree=14787872, f_fsid={533008265, 2108930253}, f_namelen=255, f_frsize=4096}) = 0
stat("/home/bearface/website_output/www.cornell.edu/assets/core/fonts/fontcustom.eot", 0x7fff66db0aa0) = -1 ENOENT (No such file or directory)
stat("/home/bearface/website_output/www.cornell.edu/assets/core/fonts/fontcustom.eot", 0x7fff66db0b30) = -1 ENOENT (No such file or directory)
statfs("/home/bearface/website_output/www.cornell.edu/assets/core/fonts", 0x7fff66db0a50) = -1 ENOENT (No such file or directory)
statfs("/home/bearface/website_output/www.cornell.edu/assets/core", {f_type="EXT2_SUPER_MAGIC", f_bsize=4096, f_blocks=59275954, f_bfree=49113386, f_bavail=46096580, f_files=15065088, f_ffree=14787872, f_fsid={533008265, 2108930253}, f_namelen=255, f_frsize=4096}) = 0
stat("/home/bearface/website_output/www.cornell.edu/assets/core/fonts/fontcustom.eot", 0x7fff66db0aa0) = -1 ENOENT (No such file or directory)
nanosleep({1, 0}, 0x7fff66db0bb0)       = 0
stat("/etc/localtime", {st_mode=S_IFREG|0644, st_size=3519, ...}) = 0
write(2, "--2014-06-30 12:35:18--  http://"..., 81) = 81
select(4, [3], NULL, NULL, {0, 1})      = 0 (Timeout)
getpeername(3, {sa_family=AF_INET, sin_port=htons(80), sin_addr=inet_addr("132.236.204.10")}, [16]) = 0
write(2, "Reusing existing connection to w"..., 51) = 51
select(4, NULL, [3], NULL, {900, 0})    = 1 (out [3], left {899, 999996})
write(3, "GET /assets/core/fonts/fontcusto"..., 231) = 231
write(2, "HTTP request sent, awaiting resp"..., 40) = 40
select(4, [3], NULL, NULL, {900, 0})    = 1 (in [3], left {899, 967359})
recvfrom(3, "HTTP/1.1 200 OK\r\nSet-Cookie: cor"..., 511, MSG_PEEK, NULL, NULL) = 511
read(3, "HTTP/1.1 200 OK\r\nSet-Cookie: cor"..., 410) = 410
write(2, "200 OK\n", 7)                 = 7
stat("/home/bearface/website_output/www.cornell.edu/assets/core/fonts/fontcustom.eot", 0x7fff66db0590) = -1 ENOENT (No such file or directory)
write(2, "Length: ", 8)                 = 8
write(2, "9644", 4)                     = 4
write(2, " (9.4K)", 7)                  = 7
write(2, " [application/vnd.ms-fontobject]"..., 33) = 33
stat("/home/bearface/website_output/www.cornell.edu/assets/core/fonts", 0x7fff66db0580) = -1 ENOENT (No such file or directory)
stat("/home", {st_mode=S_IFDIR|0755, st_size=4096, ...}) = 0
stat("/home/bearface", {st_mode=S_IFDIR|0755, st_size=4096, ...}) = 0
stat("/home/bearface/website_output", {st_mode=S_IFDIR|0755, st_size=4096, ...}) = 0
stat("/home/bearface/website_output/www.cornell.edu", {st_mode=S_IFDIR|0755, st_size=4096, ...}) = 0
stat("/home/bearface/website_output/www.cornell.edu/assets", {st_mode=S_IFDIR|0755, st_size=4096, ...}) = 0
stat("/home/bearface/website_output/www.cornell.edu/assets/core", {st_mode=S_IFDIR|0755, st_size=4096, ...}) = 0
stat("/home/bearface/website_output/www.cornell.edu/assets/core/fonts", 0x7fff66db04a0) = -1 ENOENT (No such file or directory)
mkdir("/home/bearface/website_output/www.cornell.edu/assets/core/fonts", 0777) = 0
open("/home/bearface/website_output/www.cornell.edu/assets/core/fonts/fontcustom.eot", O_WRONLY|O_CREAT|O_TRUNC, 0666) = 4
write(2, "Saving to: \342\200\230/home/bearface/web"..., 96) = 96
write(2, "\n", 1)                       = 1
write(2, "\r", 1)                       = 1
write(2, " 0% [                           "..., 79) = 79
select(4, [3], NULL, NULL, {0, 950000}) = 1 (in [3], left {0, 949998})
read(3, "\254%\0\0\364$\0\0\1\0\2\0\0\0\0\0\2\0\6\3\0\0\0\0\0\0\1\0\364\1\0\0"..., 8192) = 1021
fstat(4, {st_mode=S_IFREG|0644, st_size=0, ...}) = 0
mmap(NULL, 4096, PROT_READ|PROT_WRITE, MAP_PRIVATE|MAP_ANONYMOUS, -1, 0) = 0x7f094575f000
write(4, "\254%\0\0\364$\0\0\1\0\2\0\0\0\0\0\2\0\6\3\0\0\0\0\0\0\1\0\364\1\0\0"..., 1021) = 1021
select(4, [3], NULL, NULL, {0, 950000}) = 1 (in [3], left {0, 927300})
read(3, "\0\0\0\0\0\0\0\0\0\0\0\0\0\0\0\0\0\0\0\0\0\0\0\0\0\0\0\0\0\0\0\0"..., 8192) = 1380
write(4, "\0\0\0\0\0\0\0\0\0\0\0\0\0\0\0\0\0\0\0\0\0\0\0\0\0\0\0\0\0\0\0\0"..., 1380) = 1380
select(4, [3], NULL, NULL, {0, 950000}) = 1 (in [3], left {0, 949995})
read(3, "\4\0\0\377\357\2\0\1\300\0\v\0\27\0.\0:\0\0%!\"&463!2\26\24\6'"..., 7243) = 1380
write(4, "\4\0\0\377\357\2\0\1\300\0\v\0\27\0.\0:\0\0%!\"&463!2\26\24\6'"..., 1380) = 1380
