nanosleep({1, 0}, 0x7fffc9612630)       = 0
stat("/etc/localtime", {st_mode=S_IFREG|0644, st_size=3519, ...}) = 0
write(2, "--2014-06-30 12:10:36--  http://"..., 41) = 41
getpeername(3, {sa_family=AF_INET, sin_port=htons(80), sin_addr=inet_addr("152.19.230.139")}, [16]) = 0
write(2, "Resolving unc.edu (unc.edu)... ", 31) = 31
stat("/etc/resolv.conf", {st_mode=S_IFREG|0644, st_size=187, ...}) = 0
open("/etc/hosts", O_RDONLY|O_CLOEXEC)  = 4
fstat(4, {st_mode=S_IFREG|0644, st_size=219, ...}) = 0
mmap(NULL, 4096, PROT_READ|PROT_WRITE, MAP_PRIVATE|MAP_ANONYMOUS, -1, 0) = 0x7ff2d5a74000
read(4, "127.0.0.1\tlocalhost\n127.0.1.1\tdo"..., 4096) = 219
read(4, "", 4096)                       = 0
close(4)                                = 0
munmap(0x7ff2d5a74000, 4096)            = 0
stat("/etc/resolv.conf", {st_mode=S_IFREG|0644, st_size=187, ...}) = 0
socket(PF_INET, SOCK_DGRAM|SOCK_NONBLOCK, IPPROTO_IP) = 4
connect(4, {sa_family=AF_INET, sin_port=htons(53), sin_addr=inet_addr("127.0.1.1")}, 16) = 0
poll([{fd=4, events=POLLOUT}], 1, 0)    = 1 ([{fd=4, revents=POLLOUT}])
sendmmsg(4, {{{msg_name(0)=NULL, msg_iov(1)=[{"C\371\1\0\0\1\0\0\0\0\0\0\3unc\3edu\0\0\1\0\1", 25}], msg_controllen=0, msg_flags=MSG_PEEK|MSG_FASTOPEN|0x15000000}, 25}, {{msg_name(0)=NULL, msg_iov(1)=[{"Ij\1\0\0\1\0\0\0\0\0\0\3unc\3edu\0\0\34\0\1", 25}], msg_controllen=0, msg_flags=MSG_TRUNC|MSG_WAITALL|MSG_SYN|MSG_WAITFORONE|MSG_CMSG_CLOEXEC|0x89600000}, 25}}, 2, MSG_NOSIGNAL) = 2
poll([{fd=4, events=POLLIN}], 1, 5000)  = 1 ([{fd=4, revents=POLLIN}])
ioctl(4, FIONREAD, [378])               = 0
recvfrom(4, "C\371\201\200\0\1\0\1\0\5\0\n\3unc\3edu\0\0\1\0\1\300\f\0\1\0\1\0"..., 2048, 0, {sa_family=AF_INET, sin_port=htons(53), sin_addr=inet_addr("127.0.1.1")}, [16]) = 378
poll([{fd=4, events=POLLIN}], 1, 4991)  = 1 ([{fd=4, revents=POLLIN}])
ioctl(4, FIONREAD, [390])               = 0
recvfrom(4, "Ij\201\200\0\1\0\1\0\5\0\n\3unc\3edu\0\0\34\0\1\300\f\0\34\0\1\0"..., 1670, 0, {sa_family=AF_INET, sin_port=htons(53), sin_addr=inet_addr("127.0.1.1")}, [16]) = 390
close(4)                                = 0
socket(PF_NETLINK, SOCK_RAW, 0)         = 4
bind(4, {sa_family=AF_NETLINK, pid=0, groups=00000000}, 12) = 0
getsockname(4, {sa_family=AF_NETLINK, pid=9269, groups=00000000}, [12]) = 0
sendto(4, "\24\0\0\0\26\0\1\3\374\213\261S\0\0\0\0\0\0\0\0", 20, 0, {sa_family=AF_NETLINK, pid=0, groups=00000000}, 12) = 20
recvmsg(4, {msg_name(12)={sa_family=AF_NETLINK, pid=0, groups=00000000}, msg_iov(1)=[{"D\0\0\0\24\0\2\0\374\213\261S5$\0\0\2\10\200\376\1\0\0\0\10\0\1\0\177\0\0\1"..., 4096}], msg_controllen=0, msg_flags=0}, 0) = 308
recvmsg(4, {msg_name(12)={sa_family=AF_NETLINK, pid=0, groups=00000000}, msg_iov(1)=[{"@\0\0\0\24\0\2\0\374\213\261S5$\0\0\n\200\200\376\1\0\0\0\24\0\1\0\0\0\0\0"..., 4096}], msg_controllen=0, msg_flags=0}, 0) = 256
recvmsg(4, {msg_name(12)={sa_family=AF_NETLINK, pid=0, groups=00000000}, msg_iov(1)=[{"\24\0\0\0\3\0\2\0\374\213\261S5$\0\0\0\0\0\0", 4096}], msg_controllen=0, msg_flags=0}, 0) = 20
close(4)                                = 0
socket(PF_INET, SOCK_DGRAM, IPPROTO_IP) = 4
connect(4, {sa_family=AF_INET, sin_port=htons(0), sin_addr=inet_addr("152.19.230.139")}, 16) = 0
getsockname(4, {sa_family=AF_INET, sin_port=htons(59620), sin_addr=inet_addr("10.203.96.17")}, [16]) = 0
close(4)                                = 0
socket(PF_INET6, SOCK_DGRAM, IPPROTO_IP) = 4
connect(4, {sa_family=AF_INET6, sin6_port=htons(0), inet_pton(AF_INET6, "2610:28:3090:3010::13", &sin6_addr), sin6_flowinfo=0, sin6_scope_id=0}, 28) = -1 ENETUNREACH (Network is unreachable)
close(4)                                = 0
write(2, "152.19.230.139", 14)          = 14
write(2, ", ", 2)                       = 2
write(2, "2610:28:3090:3010::13", 21)   = 21
write(2, "\n", 1)                       = 1
select(4, [3], NULL, NULL, {0, 1})      = 0 (Timeout)
getpeername(3, {sa_family=AF_INET, sin_port=htons(80), sin_addr=inet_addr("152.19.230.139")}, [16]) = 0
write(2, "Reusing existing connection to w"..., 47) = 47
select(4, NULL, [3], NULL, {900, 0})    = 1 (out [3], left {899, 999998})
write(3, "GET / HTTP/1.1\r\nUser-Agent: Mozi"..., 91) = 91
write(2, "HTTP request sent, awaiting resp"..., 40) = 40
select(4, [3], NULL, NULL, {900, 0})    = 1 (in [3], left {899, 992138})
recvfrom(3, "HTTP/1.1 200 OK\r\nX-Pingback: htt"..., 511, MSG_PEEK, NULL, NULL) = 266
read(3, "HTTP/1.1 200 OK\r\nX-Pingback: htt"..., 266) = 266
write(2, "200 OK\n", 7)                 = 7
stat("/home/bearface/website_output/www.unc.edu/index.html", 0x7fffc9612050) = -1 ENOENT (No such file or directory)
write(2, "Length: ", 8)                 = 8
write(2, "38637", 5)                    = 5
write(2, " (38K)", 6)                   = 6
write(2, " [text/html]\n", 13)          = 13
stat("/home/bearface/website_output/www.unc.edu", 0x7fffc9612040) = -1 ENOENT (No such file or directory)
stat("/home", {st_mode=S_IFDIR|0755, st_size=4096, ...}) = 0
stat("/home/bearface", {st_mode=S_IFDIR|0755, st_size=4096, ...}) = 0
stat("/home/bearface/website_output", {st_mode=S_IFDIR|0755, st_size=4096, ...}) = 0
stat("/home/bearface/website_output/www.unc.edu", 0x7fffc9611f60) = -1 ENOENT (No such file or directory)
mkdir("/home/bearface/website_output/www.unc.edu", 0777) = 0
open("/home/bearface/website_output/www.unc.edu/index.html", O_WRONLY|O_CREAT|O_TRUNC, 0666) = 4
open("/usr/lib/charset.alias", O_RDONLY|O_NOFOLLOW) = -1 ENOENT (No such file or directory)
write(2, "Saving to: \342\200\230/home/bearface/web"..., 70) = 70
ioctl(2, TIOCGWINSZ, {ws_row=24, ws_col=80, ws_xpixel=0, ws_ypixel=0}) = 0
write(2, "\n", 1)                       = 1
open("/usr/lib/x86_64-linux-gnu/gconv/gconv-modules.cache", O_RDONLY) = 5
fstat(5, {st_mode=S_IFREG|0644, st_size=26258, ...}) = 0
mmap(NULL, 26258, PROT_READ, MAP_SHARED, 5, 0) = 0x7ff2d5a6e000
close(5)                                = 0
write(2, "\r", 1)                       = 1
