select(4, NULL, [3], NULL, {900, 0})    = 1 (out [3], left {899, 999993})
write(3, "GET /img/fancybox_loading@2x.gif"..., 180) = 180
write(2, "HTTP request sent, awaiting resp"..., 40) = 40
select(4, [3], NULL, NULL, {900, 0})    = 1 (in [3], left {899, 929249})
recvfrom(3, "HTTP/1.1 200 OK\r\nContent-Type: i"..., 511, MSG_PEEK, NULL, NULL) = 511
read(3, "HTTP/1.1 200 OK\r\nContent-Type: i"..., 409) = 409
write(2, "200 OK\n", 7)                 = 7
stat("/home/bearface/website_output/www.ucla.edu/img/fancybox_loading@2x.gif", 0x7fff13a30190) = -1 ENOENT (No such file or directory)
write(2, "Length: ", 8)                 = 8
write(2, "13984", 5)                    = 5
write(2, " (14K)", 6)                   = 6
write(2, " [image/gif]\n", 13)          = 13
stat("/home/bearface/website_output/www.ucla.edu/img", {st_mode=S_IFDIR|0755, st_size=4096, ...}) = 0
open("/home/bearface/website_output/www.ucla.edu/img/fancybox_loading@2x.gif", O_WRONLY|O_CREAT|O_TRUNC, 0666) = 4
write(2, "Saving to: \342\200\230/home/bearface/web"..., 88) = 88
write(2, "\n", 1)                       = 1
write(2, "\r", 1)                       = 1
write(2, " 0% [                           "..., 79) = 79
select(4, [3], NULL, NULL, {0, 950000}) = 1 (in [3], left {0, 949996})
read(3, "GIF89a0\0000\0\245\0\0\4\2\4\204\202\204DBD\304\302\304$\"$dbd\244"..., 8192) = 3695
fstat(4, {st_mode=S_IFREG|0644, st_size=0, ...}) = 0
mmap(NULL, 4096, PROT_READ|PROT_WRITE, MAP_PRIVATE|MAP_ANONYMOUS, -1, 0) = 0x7f6529c37000
write(4, "GIF89a0\0000\0\245\0\0\4\2\4\204\202\204DBD\304\302\304$\"$dbd\244"..., 3695) = 3695
select(4, [3], NULL, NULL, {0, 950000}) = 1 (in [3], left {0, 878753})
read(3, "\2516\n#@\214&k\245\220p\342h\240\355\23\300\213\305\"\264\242i\\M\25\1\256N\247DQ"..., 8192) = 2736
write(4, "\2516\n#@\214&k\245\220p\342h\240\355\23\300\213\305\"\264\242i\\M\25\1\256N\247DQ"..., 2736) = 2736
select(4, [3], NULL, NULL, {0, 950000}) = 1 (in [3], left {0, 947407})
read(3, "'\320\253G\257\177=\7\33\340\325P\237\200\361\361d\v\0006\360\307\336~\374\215`\206\10\20\212'"..., 7553) = 5472
write(4, "'\320\253G\257\177=\7\33\340\325P\237\200\361\361d\v\0006\360\307\336~\374\215`\206\10\20\212'"..., 4096) = 4096
write(4, "\234\\^\\\334\336\334<><\274\276\274|~|\374\376\374\0\0\0\0\0\0\0\0\0\0\0\0\0"..., 1376) = 1376
select(4, [3], NULL, NULL, {0, 950000}) = 1 (in [3], left {0, 886686})
read(3, "\374\354\356\354\0\0\0\6\376\300\237pH,\32\177\10\2\341\0048:\237P'\304F\"\220N\321,"..., 2081) = 1368
write(4, "\374\354\356\354\0\0\0\6\376\300\237pH,\32\177\10\2\341\0048:\237P'\304F\"\220N\321,"..., 1368) = 1368
select(4, [3], NULL, NULL, {0, 950000}) = 1 (in [3], left {0, 948730})
read(3, "| [E\242\206\213!\0\20\344\342H\300^\7\205(\27\214H@B\10\t\r\177p\340X\341C"..., 713) = 713
write(4, "| [E\242\206\213!\0\20\344\342H\300^\7\205(\27\214H@B\10\t\r\177p\340X\341C"..., 713) = 713
write(2, "\r", 1)                       = 1
write(2, "100%[==========================="..., 79) = 79
write(2, "\n\n", 2)                     = 2
close(4)                                = 0
munmap(0x7f6529c37000, 4096)            = 0
stat("/etc/localtime", {st_mode=S_IFREG|0644, st_size=3519, ...}) = 0
utime("/home/bearface/website_output/www.ucla.edu/img/fancybox_loading@2x.gif", [2014/06/30-12:17:29, 2014/04/18-17:41:53]) = 0
write(2, "2014-06-30 12:17:29 (95.8 KB/s) "..., 132) = 132
statfs("/home/bearface/website_output/www.ucla.edu/img/mobile", 0x7fff13a30610) = -1 ENOENT (No such file or directory)
statfs("/home/bearface/website_output/www.ucla.edu/img", {f_type="EXT2_SUPER_MAGIC", f_bsize=4096, f_blocks=59275954, f_bfree=49141272, f_bavail=46124466, f_files=15065088, f_ffree=14788417, f_fsid={533008265, 2108930253}, f_namelen=255, f_frsize=4096}) = 0
stat("/home/bearface/website_output/www.ucla.edu/img/mobile/sprites-mobile.png", 0x7fff13a30660) = -1 ENOENT (No such file or directory)
stat("/home/bearface/website_output/www.ucla.edu/img/mobile/sprites-mobile.png", 0x7fff13a306f0) = -1 ENOENT (No such file or directory)
statfs("/home/bearface/website_output/www.ucla.edu/img/mobile", 0x7fff13a30610) = -1 ENOENT (No such file or directory)
statfs("/home/bearface/website_output/www.ucla.edu/img", {f_type="EXT2_SUPER_MAGIC", f_bsize=4096, f_blocks=59275954, f_bfree=49141272, f_bavail=46124466, f_files=15065088, f_ffree=14788417, f_fsid={533008265, 2108930253}, f_namelen=255, f_frsize=4096}) = 0
stat("/home/bearface/website_output/www.ucla.edu/img/mobile/sprites-mobile.png", 0x7fff13a30660) = -1 ENOENT (No such file or directory)
nanosleep({1, 0}, 0x7fff13a30770)       = 0
stat("/etc/localtime", {st_mode=S_IFREG|0644, st_size=3519, ...}) = 0
write(2, "--2014-06-30 12:17:30--  http://"..., 75) = 75
select(4, [3], NULL, NULL, {0, 1})      = 0 (Timeout)
getpeername(3, {sa_family=AF_INET, sin_port=htons(80), sin_addr=inet_addr("164.67.228.152")}, [16]) = 0
write(2, "Reusing existing connection to w"..., 48) = 48
select(4, NULL, [3], NULL, {900, 0})    = 1 (out [3], left {899, 999994})
write(3, "GET /img/mobile/sprites-mobile.p"..., 182) = 182
write(2, "HTTP request sent, awaiting resp"..., 40) = 40
select(4, [3], NULL, NULL, {900, 0})    = 1 (in [3], left {899, 930189})
recvfrom(3, "HTTP/1.1 200 OK\r\nContent-Type: i"..., 511, MSG_PEEK, NULL, NULL) = 511
read(3, "HTTP/1.1 200 OK\r\nContent-Type: i"..., 409) = 409
write(2, "200 OK\n", 7)                 = 7
stat("/home/bearface/website_output/www.ucla.edu/img/mobile/sprites-mobile.png", 0x7fff13a30190) = -1 ENOENT (No such file or directory)
write(2, "Length: ", 8)                 = 8
write(2, "52027", 5)                    = 5
write(2, " (51K)", 6)                   = 6
write(2, " [image/png]\n", 13)          = 13
stat("/home/bearface/website_output/www.ucla.edu/img/mobile", 0x7fff13a30180) = -1 ENOENT (No such file or directory)
stat("/home", {st_mode=S_IFDIR|0755, st_size=4096, ...}) = 0
stat("/home/bearface", {st_mode=S_IFDIR|0755, st_size=4096, ...}) = 0
stat("/home/bearface/website_output", {st_mode=S_IFDIR|0755, st_size=4096, ...}) = 0
stat("/home/bearface/website_output/www.ucla.edu", {st_mode=S_IFDIR|0755, st_size=4096, ...}) = 0
stat("/home/bearface/website_output/www.ucla.edu/img", {st_mode=S_IFDIR|0755, st_size=4096, ...}) = 0
