write(3, "ONv\273\221\244\346\346s\\N\374\27\312\263\344VV\311$\27>$j\200\244B\332\343/\262\254"..., 1347) = 1347
select(5, [4], NULL, NULL, {0, 950000}) = 1 (in [4], left {0, 949997})
rt_sigaction(SIGALRM, {0x42c180, [ALRM], SA_RESTORER|SA_RESTART, 0x7f094452eff0}, {SIG_DFL, [ALRM], SA_RESTORER|SA_RESTART, 0x7f094452eff0}, 8) = 0
rt_sigprocmask(SIG_BLOCK, NULL, [], 8)  = 0
setitimer(ITIMER_REAL, {it_interval={0, 0}, it_value={900, 0}}, NULL) = 0
read(4, "\27\3\1\5S", 5)                = 5
read(4, "v\370^\301v4*\v\260@p/\35096\3169\262x\210\314\216\261\260\354\263E\317\202Gi\346"..., 1363) = 1363
setitimer(ITIMER_REAL, {it_interval={0, 0}, it_value={0, 0}}, NULL) = 0
rt_sigaction(SIGALRM, {SIG_DFL, [ALRM], SA_RESTORER|SA_RESTART, 0x7f094452eff0}, {0x42c180, [ALRM], SA_RESTORER|SA_RESTART, 0x7f094452eff0}, 8) = 0
write(3, "\32\310\306(F\303#\302\215\30d5\315C;\357\275\f\355\300\35\246\227\343\32\301:\276\16Wq_"..., 1347) = 1347
select(5, [4], NULL, NULL, {0, 950000}) = 1 (in [4], left {0, 949997})
rt_sigaction(SIGALRM, {0x42c180, [ALRM], SA_RESTORER|SA_RESTART, 0x7f094452eff0}, {SIG_DFL, [ALRM], SA_RESTORER|SA_RESTART, 0x7f094452eff0}, 8) = 0
rt_sigprocmask(SIG_BLOCK, NULL, [], 8)  = 0
setitimer(ITIMER_REAL, {it_interval={0, 0}, it_value={900, 0}}, NULL) = 0
read(4, "\27\3\1\5S", 5)                = 5
read(4, "3\t\224\267L\375\30\334\353\260\260\307I\16%\314~\243i\0\255\354\261{\312\244P\t0E|/"..., 1363) = 1363
setitimer(ITIMER_REAL, {it_interval={0, 0}, it_value={0, 0}}, NULL) = 0
rt_sigaction(SIGALRM, {SIG_DFL, [ALRM], SA_RESTORER|SA_RESTART, 0x7f094452eff0}, {0x42c180, [ALRM], SA_RESTORER|SA_RESTART, 0x7f094452eff0}, 8) = 0
write(3, "\271HF\271\243\231\315\320g#\370Rr)\260$i>\226W\206\316\265\326\325\367\332\216\263\241\216c"..., 1347) = 1347
select(5, [4], NULL, NULL, {0, 950000}) = 1 (in [4], left {0, 949900})
rt_sigaction(SIGALRM, {0x42c180, [ALRM], SA_RESTORER|SA_RESTART, 0x7f094452eff0}, {SIG_DFL, [ALRM], SA_RESTORER|SA_RESTART, 0x7f094452eff0}, 8) = 0
rt_sigprocmask(SIG_BLOCK, NULL, [], 8)  = 0
setitimer(ITIMER_REAL, {it_interval={0, 0}, it_value={900, 0}}, NULL) = 0
read(4, "\27\3\1\5S", 5)                = 5
read(4, "\300\"\233AS\211\352p\205f\317\262\233p+x\366\367\35 E\16U&\315\20\346\271\232*S!"..., 1363) = 1363
setitimer(ITIMER_REAL, {it_interval={0, 0}, it_value={0, 0}}, NULL) = 0
rt_sigaction(SIGALRM, {SIG_DFL, [ALRM], SA_RESTORER|SA_RESTART, 0x7f094452eff0}, {0x42c180, [ALRM], SA_RESTORER|SA_RESTART, 0x7f094452eff0}, 8) = 0
write(3, "\10eI\302\"D\204\2624~T@I!g\21\240\7\223\272\354\223O\324Cc\351\357\f\362\371\216"..., 1347) = 1347
select(5, [4], NULL, NULL, {0, 950000}) = 1 (in [4], left {0, 949997})
rt_sigaction(SIGALRM, {0x42c180, [ALRM], SA_RESTORER|SA_RESTART, 0x7f094452eff0}, {SIG_DFL, [ALRM], SA_RESTORER|SA_RESTART, 0x7f094452eff0}, 8) = 0
rt_sigprocmask(SIG_BLOCK, NULL, [], 8)  = 0
setitimer(ITIMER_REAL, {it_interval={0, 0}, it_value={900, 0}}, NULL) = 0
read(4, "\27\3\1\5S", 5)                = 5
read(4, "W\207!\21\345\273\"=\f\322}\330\5\10s\345\277u>\261|\313\224\365\6\352\272\364\305b4\300"..., 1363) = 1363
setitimer(ITIMER_REAL, {it_interval={0, 0}, it_value={0, 0}}, NULL) = 0
rt_sigaction(SIGALRM, {SIG_DFL, [ALRM], SA_RESTORER|SA_RESTART, 0x7f094452eff0}, {0x42c180, [ALRM], SA_RESTORER|SA_RESTART, 0x7f094452eff0}, 8) = 0
write(3, "%\200\17745\224;\1\215\263\203\323\231\326c\271\30\307\205\377\0K~\217a?\366WD\221\3449"..., 1347) = 1347
select(5, [4], NULL, NULL, {0, 950000}) = 1 (in [4], left {0, 949998})
rt_sigaction(SIGALRM, {0x42c180, [ALRM], SA_RESTORER|SA_RESTART, 0x7f094452eff0}, {SIG_DFL, [ALRM], SA_RESTORER|SA_RESTART, 0x7f094452eff0}, 8) = 0
rt_sigprocmask(SIG_BLOCK, NULL, [], 8)  = 0
setitimer(ITIMER_REAL, {it_interval={0, 0}, it_value={900, 0}}, NULL) = 0
read(4, "\27\3\1\5S", 5)                = 5
read(4, "\261\326zc\221)&\254\205B\300\376\377e@\256\277\24\227\3752\t\275<\314\374\305\27,\vV<"..., 1363) = 1363
setitimer(ITIMER_REAL, {it_interval={0, 0}, it_value={0, 0}}, NULL) = 0
rt_sigaction(SIGALRM, {SIG_DFL, [ALRM], SA_RESTORER|SA_RESTART, 0x7f094452eff0}, {0x42c180, [ALRM], SA_RESTORER|SA_RESTART, 0x7f094452eff0}, 8) = 0
write(3, "\233u\272\242$|\37\27\234\3619\262\354C\222\305\231\325r\204\246\4L;\0378\25\265\340{\31\25"..., 1347) = 1347
select(5, [4], NULL, NULL, {0, 950000}) = 1 (in [4], left {0, 949998})
rt_sigaction(SIGALRM, {0x42c180, [ALRM], SA_RESTORER|SA_RESTART, 0x7f094452eff0}, {SIG_DFL, [ALRM], SA_RESTORER|SA_RESTART, 0x7f094452eff0}, 8) = 0
rt_sigprocmask(SIG_BLOCK, NULL, [], 8)  = 0
setitimer(ITIMER_REAL, {it_interval={0, 0}, it_value={900, 0}}, NULL) = 0
read(4, "\27\3\1\5S", 5)                = 5
read(4, "\346\276)\372\4Z\343~\274;\17\217KVdC\327\"\222\243\343\223\314\244\263)M\236\325-\221\346"..., 1363) = 1363
setitimer(ITIMER_REAL, {it_interval={0, 0}, it_value={0, 0}}, NULL) = 0
rt_sigaction(SIGALRM, {SIG_DFL, [ALRM], SA_RESTORER|SA_RESTART, 0x7f094452eff0}, {0x42c180, [ALRM], SA_RESTORER|SA_RESTART, 0x7f094452eff0}, 8) = 0
write(3, "\321\277F\256\271\236=Y\321X\304\3309\345@\215\221li\263\253\235\253\264V\355\344\204\344\202\10'"..., 1347) = 1347
select(5, [4], NULL, NULL, {0, 950000}) = 1 (in [4], left {0, 949997})
rt_sigaction(SIGALRM, {0x42c180, [ALRM], SA_RESTORER|SA_RESTART, 0x7f094452eff0}, {SIG_DFL, [ALRM], SA_RESTORER|SA_RESTART, 0x7f094452eff0}, 8) = 0
rt_sigprocmask(SIG_BLOCK, NULL, [], 8)  = 0
setitimer(ITIMER_REAL, {it_interval={0, 0}, it_value={900, 0}}, NULL) = 0
read(4, "\27\3\1\5S", 5)                = 5
read(4, "\v\330rk\230\271\343j\23\370P\30\336y\10|\231\0016\302\26\267\33\201\243\27\234\366\22OFi"..., 1363) = 1363
setitimer(ITIMER_REAL, {it_interval={0, 0}, it_value={0, 0}}, NULL) = 0
rt_sigaction(SIGALRM, {SIG_DFL, [ALRM], SA_RESTORER|SA_RESTART, 0x7f094452eff0}, {0x42c180, [ALRM], SA_RESTORER|SA_RESTART, 0x7f094452eff0}, 8) = 0
write(3, "\217R\326\36\242\30oVV#F\324x\275\314H\365pMsU\333\212V\263\30\207M\325E\2556"..., 1347) = 1347
select(5, [4], NULL, NULL, {0, 950000}) = 1 (in [4], left {0, 949997})
rt_sigaction(SIGALRM, {0x42c180, [ALRM], SA_RESTORER|SA_RESTART, 0x7f094452eff0}, {SIG_DFL, [ALRM], SA_RESTORER|SA_RESTART, 0x7f094452eff0}, 8) = 0
rt_sigprocmask(SIG_BLOCK, NULL, [], 8)  = 0
setitimer(ITIMER_REAL, {it_interval={0, 0}, it_value={900, 0}}, NULL) = 0
read(4, "\27\3\1\5S", 5)                = 5
read(4, "cq\17\n\222\211-O\276\347\347t\373{\206\330@\33\350\266<\201\305R\6\260^\32G\322\364\244"..., 1363) = 1363
setitimer(ITIMER_REAL, {it_interval={0, 0}, it_value={0, 0}}, NULL) = 0
rt_sigaction(SIGALRM, {SIG_DFL, [ALRM], SA_RESTORER|SA_RESTART, 0x7f094452eff0}, {0x42c180, [ALRM], SA_RESTORER|SA_RESTART, 0x7f094452eff0}, 8) = 0
write(3, "\17\26N\256\353\254\30P(\365\31\230\t2\371\17\3052W\276\216Eq$\205\231xNa\302\212\352"..., 1347) = 1347
select(5, [4], NULL, NULL, {0, 950000}) = 1 (in [4], left {0, 949997})
rt_sigaction(SIGALRM, {0x42c180, [ALRM], SA_RESTORER|SA_RESTART, 0x7f094452eff0}, {SIG_DFL, [ALRM], SA_RESTORER|SA_RESTART, 0x7f094452eff0}, 8) = 0
