rt_sigaction(SIGALRM, {0x42c180, [ALRM], SA_RESTORER|SA_RESTART, 0x7f094452eff0}, {SIG_DFL, [ALRM], SA_RESTORER|SA_RESTART, 0x7f094452eff0}, 8) = 0
rt_sigprocmask(SIG_BLOCK, NULL, [], 8)  = 0
setitimer(ITIMER_REAL, {it_interval={0, 0}, it_value={900, 0}}, NULL) = 0
read(4, "\27\3\1\5S", 5)                = 5
read(4, "+?\16ti\214\264\334\200f\r\307m\34h\341\t\3106\233\242a\245\325\3733r\304\274J:a"..., 1363) = 1363
setitimer(ITIMER_REAL, {it_interval={0, 0}, it_value={0, 0}}, NULL) = 0
rt_sigaction(SIGALRM, {SIG_DFL, [ALRM], SA_RESTORER|SA_RESTART, 0x7f094452eff0}, {0x42c180, [ALRM], SA_RESTORER|SA_RESTART, 0x7f094452eff0}, 8) = 0
write(3, "t\362\217\237Lllz5\17\203\372Sp\305F\321+\325\210v\242\240.KQ\211\321\251`\t\26"..., 1347) = 1347
select(5, [4], NULL, NULL, {0, 950000}) = 1 (in [4], left {0, 949997})
rt_sigaction(SIGALRM, {0x42c180, [ALRM], SA_RESTORER|SA_RESTART, 0x7f094452eff0}, {SIG_DFL, [ALRM], SA_RESTORER|SA_RESTART, 0x7f094452eff0}, 8) = 0
rt_sigprocmask(SIG_BLOCK, NULL, [], 8)  = 0
setitimer(ITIMER_REAL, {it_interval={0, 0}, it_value={900, 0}}, NULL) = 0
read(4, "\27\3\1\5S", 5)                = 5
read(4, "o>8\22\334\246\371Z\366\2\30 \0177\326@\25\322\33$\257\310\332jq/\6\262\251\336,\212"..., 1363) = 1363
setitimer(ITIMER_REAL, {it_interval={0, 0}, it_value={0, 0}}, NULL) = 0
rt_sigaction(SIGALRM, {SIG_DFL, [ALRM], SA_RESTORER|SA_RESTART, 0x7f094452eff0}, {0x42c180, [ALRM], SA_RESTORER|SA_RESTART, 0x7f094452eff0}, 8) = 0
write(3, "\253\6~\252jh\204\220\233F+\362\314Iff\227\32\30\331\211515\232E\334cT\326\10\304"..., 1347) = 1347
select(5, [4], NULL, NULL, {0, 950000}) = 1 (in [4], left {0, 949821})
rt_sigaction(SIGALRM, {0x42c180, [ALRM], SA_RESTORER|SA_RESTART, 0x7f094452eff0}, {SIG_DFL, [ALRM], SA_RESTORER|SA_RESTART, 0x7f094452eff0}, 8) = 0
rt_sigprocmask(SIG_BLOCK, NULL, [], 8)  = 0
setitimer(ITIMER_REAL, {it_interval={0, 0}, it_value={900, 0}}, NULL) = 0
read(4, "\27\3\1\5S", 5)                = 5
read(4, "6\10\225\0172\224XM\1G\344\345\21\21HSK\375\346\371}n\304\265\333J<\23\352\337J\327"..., 1363) = 1363
setitimer(ITIMER_REAL, {it_interval={0, 0}, it_value={0, 0}}, NULL) = 0
rt_sigaction(SIGALRM, {SIG_DFL, [ALRM], SA_RESTORER|SA_RESTART, 0x7f094452eff0}, {0x42c180, [ALRM], SA_RESTORER|SA_RESTART, 0x7f094452eff0}, 8) = 0
write(3, "\213\342\206\357\21\4Q\251\301\314\365=\273d]5\23\341J\237\314\376;G\33\376\352\347\361\335\344\217"..., 1347) = 1347
select(5, [4], NULL, NULL, {0, 950000}) = 1 (in [4], left {0, 949997})
rt_sigaction(SIGALRM, {0x42c180, [ALRM], SA_RESTORER|SA_RESTART, 0x7f094452eff0}, {SIG_DFL, [ALRM], SA_RESTORER|SA_RESTART, 0x7f094452eff0}, 8) = 0
rt_sigprocmask(SIG_BLOCK, NULL, [], 8)  = 0
setitimer(ITIMER_REAL, {it_interval={0, 0}, it_value={900, 0}}, NULL) = 0
read(4, "\27\3\1\5S", 5)                = 5
read(4, "\360\274l`\333\177\354\347\347B/\365+\265![\223=3a\320\236\251\5\357\32\267Ldkm,"..., 1363) = 1363
setitimer(ITIMER_REAL, {it_interval={0, 0}, it_value={0, 0}}, NULL) = 0
rt_sigaction(SIGALRM, {SIG_DFL, [ALRM], SA_RESTORER|SA_RESTART, 0x7f094452eff0}, {0x42c180, [ALRM], SA_RESTORER|SA_RESTART, 0x7f094452eff0}, 8) = 0
write(3, "\314<\255\206\3455\346\361\271\354\264s\330\347\230\223\301\26\"\203\371i\374\265\355\373\305~\356F]\337"..., 1347) = 1347
select(5, [4], NULL, NULL, {0, 950000}) = 1 (in [4], left {0, 949777})
rt_sigaction(SIGALRM, {0x42c180, [ALRM], SA_RESTORER|SA_RESTART, 0x7f094452eff0}, {SIG_DFL, [ALRM], SA_RESTORER|SA_RESTART, 0x7f094452eff0}, 8) = 0
rt_sigprocmask(SIG_BLOCK, NULL, [], 8)  = 0
setitimer(ITIMER_REAL, {it_interval={0, 0}, it_value={900, 0}}, NULL) = 0
read(4, "\27\3\1\5S", 5)                = 5
read(4, "D\211\5\221\v\243\357\203\307B^8\31[\6\370lR$\177\315~\241\31\360\300\23\334\331\330\224\17"..., 1363) = 1363
setitimer(ITIMER_REAL, {it_interval={0, 0}, it_value={0, 0}}, NULL) = 0
rt_sigaction(SIGALRM, {SIG_DFL, [ALRM], SA_RESTORER|SA_RESTART, 0x7f094452eff0}, {0x42c180, [ALRM], SA_RESTORER|SA_RESTART, 0x7f094452eff0}, 8) = 0
write(3, "C\2362%Lf\314\20\23\354\310\365Lo\334i\311\1@,\7\310\3301;\26\243\364\376v\323\212"..., 1347) = 1347
select(5, [4], NULL, NULL, {0, 950000}) = 1 (in [4], left {0, 949997})
rt_sigaction(SIGALRM, {0x42c180, [ALRM], SA_RESTORER|SA_RESTART, 0x7f094452eff0}, {SIG_DFL, [ALRM], SA_RESTORER|SA_RESTART, 0x7f094452eff0}, 8) = 0
rt_sigprocmask(SIG_BLOCK, NULL, [], 8)  = 0
setitimer(ITIMER_REAL, {it_interval={0, 0}, it_value={900, 0}}, NULL) = 0
read(4, "\27\3\1\5S", 5)                = 5
read(4, "\265:\203\350}6wY\235\21\315\255jy\322\204d\n\301\35\340\270\240\177\3'Y2y\363\35\210"..., 1363) = 1363
setitimer(ITIMER_REAL, {it_interval={0, 0}, it_value={0, 0}}, NULL) = 0
rt_sigaction(SIGALRM, {SIG_DFL, [ALRM], SA_RESTORER|SA_RESTART, 0x7f094452eff0}, {0x42c180, [ALRM], SA_RESTORER|SA_RESTART, 0x7f094452eff0}, 8) = 0
write(3, "N&o\306\21\254\306SR\302\255:\25\35c \372M\234\213\257t9LZ\251\345\320\rI=\251"..., 1347) = 1347
select(5, [4], NULL, NULL, {0, 950000}) = 1 (in [4], left {0, 949997})
rt_sigaction(SIGALRM, {0x42c180, [ALRM], SA_RESTORER|SA_RESTART, 0x7f094452eff0}, {SIG_DFL, [ALRM], SA_RESTORER|SA_RESTART, 0x7f094452eff0}, 8) = 0
rt_sigprocmask(SIG_BLOCK, NULL, [], 8)  = 0
setitimer(ITIMER_REAL, {it_interval={0, 0}, it_value={900, 0}}, NULL) = 0
read(4, "\27\3\1\5S", 5)                = 5
read(4, "\341\244\210\347k\\\304\362\233G\37\2722\365\235\26\357n\235\237\275E[M\244\22\0353\21\344\3060"..., 1363) = 1363
setitimer(ITIMER_REAL, {it_interval={0, 0}, it_value={0, 0}}, NULL) = 0
rt_sigaction(SIGALRM, {SIG_DFL, [ALRM], SA_RESTORER|SA_RESTART, 0x7f094452eff0}, {0x42c180, [ALRM], SA_RESTORER|SA_RESTART, 0x7f094452eff0}, 8) = 0
write(3, "\354P\214]\234u\333+\"\2546\237^Z\265K\253\255\305\35\310\356G\267!\21\331\313\335\311\r\2"..., 1347) = 1347
select(5, [4], NULL, NULL, {0, 950000}) = 1 (in [4], left {0, 949997})
rt_sigaction(SIGALRM, {0x42c180, [ALRM], SA_RESTORER|SA_RESTART, 0x7f094452eff0}, {SIG_DFL, [ALRM], SA_RESTORER|SA_RESTART, 0x7f094452eff0}, 8) = 0
rt_sigprocmask(SIG_BLOCK, NULL, [], 8)  = 0
setitimer(ITIMER_REAL, {it_interval={0, 0}, it_value={900, 0}}, NULL) = 0
read(4, "\27\3\1\5S", 5)                = 5
read(4, "\4\vg\213\210iuZ\213\204\277!\242\232\344P\304\37\220\270++V\340J\347\344\312\306[r\363"..., 1363) = 1363
setitimer(ITIMER_REAL, {it_interval={0, 0}, it_value={0, 0}}, NULL) = 0
rt_sigaction(SIGALRM, {SIG_DFL, [ALRM], SA_RESTORER|SA_RESTART, 0x7f094452eff0}, {0x42c180, [ALRM], SA_RESTORER|SA_RESTART, 0x7f094452eff0}, 8) = 0
write(3, "\"\20\374\302xf\367\376\253\317rlG\364\332\213i #\263~@J7\311$v\243X\260\v\363"..., 1347) = 1347
select(5, [4], NULL, NULL, {0, 950000}) = 1 (in [4], left {0, 949997})
rt_sigaction(SIGALRM, {0x42c180, [ALRM], SA_RESTORER|SA_RESTART, 0x7f094452eff0}, {SIG_DFL, [ALRM], SA_RESTORER|SA_RESTART, 0x7f094452eff0}, 8) = 0
rt_sigprocmask(SIG_BLOCK, NULL, [], 8)  = 0
setitimer(ITIMER_REAL, {it_interval={0, 0}, it_value={900, 0}}, NULL) = 0
