rt_sigaction(SIGALRM, {0x42c180, [ALRM], SA_RESTORER|SA_RESTART, 0x7f094452eff0}, {SIG_DFL, [ALRM], SA_RESTORER|SA_RESTART, 0x7f094452eff0}, 8) = 0
rt_sigprocmask(SIG_BLOCK, NULL, [], 8)  = 0
setitimer(ITIMER_REAL, {it_interval={0, 0}, it_value={900, 0}}, NULL) = 0
read(4, "\27\3\1\5S", 5)                = 5
read(4, "q\26\257\317\2108\254\33\212\355\n\202N\312\377\347kiZ\346f\363y?|9\302\240\2061\275f"..., 1363) = 1363
setitimer(ITIMER_REAL, {it_interval={0, 0}, it_value={0, 0}}, NULL) = 0
rt_sigaction(SIGALRM, {SIG_DFL, [ALRM], SA_RESTORER|SA_RESTART, 0x7f094452eff0}, {0x42c180, [ALRM], SA_RESTORER|SA_RESTART, 0x7f094452eff0}, 8) = 0
write(3, "\275U\310\313U\224\r\31Y\351\22\277\223:\356\324\223\323\324\274|u\6\362EA9\201Y\33OU"..., 1347) = 1347
select(5, [4], NULL, NULL, {0, 950000}) = 1 (in [4], left {0, 949997})
rt_sigaction(SIGALRM, {0x42c180, [ALRM], SA_RESTORER|SA_RESTART, 0x7f094452eff0}, {SIG_DFL, [ALRM], SA_RESTORER|SA_RESTART, 0x7f094452eff0}, 8) = 0
rt_sigprocmask(SIG_BLOCK, NULL, [], 8)  = 0
setitimer(ITIMER_REAL, {it_interval={0, 0}, it_value={900, 0}}, NULL) = 0
read(4, "\27\3\1\5S", 5)                = 5
read(4, "\227\374\225\224\376<\223\260E\n,,|\325,\6\256\36#\306k\343k\303`\227\303\27\301u\333\207"..., 1363) = 1363
setitimer(ITIMER_REAL, {it_interval={0, 0}, it_value={0, 0}}, NULL) = 0
rt_sigaction(SIGALRM, {SIG_DFL, [ALRM], SA_RESTORER|SA_RESTART, 0x7f094452eff0}, {0x42c180, [ALRM], SA_RESTORER|SA_RESTART, 0x7f094452eff0}, 8) = 0
write(3, "\3262\352\277\241\220{;o\254<\303V\254\351\32*\251\255)t\322}U\301X[\244\262-\32\323"..., 1347) = 1347
select(5, [4], NULL, NULL, {0, 950000}) = 1 (in [4], left {0, 949998})
rt_sigaction(SIGALRM, {0x42c180, [ALRM], SA_RESTORER|SA_RESTART, 0x7f094452eff0}, {SIG_DFL, [ALRM], SA_RESTORER|SA_RESTART, 0x7f094452eff0}, 8) = 0
rt_sigprocmask(SIG_BLOCK, NULL, [], 8)  = 0
setitimer(ITIMER_REAL, {it_interval={0, 0}, it_value={900, 0}}, NULL) = 0
read(4, "\27\3\1\5S", 5)                = 5
read(4, "\373z\354\217\3310s=\344\n\314{}\207\255y[]w&\366\214\234mZ\325\275\250\35]\23\4"..., 1363) = 1363
setitimer(ITIMER_REAL, {it_interval={0, 0}, it_value={0, 0}}, NULL) = 0
rt_sigaction(SIGALRM, {SIG_DFL, [ALRM], SA_RESTORER|SA_RESTART, 0x7f094452eff0}, {0x42c180, [ALRM], SA_RESTORER|SA_RESTART, 0x7f094452eff0}, 8) = 0
write(3, "\241\201`\374\213\201ID\274$\325amk(\272\202\6Fz\211\257(J\215\254\244L\233\25^A"..., 1347) = 1347
select(5, [4], NULL, NULL, {0, 950000}) = 1 (in [4], left {0, 949998})
rt_sigaction(SIGALRM, {0x42c180, [ALRM], SA_RESTORER|SA_RESTART, 0x7f094452eff0}, {SIG_DFL, [ALRM], SA_RESTORER|SA_RESTART, 0x7f094452eff0}, 8) = 0
rt_sigprocmask(SIG_BLOCK, NULL, [], 8)  = 0
setitimer(ITIMER_REAL, {it_interval={0, 0}, it_value={900, 0}}, NULL) = 0
read(4, "\27\3\1\5S", 5)                = 5
read(4, "\332{U2\257X\342\23\211\311\315\325s\356)\265\24\331`\213<\324\336y\246x\273\247\312=\v\302"..., 1363) = 1363
setitimer(ITIMER_REAL, {it_interval={0, 0}, it_value={0, 0}}, NULL) = 0
rt_sigaction(SIGALRM, {SIG_DFL, [ALRM], SA_RESTORER|SA_RESTART, 0x7f094452eff0}, {0x42c180, [ALRM], SA_RESTORER|SA_RESTART, 0x7f094452eff0}, 8) = 0
write(3, "\313\260*\351\311\204U]@\21\310u\33\244\200=\t\24\204\374\274s\353\333S\226\6\217]\202\nt"..., 1347) = 1347
select(5, [4], NULL, NULL, {0, 950000}) = 1 (in [4], left {0, 943496})
rt_sigaction(SIGALRM, {0x42c180, [ALRM], SA_RESTORER|SA_RESTART, 0x7f094452eff0}, {SIG_DFL, [ALRM], SA_RESTORER|SA_RESTART, 0x7f094452eff0}, 8) = 0
rt_sigprocmask(SIG_BLOCK, NULL, [], 8)  = 0
setitimer(ITIMER_REAL, {it_interval={0, 0}, it_value={900, 0}}, NULL) = 0
read(4, "\27\3\1\5S", 5)                = 5
read(4, "\260\347\253G\217\320y\371\235\206\356\237\374\363\266\tUH\206\0\334[\20\240\352\10\4\374\237q\1\336"..., 1363) = 1363
setitimer(ITIMER_REAL, {it_interval={0, 0}, it_value={0, 0}}, NULL) = 0
rt_sigaction(SIGALRM, {SIG_DFL, [ALRM], SA_RESTORER|SA_RESTART, 0x7f094452eff0}, {0x42c180, [ALRM], SA_RESTORER|SA_RESTART, 0x7f094452eff0}, 8) = 0
write(3, "F\211\277P\320\314\304\357\353\333\2\301g\17\223\253\316\335\262f;\311\3138\345\323\351\27\356\214Q]"..., 1347) = 1347
select(5, [4], NULL, NULL, {0, 950000}) = 1 (in [4], left {0, 949996})
rt_sigaction(SIGALRM, {0x42c180, [ALRM], SA_RESTORER|SA_RESTART, 0x7f094452eff0}, {SIG_DFL, [ALRM], SA_RESTORER|SA_RESTART, 0x7f094452eff0}, 8) = 0
rt_sigprocmask(SIG_BLOCK, NULL, [], 8)  = 0
setitimer(ITIMER_REAL, {it_interval={0, 0}, it_value={900, 0}}, NULL) = 0
read(4, "\27\3\1\5S", 5)                = 5
read(4, "\253x\364\2737F\26\353[\204\370\204\271\t\361\357\17\200\212\7jwg\24\3\350\224\270\267<\224\316"..., 1363) = 1363
setitimer(ITIMER_REAL, {it_interval={0, 0}, it_value={0, 0}}, NULL) = 0
rt_sigaction(SIGALRM, {SIG_DFL, [ALRM], SA_RESTORER|SA_RESTART, 0x7f094452eff0}, {0x42c180, [ALRM], SA_RESTORER|SA_RESTART, 0x7f094452eff0}, 8) = 0
write(3, "0\30\307\362\373\355\343\204\361um1\244\224R\253\244\322\24fR7\314?`\324\0053\277:\177\326"..., 1347) = 1347
select(5, [4], NULL, NULL, {0, 950000}) = 1 (in [4], left {0, 949998})
rt_sigaction(SIGALRM, {0x42c180, [ALRM], SA_RESTORER|SA_RESTART, 0x7f094452eff0}, {SIG_DFL, [ALRM], SA_RESTORER|SA_RESTART, 0x7f094452eff0}, 8) = 0
rt_sigprocmask(SIG_BLOCK, NULL, [], 8)  = 0
setitimer(ITIMER_REAL, {it_interval={0, 0}, it_value={900, 0}}, NULL) = 0
read(4, "\27\3\1\5S", 5)                = 5
read(4, "A\231\326_l\311CX\272\326\346\324\306%\30\337\362\27k\341O\227\330z\342\274`;X~\270\346"..., 1363) = 1363
setitimer(ITIMER_REAL, {it_interval={0, 0}, it_value={0, 0}}, NULL) = 0
rt_sigaction(SIGALRM, {SIG_DFL, [ALRM], SA_RESTORER|SA_RESTART, 0x7f094452eff0}, {0x42c180, [ALRM], SA_RESTORER|SA_RESTART, 0x7f094452eff0}, 8) = 0
write(3, "rB\345<\317\233\266\251j\253\0315{\242,\235/@\332\371\273\225RH\242\335\214\345\301\234n\213"..., 1347) = 1347
select(5, [4], NULL, NULL, {0, 950000}) = 1 (in [4], left {0, 949998})
rt_sigaction(SIGALRM, {0x42c180, [ALRM], SA_RESTORER|SA_RESTART, 0x7f094452eff0}, {SIG_DFL, [ALRM], SA_RESTORER|SA_RESTART, 0x7f094452eff0}, 8) = 0
rt_sigprocmask(SIG_BLOCK, NULL, [], 8)  = 0
setitimer(ITIMER_REAL, {it_interval={0, 0}, it_value={900, 0}}, NULL) = 0
read(4, "\27\3\1\5S", 5)                = 5
read(4, "\6o\241 \302l\376{@\314x/\217=\326\213\233\200!\302\324\273XM\230\256\211\2*t\246\210"..., 1363) = 1363
setitimer(ITIMER_REAL, {it_interval={0, 0}, it_value={0, 0}}, NULL) = 0
rt_sigaction(SIGALRM, {SIG_DFL, [ALRM], SA_RESTORER|SA_RESTART, 0x7f094452eff0}, {0x42c180, [ALRM], SA_RESTORER|SA_RESTART, 0x7f094452eff0}, 8) = 0
write(3, "*\230\333s5%\26\332\224\267\265\375\307\225\222B9{_k\237\36Q\345\34\366\247D\316h(9"..., 1347) = 1347
select(5, [4], NULL, NULL, {0, 950000}) = 1 (in [4], left {0, 949998})
rt_sigaction(SIGALRM, {0x42c180, [ALRM], SA_RESTORER|SA_RESTART, 0x7f094452eff0}, {SIG_DFL, [ALRM], SA_RESTORER|SA_RESTART, 0x7f094452eff0}, 8) = 0
rt_sigprocmask(SIG_BLOCK, NULL, [], 8)  = 0
setitimer(ITIMER_REAL, {it_interval={0, 0}, it_value={900, 0}}, NULL) = 0
