setitimer(ITIMER_REAL, {it_interval={0, 0}, it_value={0, 0}}, NULL) = 0
rt_sigaction(SIGALRM, {SIG_DFL, [ALRM], SA_RESTORER|SA_RESTART, 0x7f094452eff0}, {0x42c180, [ALRM], SA_RESTORER|SA_RESTART, 0x7f094452eff0}, 8) = 0
write(3, "\361\334\213i#\257\35\366\331\220<\227\365\207G\r\347\316\352WU\352\354v\213$\203\345\311\263\220v"..., 1347) = 1347
select(5, [4], NULL, NULL, {0, 950000}) = 1 (in [4], left {0, 949994})
rt_sigaction(SIGALRM, {0x42c180, [ALRM], SA_RESTORER|SA_RESTART, 0x7f094452eff0}, {SIG_DFL, [ALRM], SA_RESTORER|SA_RESTART, 0x7f094452eff0}, 8) = 0
rt_sigprocmask(SIG_BLOCK, NULL, [], 8)  = 0
setitimer(ITIMER_REAL, {it_interval={0, 0}, it_value={900, 0}}, NULL) = 0
read(4, "\27\3\1\5S", 5)                = 5
read(4, "\3\322\272\231s\236\276<OA\341D\v\360\37\326\351\374&\341Z-\215\242\302\263\232\23(+\3068"..., 1363) = 1363
setitimer(ITIMER_REAL, {it_interval={0, 0}, it_value={0, 0}}, NULL) = 0
rt_sigaction(SIGALRM, {SIG_DFL, [ALRM], SA_RESTORER|SA_RESTART, 0x7f094452eff0}, {0x42c180, [ALRM], SA_RESTORER|SA_RESTART, 0x7f094452eff0}, 8) = 0
write(3, "\225Z\301\266\373\20\1\1\316\363\21\352>Rr3\375\342\343\375\317\257Z\341\251\222\376\303\267\323\211\314"..., 1347) = 1347
select(5, [4], NULL, NULL, {0, 950000}) = 1 (in [4], left {0, 949996})
rt_sigaction(SIGALRM, {0x42c180, [ALRM], SA_RESTORER|SA_RESTART, 0x7f094452eff0}, {SIG_DFL, [ALRM], SA_RESTORER|SA_RESTART, 0x7f094452eff0}, 8) = 0
rt_sigprocmask(SIG_BLOCK, NULL, [], 8)  = 0
setitimer(ITIMER_REAL, {it_interval={0, 0}, it_value={900, 0}}, NULL) = 0
read(4, "\27\3\1\5S", 5)                = 5
read(4, "m\322\26Y\356\335`\302t\235 \r\264\365\343U<\273\1\345\360\3642\275W|~\327G\333\341Z"..., 1363) = 1363
setitimer(ITIMER_REAL, {it_interval={0, 0}, it_value={0, 0}}, NULL) = 0
rt_sigaction(SIGALRM, {SIG_DFL, [ALRM], SA_RESTORER|SA_RESTART, 0x7f094452eff0}, {0x42c180, [ALRM], SA_RESTORER|SA_RESTART, 0x7f094452eff0}, 8) = 0
write(3, "\264U\26\323\353\370\305\17'q\3115^\234\217a\327`q\276=\370\20\226\204\267\304\234B\317\264\224"..., 1347) = 1347
select(5, [4], NULL, NULL, {0, 950000}) = 1 (in [4], left {0, 949996})
rt_sigaction(SIGALRM, {0x42c180, [ALRM], SA_RESTORER|SA_RESTART, 0x7f094452eff0}, {SIG_DFL, [ALRM], SA_RESTORER|SA_RESTART, 0x7f094452eff0}, 8) = 0
rt_sigprocmask(SIG_BLOCK, NULL, [], 8)  = 0
setitimer(ITIMER_REAL, {it_interval={0, 0}, it_value={900, 0}}, NULL) = 0
read(4, "\27\3\1\5S", 5)                = 5
read(4, "\314\17%\367o^m=\262\3#\363\350p\2\3031\310\363*\f5\220\24N%\232A\261N<n"..., 1363) = 1363
setitimer(ITIMER_REAL, {it_interval={0, 0}, it_value={0, 0}}, NULL) = 0
rt_sigaction(SIGALRM, {SIG_DFL, [ALRM], SA_RESTORER|SA_RESTART, 0x7f094452eff0}, {0x42c180, [ALRM], SA_RESTORER|SA_RESTART, 0x7f094452eff0}, 8) = 0
write(3, "\363\372t\354\10d\343\\\317\177\353u\302&>\277t\342\366\374\270\307\276\373t\352\27y\20\221\334\334"..., 1347) = 1347
select(5, [4], NULL, NULL, {0, 950000}) = 1 (in [4], left {0, 949066})
rt_sigaction(SIGALRM, {0x42c180, [ALRM], SA_RESTORER|SA_RESTART, 0x7f094452eff0}, {SIG_DFL, [ALRM], SA_RESTORER|SA_RESTART, 0x7f094452eff0}, 8) = 0
rt_sigprocmask(SIG_BLOCK, NULL, [], 8)  = 0
setitimer(ITIMER_REAL, {it_interval={0, 0}, it_value={900, 0}}, NULL) = 0
read(4, "\27\3\1\5S", 5)                = 5
read(4, "`.\345\21\236Q\25\272\341\355\345]\245\312\253\3526\202\333\333\327\304s\235W\200\317Y|`\315\312"..., 1363) = 1363
setitimer(ITIMER_REAL, {it_interval={0, 0}, it_value={0, 0}}, NULL) = 0
rt_sigaction(SIGALRM, {SIG_DFL, [ALRM], SA_RESTORER|SA_RESTART, 0x7f094452eff0}, {0x42c180, [ALRM], SA_RESTORER|SA_RESTART, 0x7f094452eff0}, 8) = 0
write(3, "zW\241\7\234c\361>\3358\263\3143\0308>\4!\6#\21%\276\3033\37y;\372\246?\211"..., 1347) = 1347
select(5, [4], NULL, NULL, {0, 950000}) = 1 (in [4], left {0, 949998})
rt_sigaction(SIGALRM, {0x42c180, [ALRM], SA_RESTORER|SA_RESTART, 0x7f094452eff0}, {SIG_DFL, [ALRM], SA_RESTORER|SA_RESTART, 0x7f094452eff0}, 8) = 0
rt_sigprocmask(SIG_BLOCK, NULL, [], 8)  = 0
setitimer(ITIMER_REAL, {it_interval={0, 0}, it_value={900, 0}}, NULL) = 0
read(4, "\27\3\1\5S", 5)                = 5
read(4, "}*=\373\362\322m\336B\232\211\220\201%\362\201\30\26\\\240\260\36\272]\201\212\241\203\250<9\313"..., 1363) = 1363
setitimer(ITIMER_REAL, {it_interval={0, 0}, it_value={0, 0}}, NULL) = 0
rt_sigaction(SIGALRM, {SIG_DFL, [ALRM], SA_RESTORER|SA_RESTART, 0x7f094452eff0}, {0x42c180, [ALRM], SA_RESTORER|SA_RESTART, 0x7f094452eff0}, 8) = 0
write(3, "\4/L\31\f\224\2\240T\301)\20\30\223\362\347\221\20\210\217%\355\303\351\324\203\240 \335OZI"..., 1347) = 1347
select(5, [4], NULL, NULL, {0, 950000}) = 1 (in [4], left {0, 949998})
rt_sigaction(SIGALRM, {0x42c180, [ALRM], SA_RESTORER|SA_RESTART, 0x7f094452eff0}, {SIG_DFL, [ALRM], SA_RESTORER|SA_RESTART, 0x7f094452eff0}, 8) = 0
rt_sigprocmask(SIG_BLOCK, NULL, [], 8)  = 0
setitimer(ITIMER_REAL, {it_interval={0, 0}, it_value={900, 0}}, NULL) = 0
read(4, "\27\3\1\5S", 5)                = 5
read(4, "\317\3\211\331\35\212\215\3610Y\250\1z\1\376\375e\250Z\376\311mS\321\16\221\254\260\355\0268%"..., 1363) = 1363
setitimer(ITIMER_REAL, {it_interval={0, 0}, it_value={0, 0}}, NULL) = 0
rt_sigaction(SIGALRM, {SIG_DFL, [ALRM], SA_RESTORER|SA_RESTART, 0x7f094452eff0}, {0x42c180, [ALRM], SA_RESTORER|SA_RESTART, 0x7f094452eff0}, 8) = 0
write(3, "eh\343Ig\322G4\321\351\264\322\352\222)5L\222H\272dw\215e\236X\240G\236E\201_"..., 1347) = 1347
select(5, [4], NULL, NULL, {0, 950000}) = 1 (in [4], left {0, 949998})
rt_sigaction(SIGALRM, {0x42c180, [ALRM], SA_RESTORER|SA_RESTART, 0x7f094452eff0}, {SIG_DFL, [ALRM], SA_RESTORER|SA_RESTART, 0x7f094452eff0}, 8) = 0
rt_sigprocmask(SIG_BLOCK, NULL, [], 8)  = 0
setitimer(ITIMER_REAL, {it_interval={0, 0}, it_value={900, 0}}, NULL) = 0
read(4, "\27\3\1\5S", 5)                = 5
read(4, "\310%\364\360-e\17]\241\326\332\200~(\343\322\270a6k\363\210\233\264\vx\321\234\266Ii;"..., 1363) = 1363
setitimer(ITIMER_REAL, {it_interval={0, 0}, it_value={0, 0}}, NULL) = 0
rt_sigaction(SIGALRM, {SIG_DFL, [ALRM], SA_RESTORER|SA_RESTART, 0x7f094452eff0}, {0x42c180, [ALRM], SA_RESTORER|SA_RESTART, 0x7f094452eff0}, 8) = 0
write(3, "\36\276\34\372\233\254\221\252\30\21\212I;\210\325\2663m\n\276,\204\355e\257\335#\205%\222\234\251"..., 1347) = 1347
select(5, [4], NULL, NULL, {0, 950000}) = 1 (in [4], left {0, 949998})
rt_sigaction(SIGALRM, {0x42c180, [ALRM], SA_RESTORER|SA_RESTART, 0x7f094452eff0}, {SIG_DFL, [ALRM], SA_RESTORER|SA_RESTART, 0x7f094452eff0}, 8) = 0
rt_sigprocmask(SIG_BLOCK, NULL, [], 8)  = 0
setitimer(ITIMER_REAL, {it_interval={0, 0}, it_value={900, 0}}, NULL) = 0
read(4, "\27\3\1\5S", 5)                = 5
read(4, "5\217\21\353\243 \30\365\377H\204\202\276\206\352\253\356z\363\3470\276\335\25\223\317J\r\27a\210\336"..., 1363) = 1363
setitimer(ITIMER_REAL, {it_interval={0, 0}, it_value={0, 0}}, NULL) = 0
rt_sigaction(SIGALRM, {SIG_DFL, [ALRM], SA_RESTORER|SA_RESTART, 0x7f094452eff0}, {0x42c180, [ALRM], SA_RESTORER|SA_RESTART, 0x7f094452eff0}, 8) = 0
write(3, "+\211i\232\342\265\26\3710R\217?\224\332w\334\272\342H\347\320\257A\355\177\fv\255D\35\227A"..., 1347) = 1347
