select(4, [3], NULL, NULL, {0, 950000}) = 1 (in [3], left {0, 949810})
read(3, "\211\341Os\276\306Z#\322e(-\247\266\263\306 \254\263\337\365\216G\371\372q^\273T?\221 "..., 8192) = 1368
write(4, "\211\341Os\276\306Z#\322e(-\247\266\263\306 \254\263\337\365\216G\371\372q^\273T?\221 "..., 1368) = 1368
select(4, [3], NULL, NULL, {0, 950000}) = 1 (in [3], left {0, 949996})
read(3, "*a}\210\253e\210\372D\3\37\226K\0HR`\304qal\367\232o\211\317\3069\333\252td"..., 8192) = 1368
write(4, "*a}\210\253e\210\372D\3\37\226K\0HR`\304qal\367\232o\211\317\3069\333\252td"..., 1368) = 1368
select(4, [3], NULL, NULL, {0, 950000}) = 1 (in [3], left {0, 948102})
read(3, " \304\202\273\31u\240\203\230\5\24ZyN_\214\30\27\232\202b\21~a\343\251f\333r\226%\364"..., 8192) = 1368
write(4, " \304\202\273\31u\240\203\230\5\24ZyN_\214\30\27\232\202b\21~a\343\251f\333r\226%\364"..., 1368) = 1368
select(4, [3], NULL, NULL, {0, 950000}) = 1 (in [3], left {0, 949591})
read(3, "\362\342\332\33067=\255\270\326\270\225\234\260\25\217\230\177\362g\356\245\333\372\313\232=+\333\355\2\2"..., 8192) = 1368
write(4, "\362\342\332\33067=\255\270\326\270\225\234\260\25\217\230\177\362g\356\245\333\372\313\232=+\333\355\2\2"..., 1368) = 1368
select(4, [3], NULL, NULL, {0, 950000}) = 1 (in [3], left {0, 949995})
read(3, "=\226\22\316\20\225`l(\304\221\227\32/m\245\305CI\237\366\210\331g\250\364\340\271\215rer"..., 8192) = 2736
write(4, "=\226\22\316\20\225`l(\304\221\227\32/m\245\305CI\237\366\210\331g\250\364\340\271\215rer"..., 2736) = 2736
select(4, [3], NULL, NULL, {0, 950000}) = 1 (in [3], left {0, 949539})
read(3, "o\241\266\3125h\263 \311\34\244\2032\34\ti\n\255\0\305\213\361\316\365]!\225\326\261Zks"..., 8192) = 1368
write(4, "o\241\266\3125h\263 \311\34\244\2032\34\ti\n\255\0\305\213\361\316\365]!\225\326\261Zks"..., 1368) = 1368
select(4, [3], NULL, NULL, {0, 950000}) = 1 (in [3], left {0, 949995})
read(3, "B\4ok\376\344U~\341\252\266\277\312\24*\272)\4\344\0\340\255\2671\301L\304?\355\272\326\234"..., 8192) = 4104
write(4, "B\4ok\376\344U~\341\252\266\277\312\24*\272)\4\344\0\340\255\2671\301L\304?\355\272\326\234"..., 4096) = 4096
write(4, "\314\376V\255lU\252\312", 8)  = 8
select(4, [3], NULL, NULL, {0, 950000}) = 1 (in [3], left {0, 949996})
read(3, "\334(P}X\362i\203\210\0007.\232!\205\250\364\360\306\0326\336\247,xa6\311\5\242K\212"..., 8192) = 4104
write(4, "\334(P}X\362i\203\210\0007.\232!\205\250\364\360\306\0326\336\247,xa6\311\5\242K\212"..., 4096) = 4096
write(4, "\23(\364j\3\232\0162", 8)     = 8
select(4, [3], NULL, NULL, {0, 950000}) = 1 (in [3], left {0, 949995})
read(3, "\366\207\30\363\336X\3745\244\37n\261\351\306\242\0101\353n\372\271DM\324\34\210\0\177\31\343\3023"..., 8192) = 4104
write(4, "\366\207\30\363\336X\3745\244\37n\261\351\306\242\0101\353n\372\271DM\324\34\210\0\177\31\343\3023"..., 4096) = 4096
write(4, "i\0043\322\314\v\243X", 8)    = 8
select(4, [3], NULL, NULL, {0, 950000}) = 1 (in [3], left {0, 949995})
read(3, "\r\204h\10\34b\375\331\216G\267\212Twq\374\26p>\327L^\27\r\2652g\366\20\252\244\220"..., 8192) = 2736
write(4, "\r\204h\10\34b\375\331\216G\267\212Twq\374\26p>\327L^\27\r\2652g\366\20\252\244\220"..., 2736) = 2736
select(4, [3], NULL, NULL, {0, 950000}) = 1 (in [3], left {0, 949805})
read(3, "\232\200\250\10UJLb\3219\25\217\222\237 \3336\317\273ovn\241_m\277\274D\5`\202\373"..., 8192) = 1368
write(4, "\232\200\250\10UJLb\3219\25\217\222\237 \3336\317\273ovn\241_m\277\274D\5`\202\373"..., 1368) = 1368
select(4, [3], NULL, NULL, {0, 950000}) = 1 (in [3], left {0, 949995})
read(3, "\350\355l\300c\234\32B5J\340%$\6\200Ly\345j \3566\301u\2\342\235\273x\230?\330"..., 8192) = 2736
write(4, "\350\355l\300c\234\32B5J\340%$\6\200Ly\345j \3566\301u\2\342\235\273x\230?\330"..., 2736) = 2736
select(4, [3], NULL, NULL, {0, 950000}) = 1 (in [3], left {0, 941370})
read(3, "\346S2\305\223\266\351\264\326\330\32\24S\364\201B}\304\353\254I\37S\316\177\237\2\262\2774\204\326"..., 8192) = 1368
write(4, "\346S2\305\223\266\351\264\326\330\32\24S\364\201B}\304\353\254I\37S\316\177\237\2\262\2774\204\326"..., 1368) = 1368
select(4, [3], NULL, NULL, {0, 950000}) = 1 (in [3], left {0, 949947})
read(3, "\310LW0\243\332L\30\347\"#H#k\220\222\347\224\n\r$e%Jr\254\221$\204x\346\22"..., 8192) = 1368
write(4, "\310LW0\243\332L\30\347\"#H#k\220\222\347\224\n\r$e%Jr\254\221$\204x\346\22"..., 1368) = 1368
select(4, [3], NULL, NULL, {0, 950000}) = 1 (in [3], left {0, 949995})
read(3, "`\vA\" G\26n\327\240\327:\375\260X\16\234\242\225\36\5\1\345<P\245%\25F\363\325\232"..., 8192) = 2736
write(4, "`\vA\" G\26n\327\240\327:\375\260X\16\234\242\225\36\5\1\345<P\245%\25F\363\325\232"..., 2736) = 2736
select(4, [3], NULL, NULL, {0, 950000}) = 1 (in [3], left {0, 947562})
read(3, "Q\335\367\221-y\201oY\353g\4\220\250\200\221\222\364FH\256\354T\2205P\30i\210\5\240_"..., 8192) = 1368
write(4, "Q\335\367\221-y\201oY\353g\4\220\250\200\221\222\364FH\256\354T\2205P\30i\210\5\240_"..., 1368) = 1368
select(4, [3], NULL, NULL, {0, 950000}) = 1 (in [3], left {0, 949664})
read(3, "u\36\325\f\366\274\200\243\253f\247\"I\367@\31q\370\331 \7\237\252\244\0\274\24\222\274MW\375"..., 8192) = 2736
write(4, "u\36\325\f\366\274\200\243\253f\247\"I\367@\31q\370\331 \7\237\252\244\0\274\24\222\274MW\375"..., 2736) = 2736
select(4, [3], NULL, NULL, {0, 950000}) = 1 (in [3], left {0, 949995})
read(3, "q2 `\335:5Y\02761\2\265\32\th\335\233QklR\307\366g\36\357o\323^\6\352"..., 8192) = 1368
write(4, "q2 `\335:5Y\02761\2\265\32\th\335\233QklR\307\366g\36\357o\323^\6\352"..., 1368) = 1368
select(4, [3], NULL, NULL, {0, 950000}) = 1 (in [3], left {0, 948460})
read(3, "acY\263^\32\241n\326f\220\3674\346x%\21\n\375x\220$W\0058\210w\236\354\256\255\205"..., 8192) = 1368
write(4, "acY\263^\32\241n\326f\220\3674\346x%\21\n\375x\220$W\0058\210w\236\354\256\255\205"..., 1368) = 1368
select(4, [3], NULL, NULL, {0, 950000}) = 1 (in [3], left {0, 949646})
read(3, "tS\335\214\317t9\273G\203\323\222\243RcT\10\0[,D\5\355\25\326Y\324\205\31\21\0164"..., 8192) = 2736
write(4, "tS\335\214\317t9\273G\203\323\222\243RcT\10\0[,D\5\355\25\326Y\324\205\31\21\0164"..., 2736) = 2736
select(4, [3], NULL, NULL, {0, 950000}) = 1 (in [3], left {0, 949995})
read(3, "\223^D\305`e\335\23\302\207\17RF\320\356#Im\t\364\372i\257\324hx\336\313\201\303\2361"..., 8192) = 2736
write(4, "\223^D\305`e\335\23\302\207\17RF\320\356#Im\t\364\372i\257\324hx\336\313\201\303\2361"..., 2736) = 2736
select(4, [3], NULL, NULL, {0, 950000}) = 1 (in [3], left {0, 949996})
read(3, "\355\226\3223Y\201\355\367{~\247\334?\200\343=V\265\227/\347.\16\tU\225Gn\370\323\244\322"..., 8192) = 4104
write(4, "\355\226\3223Y\201\355\367{~\247\334?\200\343=V\265\227/\347.\16\tU\225Gn\370\323\244\322"..., 4096) = 4096
write(4, "\231\343\334\343\214d\315\31", 8) = 8
select(4, [3], NULL, NULL, {0, 950000}) = 1 (in [3], left {0, 949995})
read(3, "?\323>\352\304>\347\273\200H\366\f`\344Z2\307\220V\0\211\345\376\3765\272\353[R \225\275"..., 8192) = 2736
write(4, "?\323>\352\304>\347\273\200H\366\f`\344Z2\307\220V\0\211\345\376\3765\272\353[R \225\275"..., 2736) = 2736
select(4, [3], NULL, NULL, {0, 950000}) = 1 (in [3], left {0, 949663})
read(3, "\324\20e1\303\232\214\22\261`{_\316\36;\277\2546\317\273\355p\265S*^\320l\2624\nB"..., 8192) = 1368
