write(4, "O\342\277\302\314\211\343\317\354\220\344\354L\333I\217\367\371\312\361>\351*v\247\352\343\21v\325\201\262"..., 1368) = 1368
select(4, [3], NULL, NULL, {0, 950000}) = 1 (in [3], left {0, 948161})
read(3, "\264\245\205\\\207\363\231\367=\3m\315(\327\241\355\231Y\367\275\4m-b\336\300\371\314\373`$x"..., 8192) = 4104
write(4, "\264\245\205\\\207\363\231\367=\3m\315(\327\241\355\231Y\367\275\4m-b\336\300\371\314\373`$x"..., 4096) = 4096
write(4, "\356\221U\360\203Z\277\"", 8) = 8
select(4, [3], NULL, NULL, {0, 950000}) = 1 (in [3], left {0, 927146})
read(3, "|;\330zXC\22\327\"\263^i\34+\3j\301\216>\276}\3619g/i\352\336\2649#]"..., 8192) = 1368
write(4, "|;\330zXC\22\327\"\263^i\34+\3j\301\216>\276}\3619g/i\352\336\2649#]"..., 1368) = 1368
select(4, [3], NULL, NULL, {0, 950000}) = 1 (in [3], left {0, 948017})
read(3, "bVW \373B:\262\257\367\204\364\301\207\306\307\17T\272\341\244\7>=\273\16\277\3605\16S\35"..., 8192) = 5472
write(4, "bVW \373B:\262\257\367\204\364\301\207\306\307\17T\272\341\244\7>=\273\16\277\3605\16S\35"..., 4096) = 4096
write(4, "\225}\243\26\323\321}\353v\263\363\373v\366?\227{j \331\261\350W\371\30\272B\2306M\205r"..., 1376) = 1376
select(4, [3], NULL, NULL, {0, 950000}) = 1 (in [3], left {0, 949996})
read(3, "\267\320r\315\351\247]cY\274\330r\355\251\247_c\371\306\35'\230s\7\315\314\4\277\331%\10\325"..., 8192) = 2736
write(4, "\267\320r\315\351\247]cY\274\330r\355\251\247_c\371\306\35'\230s\7\315\314\4\277\331%\10\325"..., 2736) = 2736
select(4, [3], NULL, NULL, {0, 950000}) = 1 (in [3], left {0, 949996})
read(3, "d\26<s\224>\10[\7\2543M;,\360\336\345\366\27m\32\272\241\277pk\310]1>\303\217"..., 8192) = 1368
write(4, "d\26<s\224>\10[\7\2543M;,\360\336\345\366\27m\32\272\241\277pk\310]1>\303\217"..., 1368) = 1368
select(4, [3], NULL, NULL, {0, 950000}) = 1 (in [3], left {0, 949997})
read(3, "=\246\235#.!qn5=\347\26\355\234\306!\30161\27\235\353-\302\264#\16\t\266Iz\214"..., 8192) = 2736
write(4, "=\246\235#.!qn5=\347\26\355\234\306!\30161\27\235\353-\302\264#\16\t\266Iz\214"..., 2736) = 2736
select(4, [3], NULL, NULL, {0, 950000}) = 1 (in [3], left {0, 949997})
read(3, "nk>\376\f\317r\n\267a\30r\330\26\337\367\26{I\3300\337 \33\246\370\276W\250?\227i"..., 8192) = 1368
write(4, "nk>\376\f\317r\n\267a\30r\330\26\337\367\26{I\3300\337 \33\246\370\276W\250?\227i"..., 1368) = 1368
select(4, [3], NULL, NULL, {0, 950000}) = 1 (in [3], left {0, 949997})
read(3, "h\225i\243\275\300o\354\217&\243I\254\256\212&\215\354\350\371\275\217|et\376YW\312\346={"..., 8192) = 1368
write(4, "h\225i\243\275\300o\354\217&\243I\254\256\212&\215\354\350\371\275\217|et\376YW\312\346={"..., 1368) = 1368
select(4, [3], NULL, NULL, {0, 950000}) = 1 (in [3], left {0, 948667})
read(3, "\0330\21\256$\1\253&U\26\37g\22\375\355O`e\226\27L\214y\4Q\22C\357FFG\225"..., 8192) = 1368
write(4, "\0330\21\256$\1\253&U\26\37g\22\375\355O`e\226\27L\214y\4Q\22C\357FFG\225"..., 1368) = 1368
select(4, [3], NULL, NULL, {0, 950000}) = 1 (in [3], left {0, 949703})
read(3, "\364\242'&\270\201\215\265\240%\23:\304\fu\244\2\23\322\230\4\223\237Cl\6JT\"J\214d"..., 8192) = 1368
write(4, "\364\242'&\270\201\215\265\240%\23:\304\fu\244\2\23\322\230\4\223\237Cl\6JT\"J\214d"..., 1368) = 1368
select(4, [3], NULL, NULL, {0, 950000}) = 1 (in [3], left {0, 949995})
read(3, "\354\7\246\273\2527\317\26b\217\265\301|\37\355\201G\201\316w\300\212\0059\375\240S\361\tA-\245"..., 8192) = 2736
write(4, "\354\7\246\273\2527\317\26b\217\265\301|\37\355\201G\201\316w\300\212\0059\375\240S\361\tA-\245"..., 2736) = 2736
select(4, [3], NULL, NULL, {0, 950000}) = 1 (in [3], left {0, 949999})
read(3, "'Y\24f\234\202\206\352\236\3\300\275v\326\253\331c#k\327\256\34\214\225{\275%\265\365\307\36\373"..., 8192) = 2736
write(4, "'Y\24f\234\202\206\352\236\3\300\275v\326\253\331c#k\327\256\34\214\225{\275%\265\365\307\36\373"..., 2736) = 2736
select(4, [3], NULL, NULL, {0, 950000}) = 1 (in [3], left {0, 949988})
read(3, "*\324++\361\2702\350\222\25\354\2\227\33\333\31\nWT\316\262\2169\311\261\307\213%\2338k\365"..., 8192) = 1368
write(4, "*\324++\361\2702\350\222\25\354\2\227\33\333\31\nWT\316\262\2169\311\261\307\213%\2338k\365"..., 1368) = 1368
select(4, [3], NULL, NULL, {0, 950000}) = 1 (in [3], left {0, 949996})
read(3, "'\365c\236\240\0336\302>\327\230\327\207P\21A\327X@=R\202G\24)\25\24\304\6n\304\337"..., 8192) = 2736
write(4, "'\365c\236\240\0336\302>\327\230\327\207P\21A\327X@=R\202G\24)\25\24\304\6n\304\337"..., 2736) = 2736
select(4, [3], NULL, NULL, {0, 950000}) = 1 (in [3], left {0, 925190})
read(3, "\251.\23\366M\r\300\320fIC\325ZSC\256\326\214\240\321\233\24\240\312\326D\212m\307^|\245"..., 8192) = 1368
write(4, "\251.\23\366M\r\300\320fIC\325ZSC\256\326\214\240\321\233\24\240\312\326D\212m\307^|\245"..., 1368) = 1368
select(4, [3], NULL, NULL, {0, 950000}) = 1 (in [3], left {0, 947568})
read(3, "\263\21\217'\342a\353\275\235\216\322\21\341&\214\270\\L*\21\312c\326f\312K\265\373\253\234\270\31"..., 8192) = 4104
write(4, "\263\21\217'\342a\353\275\235\216\322\21\341&\214\270\\L*\21\312c\326f\312K\265\373\253\234\270\31"..., 4096) = 4096
write(4, "\227Pa\336ss\f\3", 8)         = 8
select(4, [3], NULL, NULL, {0, 950000}) = 1 (in [3], left {0, 949994})
read(3, "\33\23-hN]\365\364\346I\357s?\22\3$jp\267\300\3512\316\236\370~\33\377\24\224\204\26"..., 6156) = 6156
write(4, "\33\23-hN]\365\364\346I\357s?\22\3$jp\267\300\3512\316\236\370~\33\377\24\224\204\26"..., 4096) = 4096
write(4, "\306\200\325Ri\355R\17\247\265cS\206\365\255\213\365\315\r\21O;G\263c\325\231c\204\332UP"..., 2060) = 2060
write(2, "\r", 1)                       = 1
write(2, "100%[==========================="..., 79) = 79
write(2, "\n\n", 2)                     = 2
close(4)                                = 0
munmap(0x7fcea595e000, 4096)            = 0
stat("/etc/localtime", {st_mode=S_IFREG|0644, st_size=3519, ...}) = 0
utime("/home/bearface/website_output/www.uchicago.edu/c/fonts/1415F2_1.woff", [2014/06/30-12:28:28, 2013/05/06-11:58:18]) = 0
write(2, "2014-06-30 12:28:28 (543 KB/s) -"..., 129) = 129
statfs("/home/bearface/website_output/www.uchicago.edu/c/fonts", {f_type="EXT2_SUPER_MAGIC", f_bsize=4096, f_blocks=59275954, f_bfree=49123369, f_bavail=46106563, f_files=15065088, f_ffree=14788067, f_fsid={533008265, 2108930253}, f_namelen=255, f_frsize=4096}) = 0
stat("/home/bearface/website_output/www.uchicago.edu/c/fonts/1415F2_1.ttf", 0x7fff7e3ef680) = -1 ENOENT (No such file or directory)
stat("/home/bearface/website_output/www.uchicago.edu/c/fonts/1415F2_1.ttf", 0x7fff7e3ef710) = -1 ENOENT (No such file or directory)
statfs("/home/bearface/website_output/www.uchicago.edu/c/fonts", {f_type="EXT2_SUPER_MAGIC", f_bsize=4096, f_blocks=59275954, f_bfree=49123368, f_bavail=46106562, f_files=15065088, f_ffree=14788067, f_fsid={533008265, 2108930253}, f_namelen=255, f_frsize=4096}) = 0
stat("/home/bearface/website_output/www.uchicago.edu/c/fonts/1415F2_1.ttf", 0x7fff7e3ef680) = -1 ENOENT (No such file or directory)
nanosleep({1, 0}, 0x7fff7e3ef790)       = 0
stat("/etc/localtime", {st_mode=S_IFREG|0644, st_size=3519, ...}) = 0
write(2, "--2014-06-30 12:28:29--  http://"..., 70) = 70
select(4, [3], NULL, NULL, {0, 1})      = 0 (Timeout)
getpeername(3, {sa_family=AF_INET, sin_port=htons(80), sin_addr=inet_addr("198.101.129.15")}, [16]) = 0
write(2, "Reusing existing connection to w"..., 52) = 52
