write(2, "200 OK\n", 7)                 = 7
stat("/home/bearface/website_output/www.cornell.edu/assets/core/images/nav-overview-research.jpg", 0x7fff66db0590) = -1 ENOENT (No such file or directory)
write(2, "Length: ", 8)                 = 8
write(2, "7319", 4)                     = 4
write(2, " (7.1K)", 7)                  = 7
write(2, " [image/jpeg]\n", 14)         = 14
stat("/home/bearface/website_output/www.cornell.edu/assets/core/images", {st_mode=S_IFDIR|0755, st_size=4096, ...}) = 0
open("/home/bearface/website_output/www.cornell.edu/assets/core/images/nav-overview-research.jpg", O_WRONLY|O_CREAT|O_TRUNC, 0666) = 4
write(2, "Saving to: \342\200\230/home/bearface/web"..., 108) = 108
write(2, "\n", 1)                       = 1
write(2, "\r", 1)                       = 1
write(2, " 0% [                           "..., 79) = 79
select(4, [3], NULL, NULL, {0, 950000}) = 1 (in [3], left {0, 949997})
read(3, "\377\330\377\340\0\20JFIF\0\1\1\0\0\1\0\1\0\0\377\333\0C\0\4\3\3\3\3\3\4"..., 7319) = 1071
fstat(4, {st_mode=S_IFREG|0644, st_size=0, ...}) = 0
mmap(NULL, 4096, PROT_READ|PROT_WRITE, MAP_PRIVATE|MAP_ANONYMOUS, -1, 0) = 0x7f094575f000
write(4, "\377\330\377\340\0\20JFIF\0\1\1\0\0\1\0\1\0\0\377\333\0C\0\4\3\3\3\3\3\4"..., 1071) = 1071
select(4, [3], NULL, NULL, {0, 950000}) = 1 (in [3], left {0, 926999})
read(3, "\21V3'\377\304\0,\20\0\1\4\1\3\3\3\4\2\3\1\0\0\0\0\0\3\1\2\4\5\0\6"..., 6248) = 1380
write(4, "\21V3'\377\304\0,\20\0\1\4\1\3\3\3\4\2\3\1\0\0\0\0\0\3\1\2\4\5\0\6"..., 1380) = 1380
select(4, [3], NULL, NULL, {0, 950000}) = 1 (in [3], left {0, 949350})
read(3, "\217z\10\263e\315\224\7\17*\302\3605\315\305b5y\266\260/\33\325\357\216\367\355\236\245\307\246\331"..., 4868) = 1380
write(4, "\217z\10\263e\315\224\7\17*\302\3605\315\305b5y\266\260/\33\325\357\216\367\355\236\245\307\246\331"..., 1380) = 1380
select(4, [3], NULL, NULL, {0, 950000}) = 1 (in [3], left {0, 947682})
read(3, "\243\274W\373I\332\3768\357\33\273\226\362\370!XD{\216\32\0277\213\371N\243\";w\346\376\333"..., 3488) = 1380
write(4, "\243\274W\373I\332\3768\357\33\273\226\362\370!XD{\216\32\0277\213\371N\243\";w\346\376\333"..., 1380) = 1380
select(4, [3], NULL, NULL, {0, 950000}) = 1 (in [3], left {0, 949995})
read(3, "&\206\334\0X\364/\322\33\203\353US\5`7\342>\233\253\301*>\243`\37&\1\247\336#\33"..., 2108) = 1380
write(4, "&\206\334\0X\364/\322\33\203\353US\5`7\342>\233\253\301*>\243`\37&\1\247\336#\33"..., 1380) = 1380
select(4, [3], NULL, NULL, {0, 950000}) = 1 (in [3], left {0, 929678})
read(3, "\213B\354\273\261\216\315\373ll*)\33\17\236\317\264|e\337\377\304\0,\21\0\2\2\1\3\3\3"..., 728) = 728
write(4, "\213B\354\273\261\216\315\373ll*)\33\17\236\317\264|e\337\377\304\0,\21\0\2\2\1\3\3\3"..., 728) = 728
write(2, "\r", 1)                       = 1
write(2, "100%[==========================="..., 79) = 79
write(2, "\n\n", 2)                     = 2
close(4)                                = 0
munmap(0x7f094575f000, 4096)            = 0
stat("/etc/localtime", {st_mode=S_IFREG|0644, st_size=3519, ...}) = 0
utime("/home/bearface/website_output/www.cornell.edu/assets/core/images/nav-overview-research.jpg", [2014/06/30-12:34:40, 2014/02/11-11:23:23]) = 0
write(2, "2014-06-30 12:34:40 (148 KB/s) -"..., 149) = 149
statfs("/home/bearface/website_output/www.cornell.edu/assets/images", {f_type="EXT2_SUPER_MAGIC", f_bsize=4096, f_blocks=59275954, f_bfree=49117111, f_bavail=46100305, f_files=15065088, f_ffree=14787936, f_fsid={533008265, 2108930253}, f_namelen=255, f_frsize=4096}) = 0
stat("/home/bearface/website_output/www.cornell.edu/assets/images/nav-overview-engagement.jpg", 0x7fff66db0aa0) = -1 ENOENT (No such file or directory)
stat("/home/bearface/website_output/www.cornell.edu/assets/images/nav-overview-engagement.jpg", 0x7fff66db0b30) = -1 ENOENT (No such file or directory)
statfs("/home/bearface/website_output/www.cornell.edu/assets/images", {f_type="EXT2_SUPER_MAGIC", f_bsize=4096, f_blocks=59275954, f_bfree=49117111, f_bavail=46100305, f_files=15065088, f_ffree=14787936, f_fsid={533008265, 2108930253}, f_namelen=255, f_frsize=4096}) = 0
stat("/home/bearface/website_output/www.cornell.edu/assets/images/nav-overview-engagement.jpg", 0x7fff66db0aa0) = -1 ENOENT (No such file or directory)
nanosleep({1, 0}, 0x7fff66db0bb0)       = 0
stat("/etc/localtime", {st_mode=S_IFREG|0644, st_size=3519, ...}) = 0
write(2, "--2014-06-30 12:34:41--  http://"..., 90) = 90
select(4, [3], NULL, NULL, {0, 1})      = 0 (Timeout)
getpeername(3, {sa_family=AF_INET, sin_port=htons(80), sin_addr=inet_addr("132.236.204.10")}, [16]) = 0
write(2, "Reusing existing connection to w"..., 51) = 51
select(4, NULL, [3], NULL, {900, 0})    = 1 (out [3], left {899, 999995})
write(3, "GET /assets/images/nav-overview-"..., 213) = 213
write(2, "HTTP request sent, awaiting resp"..., 40) = 40
select(4, [3], NULL, NULL, {900, 0})    = 1 (in [3], left {899, 968917})
recvfrom(3, "HTTP/1.1 200 OK\r\nSet-Cookie: cor"..., 511, MSG_PEEK, NULL, NULL) = 511
read(3, "HTTP/1.1 200 OK\r\nSet-Cookie: cor"..., 360) = 360
write(2, "200 OK\n", 7)                 = 7
stat("/home/bearface/website_output/www.cornell.edu/assets/images/nav-overview-engagement.jpg", 0x7fff66db0590) = -1 ENOENT (No such file or directory)
write(2, "Length: ", 8)                 = 8
write(2, "20000", 5)                    = 5
write(2, " (20K)", 6)                   = 6
write(2, " [image/jpeg]\n", 14)         = 14
stat("/home/bearface/website_output/www.cornell.edu/assets/images", {st_mode=S_IFDIR|0755, st_size=4096, ...}) = 0
open("/home/bearface/website_output/www.cornell.edu/assets/images/nav-overview-engagement.jpg", O_WRONLY|O_CREAT|O_TRUNC, 0666) = 4
write(2, "Saving to: \342\200\230/home/bearface/web"..., 105) = 105
write(2, "\n", 1)                       = 1
write(2, "\r", 1)                       = 1
write(2, " 0% [                           "..., 79) = 79
select(4, [3], NULL, NULL, {0, 950000}) = 1 (in [3], left {0, 949995})
read(3, "\377\330\377\341\0\30Exif\0\0II*\0\10\0\0\0\0\0\0\0\0\0\0\0\377\354\0\21"..., 8192) = 1071
fstat(4, {st_mode=S_IFREG|0644, st_size=0, ...}) = 0
mmap(NULL, 4096, PROT_READ|PROT_WRITE, MAP_PRIVATE|MAP_ANONYMOUS, -1, 0) = 0x7f094575f000
write(4, "\377\330\377\341\0\30Exif\0\0II*\0\10\0\0\0\0\0\0\0\0\0\0\0\377\354\0\21"..., 1071) = 1071
select(4, [3], NULL, NULL, {0, 950000}) = 1 (in [3], left {0, 902789})
