select(4, [3], NULL, NULL, {0, 950000}) = 1 (in [3], left {0, 949998})
read(3, "MZvlj\354\326\3\266\365\275\321J\273\345\200\353\252-p\310\202N\0eE%\250\n\354\207#"..., 8192) = 1368
write(4, "MZvlj\354\326\3\266\365\275\321J\273\345\200\353\252-p\310\202N\0eE%\250\n\354\207#"..., 1368) = 1368
select(4, [3], NULL, NULL, {0, 950000}) = 1 (in [3], left {0, 949968})
read(3, "\274\r'K\355<\205\207\2219%|\331+\325\16/!\320;\5}ce\256y\323\216\241\3609d"..., 8192) = 1368
write(4, "\274\r'K\355<\205\207\2219%|\331+\325\16/!\320;\5}ce\256y\323\216\241\3609d"..., 1368) = 1368
select(4, [3], NULL, NULL, {0, 950000}) = 1 (in [3], left {0, 949998})
read(3, "\4\17\321\220\f\22\366m\275l\236S\306\4)\213M\214\237\337\360?\rEY|\177\351p\314\354\7"..., 8192) = 2736
write(4, "\4\17\321\220\f\22\366m\275l\236S\306\4)\213M\214\237\337\360?\rEY|\177\351p\314\354\7"..., 2736) = 2736
select(4, [3], NULL, NULL, {0, 950000}) = 1 (in [3], left {0, 949852})
read(3, "r6\367\364\327?\254\27\"sn\261\31H<?\316\f\300\337\234n\243H~\360\304\235\237\323\277\214"..., 8192) = 1368
write(4, "r6\367\364\327?\254\27\"sn\261\31H<?\316\f\300\337\234n\243H~\360\304\235\237\323\277\214"..., 1368) = 1368
select(4, [3], NULL, NULL, {0, 950000}) = 1 (in [3], left {0, 949998})
read(3, "\300\1\203Q\372\331\306@9\232Q\325\324<`\31{\301\7\265<\276LA\20v\0\374ba%D"..., 8192) = 1368
write(4, "\300\1\203Q\372\331\306@9\232Q\325\324<`\31{\301\7\265<\276LA\20v\0\374ba%D"..., 1368) = 1368
select(4, [3], NULL, NULL, {0, 950000}) = 1 (in [3], left {0, 949941})
read(3, "\246\313\347\0.\200\34\270{\0024V\337^0`-\222)\367b\35\341\4dT\216\244\3646\n\340"..., 8192) = 1368
write(4, "\246\313\347\0.\200\34\270{\0024V\337^0`-\222)\367b\35\341\4dT\216\244\3646\n\340"..., 1368) = 1368
select(4, [3], NULL, NULL, {0, 950000}) = 1 (in [3], left {0, 949998})
read(3, "\20\256\263&\255\344H\20\333\244L\336\344\300J\354z]\202\232\357\243\3D\234\352\233\251\233\300nY"..., 8192) = 1368
write(4, "\20\256\263&\255\344H\20\333\244L\336\344\300J\354z]\202\232\357\243\3D\234\352\233\251\233\300nY"..., 1368) = 1368
select(4, [3], NULL, NULL, {0, 950000}) = 1 (in [3], left {0, 949945})
read(3, "\4\334\215v\375\260\21D\254Z\250\17;\315\365\227\240\245\346\304A\251tu\211V\343@\4h3a"..., 8192) = 1368
write(4, "\4\334\215v\375\260\21D\254Z\250\17;\315\365\227\240\245\346\304A\251tu\211V\343@\4h3a"..., 1368) = 1368
select(4, [3], NULL, NULL, {0, 950000}) = 1 (in [3], left {0, 949998})
read(3, "b{D\3\242l\244\362\366\301\214\26\345-3\201\\\350{b\311\206 \340z\300\362\354\326l\3\20"..., 8192) = 1368
write(4, "b{D\3\242l\244\362\366\301\214\26\345-3\201\\\350{b\311\206 \340z\300\362\354\326l\3\20"..., 1368) = 1368
select(4, [3], NULL, NULL, {0, 950000}) = 1 (in [3], left {0, 949945})
read(3, "J\216!\203\332\27>\242&x\6>W\"p\4j\355\34Y\216E\2314\206\342\342\17z4\200\243"..., 8192) = 1368
write(4, "J\216!\203\332\27>\242&x\6>W\"p\4j\355\34Y\216E\2314\206\342\342\17z4\200\243"..., 1368) = 1368
select(4, [3], NULL, NULL, {0, 950000}) = 1 (in [3], left {0, 920342})
read(3, "=\341K\354N2\\dF\202\275\220q\304\22\232\350\242\316-B\344\7\267Y\272\4|\303\234\2249"..., 8192) = 1368
write(4, "=\341K\354N2\\dF\202\275\220q\304\22\232\350\242\316-B\344\7\267Y\272\4|\303\234\2249"..., 1368) = 1368
select(4, [3], NULL, NULL, {0, 950000}) = 1 (in [3], left {0, 949996})
read(3, "bb\3\342\230,PQ\r\274\36\261<\32hm\242\21\t\317\313\5\330\0\31%h\4\300\305R\n"..., 8192) = 2736
write(4, "bb\3\342\230,PQ\r\274\36\261<\32hm\242\21\t\317\313\5\330\0\31%h\4\300\305R\n"..., 2736) = 2736
select(4, [3], NULL, NULL, {0, 950000}) = 1 (in [3], left {0, 922637})
read(3, "\3007R\6\301\343\1h\4\311\16\326\337xhR\201\331\n\360\n\273\306J\344\203A\344\346,\226P"..., 8192) = 1368
write(4, "\3007R\6\301\343\1h\4\311\16\326\337xhR\201\331\n\360\n\273\306J\344\203A\344\346,\226P"..., 1368) = 1368
select(4, [3], NULL, NULL, {0, 950000}) = 1 (in [3], left {0, 949981})
read(3, "\274a5\360S\245i\362\20\\@\274\0\256\342s9\304\260\225\341T\224\362\347Y\2410\202\220pz"..., 8192) = 5472
write(4, "\274a5\360S\245i\362\20\\@\274\0\256\342s9\304\260\225\341T\224\362\347Y\2410\202\220pz"..., 4096) = 4096
write(4, "\375\263o\357\250\331n\240\0351\372Av\6}\266A~\260Nd\271t\305\332\245IR\340\266\225\220"..., 1376) = 1376
select(4, [3], NULL, NULL, {0, 950000}) = 1 (in [3], left {0, 949995})
read(3, "\27J\271\306\320\302\264Z9\1&\315\3740\203cQB\204\21\321\205\210\326\344\5f\214zn\262\222"..., 8192) = 6840
write(4, "\27J\271\306\320\302\264Z9\1&\315\3740\203cQB\204\21\321\205\210\326\344\5f\214zn\262\222"..., 4096) = 4096
write(4, ";Nr\232:\256\312\332\351\333\233\360Ri\375\3305\211z\23,\321J\21\0\330f\263\205_\323\261"..., 2744) = 2744
select(4, [3], NULL, NULL, {0, 950000}) = 1 (in [3], left {0, 949994})
read(3, "]\303\263\353\234\250\325F\224E\321\243x,<\34ITQqzaC\342\20\4X\26\265\257\217\31"..., 8192) = 5472
write(4, "]\303\263\353\234\250\325F\224E\321\243x,<\34ITQqzaC\342\20\4X\26\265\257\217\31"..., 4096) = 4096
write(4, "\217\303\277\221\212--\244\315\30<\234rG\376\v\273\370^]\254\16\31\260\177\2747\362\23\223\310\234"..., 1376) = 1376
select(4, [3], NULL, NULL, {0, 950000}) = 1 (in [3], left {0, 949996})
read(3, "\215\251cj\245N\5!\234\22\252V]\200\263$\322\340U\306\t\21\310\363b'\212!2\242F$"..., 8192) = 1368
write(4, "\215\251cj\245N\5!\234\22\252V]\200\263$\322\340U\306\t\21\310\363b'\212!2\242F$"..., 1368) = 1368
select(4, [3], NULL, NULL, {0, 950000}) = 1 (in [3], left {0, 946932})
read(3, "\307\350\352\241$8\0039$\252\310\261\252\254\252\0\215Q\224\342\307\356\10P\204S\200\312@ \204Y"..., 8192) = 1368
write(4, "\307\350\352\241$8\0039$\252\310\261\252\254\252\0\215Q\224\342\307\356\10P\204S\200\312@ \204Y"..., 1368) = 1368
select(4, [3], NULL, NULL, {0, 950000}) = 1 (in [3], left {0, 949551})
read(3, "\237\270\242n1\213\341\232\241kj\\>\34\202\263\263\264\306\363\20)\332\232\353`\353CI\223\365B"..., 8192) = 1368
write(4, "\237\270\242n1\213\341\232\241kj\\>\34\202\263\263\264\306\363\20)\332\232\353`\353CI\223\365B"..., 1368) = 1368
select(4, [3], NULL, NULL, {0, 950000}) = 1 (in [3], left {0, 949997})
read(3, "l\354\3[\220#\367a\275\250\232\237u\n\177hI\200\205\235\253l\306s\305\370\354\37U\372=\367"..., 8192) = 2736
write(4, "l\354\3[\220#\367a\275\250\232\237u\n\177hI\200\205\235\253l\306s\305\370\354\37U\372=\367"..., 2736) = 2736
select(4, [3], NULL, NULL, {0, 950000}) = 1 (in [3], left {0, 949997})
read(3, "\263|#\4\356\260\222\335\26\32\234\220\6\0\222\235\275P&H\252\32\35\24t$\311XD\34\224d"..., 8192) = 4104
write(4, "\263|#\4\356\260\222\335\26\32\234\220\6\0\222\235\275P&H\252\32\35\24t$\311XD\34\224d"..., 4096) = 4096
write(4, "\31X\233\23P\204a:", 8)       = 8
select(4, [3], NULL, NULL, {0, 950000}) = 1 (in [3], left {0, 949997})
read(3, "\242\10\36H\367&\307%R\2\6IXEPrn\311\250!\262\10^\341\1\250\356\234EMQ\320"..., 8192) = 2736
write(4, "\242\10\36H\367&\307%R\2\6IXEPrn\311\250!\262\10^\341\1\250\356\234EMQ\320"..., 2736) = 2736
select(4, [3], NULL, NULL, {0, 950000}) = 1 (in [3], left {0, 949328})
read(3, "[\354\f\205\27<\214\23657\344\361\321\360Kb\256N\310\276R]]_\31\26J\360'\231\213\304"..., 8192) = 1368
write(4, "[\354\f\205\27<\214\23657\344\361\321\360Kb\256N\310\276R]]_\31\26J\360'\231\213\304"..., 1368) = 1368
select(4, [3], NULL, NULL, {0, 950000}) = 1 (in [3], left {0, 949996})
read(3, "4c\240\216\214\261\274I,]\242\212h\2166\7\3320\3 Q\215\35\234\274Sl\304\325\332\233\273"..., 8192) = 2736
