stat("/home/bearface/website_output/www.uchicago.edu/c/fonts/symbolset", 0x7fff7e3ef1a0) = -1 ENOENT (No such file or directory)
stat("/home", {st_mode=S_IFDIR|0755, st_size=4096, ...}) = 0
stat("/home/bearface", {st_mode=S_IFDIR|0755, st_size=4096, ...}) = 0
stat("/home/bearface/website_output", {st_mode=S_IFDIR|0755, st_size=4096, ...}) = 0
stat("/home/bearface/website_output/www.uchicago.edu", {st_mode=S_IFDIR|0755, st_size=4096, ...}) = 0
stat("/home/bearface/website_output/www.uchicago.edu/c", {st_mode=S_IFDIR|0755, st_size=4096, ...}) = 0
stat("/home/bearface/website_output/www.uchicago.edu/c/fonts", {st_mode=S_IFDIR|0755, st_size=4096, ...}) = 0
stat("/home/bearface/website_output/www.uchicago.edu/c/fonts/symbolset", 0x7fff7e3ef0c0) = -1 ENOENT (No such file or directory)
mkdir("/home/bearface/website_output/www.uchicago.edu/c/fonts/symbolset", 0777) = 0
open("/home/bearface/website_output/www.uchicago.edu/c/fonts/symbolset/ss-social-circle.eot", O_WRONLY|O_CREAT|O_TRUNC, 0666) = 4
write(2, "Saving to: \342\200\230/home/bearface/web"..., 103) = 103
write(2, "\n", 1)                       = 1
write(2, "\r", 1)                       = 1
write(2, " 0% [                           "..., 79) = 79
select(4, [3], NULL, NULL, {0, 950000}) = 1 (in [3], left {0, 949996})
read(3, "Ph\0\0\234g\0\0\1\0\2\0\0\0\0\0\2\0\0\0\0\0\0\0\0\0\1\0\274\2\0\0"..., 8192) = 3706
fstat(4, {st_mode=S_IFREG|0644, st_size=0, ...}) = 0
mmap(NULL, 4096, PROT_READ|PROT_WRITE, MAP_PRIVATE|MAP_ANONYMOUS, -1, 0) = 0x7fcea595e000
write(4, "Ph\0\0\234g\0\0\1\0\2\0\0\0\0\0\2\0\0\0\0\0\0\0\0\0\1\0\274\2\0\0"..., 3706) = 3706
select(4, [3], NULL, NULL, {0, 950000}) = 1 (in [3], left {0, 922499})
read(3, "\0\26\0\16\0\23\0\f\0\4\0C\0\7\0000\0000\0(\0-\0&\0\4\0\\\0\6\0\20"..., 8192) = 1368
write(4, "\0\26\0\16\0\23\0\f\0\4\0C\0\7\0000\0000\0(\0-\0&\0\4\0\\\0\6\0\20"..., 1368) = 1368
select(4, [3], NULL, NULL, {0, 950000}) = 1 (in [3], left {0, 949994})
read(3, "\0.\0#\0004\0\3\0006\0001\0n\0\10\0\17\0\34\0\24\0\t\0\32\0\34\0\27\0n"..., 8192) = 4104
write(4, "\0.\0#\0004\0\3\0006\0001\0n\0\10\0\17\0\34\0\24\0\t\0\32\0\34\0\27\0n"..., 4096) = 4096
write(4, "#\1\21#\21!\t\1", 8)          = 8
select(4, [3], NULL, NULL, {0, 950000}) = 1 (in [3], left {0, 949056})
read(3, "!\6\37\305\376d\307\376Z\276\1\37\1\252\1\246\1\35\4\332\373&\4\330\373(\5\307\373\32\4\346"..., 8192) = 2736
write(4, "!\6\37\305\376d\307\376Z\276\1\37\1\252\1\246\1\35\4\332\373&\4\330\373(\5\307\373\32\4\346"..., 2736) = 2736
select(4, [3], NULL, NULL, {0, 950000}) = 1 (in [3], left {0, 923211})
read(3, "\3\221\217}\375{\0044\266\316\0\1\0G\377\337\3\300\4S\0006\0\0\1\24\6#\".\2'"..., 8192) = 2736
write(4, "\3\221\217}\375{\0044\266\316\0\1\0G\377\337\3\300\4S\0006\0\0\1\24\6#\".\2'"..., 2736) = 2736
select(4, [3], NULL, NULL, {0, 950000}) = 1 (in [3], left {0, 949979})
read(3, "\25'+\205\343\203\203\343\205+\376\225U\v#\34\4\vCC\v\4\34#\v\1@,??X>"..., 8192) = 1368
write(4, "\25'+\205\343\203\203\343\205+\376\225U\v#\34\4\vCC\v\4\34#\v\1@,??X>"..., 1368) = 1368
select(4, [3], NULL, NULL, {0, 950000}) = 1 (in [3], left {0, 949347})
read(3, "\0\17\0/\0002\0\0\0 \4\0\22\20\2\0\4 $\0\2\20\22\0\1 767676"..., 8192) = 1368
write(4, "\0\17\0/\0002\0\0\0 \4\0\22\20\2\0\4 $\0\2\20\22\0\1 767676"..., 1368) = 1368
select(4, [3], NULL, NULL, {0, 950000}) = 1 (in [3], left {0, 949327})
read(3, "76&'&54>\00232\26\25\24\16\1#\"&7>\00254&#\"\6\25\24\26\37"..., 8192) = 1368
write(4, "76&'&54>\00232\26\25\24\16\1#\"&7>\00254&#\"\6\25\24\26\37"..., 1368) = 1368
select(4, [3], NULL, NULL, {0, 950000}) = 1 (in [3], left {0, 948262})
read(3, "\1\5\6\2\7$%&\1\24\26\27\22%>\0017&'\4\5\24\6\00127\2'\4\3\26%"..., 7950) = 1368
write(4, "\1\5\6\2\7$%&\1\24\26\27\22%>\0017&'\4\5\24\6\00127\2'\4\3\26%"..., 1368) = 1368
select(4, [3], NULL, NULL, {0, 950000}) = 1 (in [3], left {0, 949900})
read(3, "4&\"\6\25\21\24\026265\21\1\36\1\3/\1\242\1{\1\22\242\242\376\356\376\205\376^\376"..., 6582) = 1368
write(4, "4&\"\6\25\21\24\026265\21\1\36\1\3/\1\242\1{\1\22\242\242\376\356\376\205\376^\376"..., 1368) = 1368
select(4, [3], NULL, NULL, {0, 950000}) = 1 (in [3], left {0, 949760})
read(3, "6'&#\".\2'&'\21\24\16\1#\"&54>\00232\27\4\0\320\1{\1\22\243"..., 5214) = 1368
write(4, "6'&#\".\2'&'\21\24\16\1#\"&54>\00232\27\4\0\320\1{\1\22\243"..., 1368) = 1368
select(4, [3], NULL, NULL, {0, 950000}) = 1 (in [3], left {0, 949944})
read(3, "\f\266\1\365\n\16\16\n\376\v\266\n\16\16\20\203\270\202\21\227\316\32\t\22\375?\30\2\1\0\0\5"..., 3846) = 2736
write(4, "\f\266\1\365\n\16\16\n\376\v\266\n\16\16\20\203\270\202\21\227\316\32\t\22\375?\30\2\1\0\0\5"..., 2736) = 2736
select(4, [3], NULL, NULL, {0, 950000}) = 1 (in [3], left {0, 949996})
read(3, "\0e\0F\0o\0r\0t\0r\0e\0s\0s\0:\0 \0S\0y\0m\0b\0o"..., 1110) = 1110
write(4, "\0e\0F\0o\0r\0t\0r\0e\0s\0s\0:\0 \0S\0y\0m\0b\0o"..., 1110) = 1110
write(2, "\r", 1)                       = 1
write(2, "100%[==========================="..., 79) = 79
write(2, "\n\n", 2)                     = 2
close(4)                                = 0
munmap(0x7fcea595e000, 4096)            = 0
stat("/etc/localtime", {st_mode=S_IFREG|0644, st_size=3519, ...}) = 0
utime("/home/bearface/website_output/www.uchicago.edu/c/fonts/symbolset/ss-social-circle.eot", [2014/06/30-12:28:44, 2013/05/06-11:58:18]) = 0
write(2, "2014-06-30 12:28:44 (391 KB/s) -"..., 146) = 146
statfs("/home/bearface/website_output/www.uchicago.edu/c/fonts/symbolset", {f_type="EXT2_SUPER_MAGIC", f_bsize=4096, f_blocks=59275954, f_bfree=49122840, f_bavail=46106034, f_files=15065088, f_ffree=14788053, f_fsid={533008265, 2108930253}, f_namelen=255, f_frsize=4096}) = 0
stat("/home/bearface/website_output/www.uchicago.edu/c/fonts/symbolset/ss-social-circle.eot?", 0x7fff7e3ef680) = -1 ENOENT (No such file or directory)
stat("/home/bearface/website_output/www.uchicago.edu/c/fonts/symbolset/ss-social-circle.eot?", 0x7fff7e3ef710) = -1 ENOENT (No such file or directory)
statfs("/home/bearface/website_output/www.uchicago.edu/c/fonts/symbolset", {f_type="EXT2_SUPER_MAGIC", f_bsize=4096, f_blocks=59275954, f_bfree=49122840, f_bavail=46106034, f_files=15065088, f_ffree=14788053, f_fsid={533008265, 2108930253}, f_namelen=255, f_frsize=4096}) = 0
stat("/home/bearface/website_output/www.uchicago.edu/c/fonts/symbolset/ss-social-circle.eot?", 0x7fff7e3ef680) = -1 ENOENT (No such file or directory)
nanosleep({1, 0}, 0x7fff7e3ef790)       = 0
stat("/etc/localtime", {st_mode=S_IFREG|0644, st_size=3519, ...}) = 0
write(2, "--2014-06-30 12:28:45--  http://"..., 89) = 89
select(4, [3], NULL, NULL, {0, 1})      = 0 (Timeout)
getpeername(3, {sa_family=AF_INET, sin_port=htons(80), sin_addr=inet_addr("198.101.129.15")}, [16]) = 0
write(2, "Reusing existing connection to w"..., 52) = 52
