write(4, "+\262\0\1\003333\1\260\r/\261\16\1+\2606\32\272\302\263\355\234\0\25+\n\260\4.\16"..., 4096) = 4096
write(4, "\302\276A\344\2\232\36\26", 8) = 8
select(4, [3], NULL, NULL, {0, 950000}) = 1 (in [3], left {0, 949297})
read(3, "\26\36\26\26\36\26\26\36\26\375P\353\1;\376\366\1\n\376\305\0\0\6\0*\0*\2q\2q\0"..., 8192) = 2736
write(4, "\26\36\26\26\36\26\26\36\26\375P\353\1;\376\366\1\n\376\305\0\0\6\0*\0*\2q\2q\0"..., 2736) = 2736
select(4, [3], NULL, NULL, {0, 950000}) = 1 (in [3], left {0, 949996})
read(3, "\0+\260\0213\260\3\315\260\0232\1\260\25/\260\1\326\260\0052\260\0\315\260\0202\262\0\1\n+"..., 6797) = 4104
write(4, "\0+\260\0213\260\3\315\260\0232\1\260\25/\260\1\326\260\0052\260\0\315\260\0202\262\0\1\n+"..., 4096) = 4096
write(4, "\10\0002\0#\3~\0", 8)         = 8
select(4, [3], NULL, NULL, {0, 950000}) = 1 (in [3], left {0, 949996})
read(3, "\0\0\0\0\3\1S\0\215\0002\0\0\377\377\0Q\0\0\1\301\3h\0#\1[\0n\0\262\0"..., 2693) = 2693
write(4, "\0\0\0\0\3\1S\0\215\0002\0\0\377\377\0Q\0\0\1\301\3h\0#\1[\0n\0\262\0"..., 2693) = 2693
write(2, "\r", 1)                       = 1
write(2, "100%[==========================="..., 79) = 79
write(2, "\n\n", 2)                     = 2
close(4)                                = 0
munmap(0x7fcea595e000, 4096)            = 0
stat("/etc/localtime", {st_mode=S_IFREG|0644, st_size=3519, ...}) = 0
utime("/home/bearface/website_output/www.uchicago.edu/c/fonts/1415F2_3.eot", [2014/06/30-12:28:32, 2013/05/06-11:58:12]) = 0
write(2, "2014-06-30 12:28:32 (848 KB/s) -"..., 130) = 130
statfs("/home/bearface/website_output/www.uchicago.edu/c/fonts", {f_type="EXT2_SUPER_MAGIC", f_bsize=4096, f_blocks=59275954, f_bfree=49123220, f_bavail=46106414, f_files=15065088, f_ffree=14788064, f_fsid={533008265, 2108930253}, f_namelen=255, f_frsize=4096}) = 0
stat("/home/bearface/website_output/www.uchicago.edu/c/fonts/1415F2_3.eot?", 0x7fff7e3ef680) = -1 ENOENT (No such file or directory)
stat("/home/bearface/website_output/www.uchicago.edu/c/fonts/1415F2_3.eot?", 0x7fff7e3ef710) = -1 ENOENT (No such file or directory)
statfs("/home/bearface/website_output/www.uchicago.edu/c/fonts", {f_type="EXT2_SUPER_MAGIC", f_bsize=4096, f_blocks=59275954, f_bfree=49123220, f_bavail=46106414, f_files=15065088, f_ffree=14788064, f_fsid={533008265, 2108930253}, f_namelen=255, f_frsize=4096}) = 0
stat("/home/bearface/website_output/www.uchicago.edu/c/fonts/1415F2_3.eot?", 0x7fff7e3ef680) = -1 ENOENT (No such file or directory)
nanosleep({1, 0}, 0x7fff7e3ef790)       = 0
stat("/etc/localtime", {st_mode=S_IFREG|0644, st_size=3519, ...}) = 0
write(2, "--2014-06-30 12:28:33--  http://"..., 71) = 71
select(4, [3], NULL, NULL, {0, 1})      = 0 (Timeout)
getpeername(3, {sa_family=AF_INET, sin_port=htons(80), sin_addr=inet_addr("198.101.129.15")}, [16]) = 0
write(2, "Reusing existing connection to w"..., 52) = 52
select(4, NULL, [3], NULL, {900, 0})    = 1 (out [3], left {899, 999993})
write(3, "GET /c/fonts/1415F2_3.eot? HTTP/"..., 374) = 374
write(2, "HTTP request sent, awaiting resp"..., 40) = 40
select(4, [3], NULL, NULL, {900, 0})    = 1 (in [3], left {899, 965827})
recvfrom(3, "HTTP/1.1 200 OK\r\nDate: Mon, 30 J"..., 511, MSG_PEEK, NULL, NULL) = 511
read(3, "HTTP/1.1 200 OK\r\nDate: Mon, 30 J"..., 391) = 391
write(2, "200 OK\n", 7)                 = 7
stat("/home/bearface/website_output/www.uchicago.edu/c/fonts/1415F2_3.eot?", 0x7fff7e3ef1b0) = -1 ENOENT (No such file or directory)
write(2, "Length: ", 8)                 = 8
write(2, "139094", 6)                   = 6
write(2, " (136K)", 7)                  = 7
write(2, " [application/vnd.ms-fontobject]"..., 33) = 33
stat("/home/bearface/website_output/www.uchicago.edu/c/fonts", {st_mode=S_IFDIR|0755, st_size=4096, ...}) = 0
open("/home/bearface/website_output/www.uchicago.edu/c/fonts/1415F2_3.eot?", O_WRONLY|O_CREAT|O_TRUNC, 0666) = 4
write(2, "Saving to: \342\200\230/home/bearface/web"..., 86) = 86
write(2, "\n", 1)                       = 1
write(2, "\r", 1)                       = 1
write(2, " 0% [                           "..., 79) = 79
select(4, [3], NULL, NULL, {0, 950000}) = 1 (in [3], left {0, 949997})
read(3, "V\37\2\0@\36\2\0\1\0\2\0\0\0\0\0\2\0\5\6\3\0\0\2\0\4\1\0\220\1\0\0"..., 8192) = 2505
fstat(4, {st_mode=S_IFREG|0644, st_size=0, ...}) = 0
mmap(NULL, 4096, PROT_READ|PROT_WRITE, MAP_PRIVATE|MAP_ANONYMOUS, -1, 0) = 0x7fcea595e000
write(4, "V\37\2\0@\36\2\0\1\0\2\0\0\0\0\0\2\0\5\6\3\0\0\2\0\4\1\0\220\1\0\0"..., 2505) = 2505
select(4, [3], NULL, NULL, {0, 950000}) = 1 (in [3], left {0, 923113})
read(3, "\0\0\0\0\0\0\0\0\0\0\0\0\0\0\0\0\0\0\0\0\0\0\1\0\0\3\7\377\37\0\254\4"..., 8192) = 2736
write(4, "\0\0\0\0\0\0\0\0\0\0\0\0\0\0\0\0\0\0\0\0\0\0\1\0\0\3\7\377\37\0\254\4"..., 2736) = 2736
select(4, [3], NULL, NULL, {0, 950000}) = 1 (in [3], left {0, 949705})
read(3, "Q\2>\0005\2\262\0#\1\306\0Q\4P\0S\3\n\0,\1\334\0\17\1\306\0\21\2\374\0"..., 8192) = 1368
write(4, "Q\2>\0005\2\262\0#\1\306\0Q\4P\0S\3\n\0,\1\334\0\17\1\306\0\21\2\374\0"..., 1368) = 1368
select(4, [3], NULL, NULL, {0, 950000}) = 1 (in [3], left {0, 949902})
read(3, "\f\0022\0\f\0022\0\f\0022\0\f\2\35\0Q\2c\0Q\1\371\0Q\1\371\0Q\1\371\0"..., 8192) = 1368
write(4, "\f\0022\0\f\0022\0\f\0022\0\f\2\35\0Q\2c\0Q\1\371\0Q\1\371\0Q\1\371\0"..., 1368) = 1368
select(4, [3], NULL, NULL, {0, 950000}) = 1 (in [3], left {0, 949997})
read(3, "'\1(\1)\1*\1+\1,\1-\0\372\0\327\1.\1/\0010\0011\0012\0013\0014\1"..., 8192) = 1368
write(4, "'\1(\1)\1*\1+\1,\1-\0\372\0\327\1.\1/\0010\0011\0012\0013\0014\1"..., 1368) = 1368
select(4, [3], NULL, NULL, {0, 950000}) = 1 (in [3], left {0, 949997})
read(3, "\235\3\236\3\237\3\240\3\241\3\242\3\243\3\244\3\245\3\246\3\247\3\250\3\251\3\252\3\253\3\254\3"..., 8192) = 1368
write(4, "\235\3\236\3\237\3\240\3\241\3\242\3\243\3\244\3\245\3\246\3\247\3\250\3\251\3\252\3\253\3\254\3"..., 1368) = 1368
select(4, [3], NULL, NULL, {0, 950000}) = 1 (in [3], left {0, 923235})
read(3, "\7uni0237\thsuperior\7uni02BC\7uni02"..., 8192) = 1368
write(4, "\7uni0237\thsuperior\7uni02BC\7uni02"..., 1368) = 1368
select(4, [3], NULL, NULL, {0, 950000}) = 1 (in [3], left {0, 949990})
read(3, "0096\tafii10097\tafii10071\tafii100"..., 8192) = 4104
write(4, "0096\tafii10097\tafii10071\tafii100"..., 4096) = 4096
