stat("/home/bearface/website_output", {st_mode=S_IFDIR|0755, st_size=4096, ...}) = 0
stat("/home/bearface/website_output/www.berkeley.edu", {st_mode=S_IFDIR|0755, st_size=4096, ...}) = 0
stat("/home/bearface/website_output/www.berkeley.edu/style", 0x7ffffe5e1050) = -1 ENOENT (No such file or directory)
mkdir("/home/bearface/website_output/www.berkeley.edu/style", 0777) = 0
open("/home/bearface/website_output/www.berkeley.edu/style/home-wide980.css", O_WRONLY|O_CREAT|O_TRUNC, 0666) = 4
write(2, "Saving to: \342\200\230/home/bearface/web"..., 87) = 87
write(2, "\n", 1)                       = 1
write(2, "\r", 1)                       = 1
write(2, " 0% [                           "..., 79) = 79
select(4, [3], NULL, NULL, {0, 950000}) = 1 (in [3], left {0, 949996})
read(3, "* {\r\n\tpadding:0;\r\n\tmargin:0;\r\n}\r"..., 8192) = 8192
fstat(4, {st_mode=S_IFREG|0644, st_size=0, ...}) = 0
mmap(NULL, 4096, PROT_READ|PROT_WRITE, MAP_PRIVATE|MAP_ANONYMOUS, -1, 0) = 0x7feb0e058000
write(4, "* {\r\n\tpadding:0;\r\n\tmargin:0;\r\n}\r"..., 8192) = 8192
select(4, [3], NULL, NULL, {0, 950000}) = 1 (in [3], left {0, 949997})
read(3, "1 {\r\npadding:4px;\r\nbackground-co"..., 1755) = 1755
write(4, "1 {\r\npadding:4px;\r\nbackground-co"..., 1755) = 1755
write(2, "\r", 1)                       = 1
write(2, "100%[==========================="..., 79) = 79
write(2, "\n\n", 2)                     = 2
close(4)                                = 0
munmap(0x7feb0e058000, 4096)            = 0
stat("/etc/localtime", {st_mode=S_IFREG|0644, st_size=3519, ...}) = 0
utime("/home/bearface/website_output/www.berkeley.edu/style/home-wide980.css", [2014/06/30-12:12:50, 2014/06/04-13:44:36]) = 0
write(2, "2014-06-30 12:12:50 (14.5 MB/s) "..., 129) = 129
open("/home/bearface/website_output/www.berkeley.edu/style/home-wide980.css", O_RDONLY) = 4
fstat(4, {st_mode=S_IFREG|0644, st_size=9947, ...}) = 0
mmap(NULL, 9947, PROT_READ|PROT_WRITE, MAP_PRIVATE, 4, 0) = 0x7feb0e056000
close(4)                                = 0
munmap(0x7feb0e056000, 9947)            = 0
statfs("/home/bearface/website_output/www.berkeley.edu/img/sections", 0x7ffffe5e15c0) = -1 ENOENT (No such file or directory)
statfs("/home/bearface/website_output/www.berkeley.edu/img", 0x7ffffe5e15c0) = -1 ENOENT (No such file or directory)
statfs("/home/bearface/website_output/www.berkeley.edu", {f_type="EXT2_SUPER_MAGIC", f_bsize=4096, f_blocks=59275954, f_bfree=49151586, f_bavail=46134780, f_files=15065088, f_ffree=14788699, f_fsid={533008265, 2108930253}, f_namelen=255, f_frsize=4096}) = 0
stat("/home/bearface/website_output/www.berkeley.edu/img/sections/berkeley-text-brand.gif", 0x7ffffe5e1610) = -1 ENOENT (No such file or directory)
stat("/home/bearface/website_output/www.berkeley.edu/img/sections/berkeley-text-brand.gif", 0x7ffffe5e16a0) = -1 ENOENT (No such file or directory)
statfs("/home/bearface/website_output/www.berkeley.edu/img/sections", 0x7ffffe5e15c0) = -1 ENOENT (No such file or directory)
statfs("/home/bearface/website_output/www.berkeley.edu/img", 0x7ffffe5e15c0) = -1 ENOENT (No such file or directory)
statfs("/home/bearface/website_output/www.berkeley.edu", {f_type="EXT2_SUPER_MAGIC", f_bsize=4096, f_blocks=59275954, f_bfree=49151586, f_bavail=46134780, f_files=15065088, f_ffree=14788699, f_fsid={533008265, 2108930253}, f_namelen=255, f_frsize=4096}) = 0
stat("/home/bearface/website_output/www.berkeley.edu/img/sections/berkeley-text-brand.gif", 0x7ffffe5e1610) = -1 ENOENT (No such file or directory)
nanosleep({1, 0}, 0x7ffffe5e1720)       = 0
stat("/etc/localtime", {st_mode=S_IFREG|0644, st_size=3519, ...}) = 0
write(2, "--2014-06-30 12:12:51--  http://"..., 86) = 86
select(4, [3], NULL, NULL, {0, 1})      = 0 (Timeout)
getpeername(3, {sa_family=AF_INET, sin_port=htons(80), sin_addr=inet_addr("169.229.216.200")}, [16]) = 0
write(2, "Reusing existing connection to w"..., 52) = 52
select(4, NULL, [3], NULL, {900, 0})    = 1 (out [3], left {899, 999991})
write(3, "GET /img/sections/berkeley-text-"..., 181) = 181
write(2, "HTTP request sent, awaiting resp"..., 40) = 40
select(4, [3], NULL, NULL, {900, 0})    = 1 (in [3], left {899, 862004})
recvfrom(3, "HTTP/1.1 200 OK\r\nDate: Mon, 30 J"..., 511, MSG_PEEK, NULL, NULL) = 511
read(3, "HTTP/1.1 200 OK\r\nDate: Mon, 30 J"..., 367) = 367
write(2, "200 OK\n", 7)                 = 7
stat("/home/bearface/website_output/www.berkeley.edu/img/sections/berkeley-text-brand.gif", 0x7ffffe5e1140) = -1 ENOENT (No such file or directory)
write(2, "Length: ", 8)                 = 8
write(2, "10949", 5)                    = 5
write(2, " (11K)", 6)                   = 6
write(2, " [image/gif]\n", 13)          = 13
stat("/home/bearface/website_output/www.berkeley.edu/img/sections", 0x7ffffe5e1130) = -1 ENOENT (No such file or directory)
stat("/home", {st_mode=S_IFDIR|0755, st_size=4096, ...}) = 0
stat("/home/bearface", {st_mode=S_IFDIR|0755, st_size=4096, ...}) = 0
stat("/home/bearface/website_output", {st_mode=S_IFDIR|0755, st_size=4096, ...}) = 0
stat("/home/bearface/website_output/www.berkeley.edu", {st_mode=S_IFDIR|0755, st_size=4096, ...}) = 0
stat("/home/bearface/website_output/www.berkeley.edu/img", 0x7ffffe5e1050) = -1 ENOENT (No such file or directory)
mkdir("/home/bearface/website_output/www.berkeley.edu/img", 0777) = 0
stat("/home/bearface/website_output/www.berkeley.edu/img/sections", 0x7ffffe5e1050) = -1 ENOENT (No such file or directory)
mkdir("/home/bearface/website_output/www.berkeley.edu/img/sections", 0777) = 0
open("/home/bearface/website_output/www.berkeley.edu/img/sections/berkeley-text-brand.gif", O_WRONLY|O_CREAT|O_TRUNC, 0666) = 4
write(2, "Saving to: \342\200\230/home/bearface/web"..., 101) = 101
write(2, "\n", 1)                       = 1
write(2, "\r", 1)                       = 1
write(2, " 0% [                           "..., 79) = 79
select(4, [3], NULL, NULL, {0, 950000}) = 1 (in [3], left {0, 949993})
read(3, "GIF89a\322\0F\0\346\0\0\34 E\345\345\351bd}\34\36DBEb\222\224\245r"..., 8192) = 8192
fstat(4, {st_mode=S_IFREG|0644, st_size=0, ...}) = 0
mmap(NULL, 4096, PROT_READ|PROT_WRITE, MAP_PRIVATE|MAP_ANONYMOUS, -1, 0) = 0x7feb0e058000
