select(4, NULL, [3], NULL, {900, 0})    = 1 (out [3], left {899, 999992})
write(3, "GET /sites/all/modules/lightbox2"..., 238) = 238
write(2, "HTTP request sent, awaiting resp"..., 40) = 40
select(4, [3], NULL, NULL, {900, 0})    = 1 (in [3], left {899, 955565})
recvfrom(3, "HTTP/1.1 200 OK\r\nDate: Mon, 30 J"..., 511, MSG_PEEK, NULL, NULL) = 511
read(3, "HTTP/1.1 200 OK\r\nDate: Mon, 30 J"..., 271) = 271
write(2, "200 OK\n", 7)                 = 7
stat("/home/bearface/website_output/www.utexas.edu/sites/all/modules/lightbox2/images/next.gif", 0x7fff188c2380) = -1 ENOENT (No such file or directory)
write(2, "Length: ", 8)                 = 8
write(2, "305", 3)                      = 3
write(2, " [image/gif]\n", 13)          = 13
stat("/home/bearface/website_output/www.utexas.edu/sites/all/modules/lightbox2/images", {st_mode=S_IFDIR|0755, st_size=4096, ...}) = 0
open("/home/bearface/website_output/www.utexas.edu/sites/all/modules/lightbox2/images/next.gif", O_WRONLY|O_CREAT|O_TRUNC, 0666) = 4
write(2, "Saving to: \342\200\230/home/bearface/web"..., 106) = 106
write(2, "\n", 1)                       = 1
write(2, "\r", 1)                       = 1
write(2, " 0% [                           "..., 79) = 79
select(4, [3], NULL, NULL, {0, 950000}) = 1 (in [3], left {0, 949994})
read(3, "GIF89a-\0-\0\304\20\0\364\364\364\261\261\261bbb\351\351\351\322\322\322\204\204\204m"..., 305) = 305
fstat(4, {st_mode=S_IFREG|0644, st_size=0, ...}) = 0
mmap(NULL, 4096, PROT_READ|PROT_WRITE, MAP_PRIVATE|MAP_ANONYMOUS, -1, 0) = 0x7fa25aace000
write(4, "GIF89a-\0-\0\304\20\0\364\364\364\261\261\261bbb\351\351\351\322\322\322\204\204\204m"..., 305) = 305
write(2, "\r", 1)                       = 1
write(2, "100%[==========================="..., 79) = 79
write(2, "\n\n", 2)                     = 2
close(4)                                = 0
munmap(0x7fa25aace000, 4096)            = 0
stat("/etc/localtime", {st_mode=S_IFREG|0644, st_size=3519, ...}) = 0
utime("/home/bearface/website_output/www.utexas.edu/sites/all/modules/lightbox2/images/next.gif", [2014/06/30-12:11:50, 2006/04/18-16:41:51]) = 0
write(2, "2014-06-30 12:11:50 (1.14 MB/s) "..., 146) = 146
statfs("/home/bearface/website_output/www.utexas.edu/sites/all/modules/lightbox2/images", {f_type="EXT2_SUPER_MAGIC", f_bsize=4096, f_blocks=59275954, f_bfree=49152171, f_bavail=46135365, f_files=15065088, f_ffree=14788754, f_fsid={533008265, 2108930253}, f_namelen=255, f_frsize=4096}) = 0
stat("/home/bearface/website_output/www.utexas.edu/sites/all/modules/lightbox2/images/prev_hover.gif", 0x7fff188c2850) = -1 ENOENT (No such file or directory)
stat("/home/bearface/website_output/www.utexas.edu/sites/all/modules/lightbox2/images/prev_hover.gif", 0x7fff188c28e0) = -1 ENOENT (No such file or directory)
statfs("/home/bearface/website_output/www.utexas.edu/sites/all/modules/lightbox2/images", {f_type="EXT2_SUPER_MAGIC", f_bsize=4096, f_blocks=59275954, f_bfree=49152171, f_bavail=46135365, f_files=15065088, f_ffree=14788754, f_fsid={533008265, 2108930253}, f_namelen=255, f_frsize=4096}) = 0
stat("/home/bearface/website_output/www.utexas.edu/sites/all/modules/lightbox2/images/prev_hover.gif", 0x7fff188c2850) = -1 ENOENT (No such file or directory)
nanosleep({1, 0}, 0x7fff188c2960)       = 0
stat("/etc/localtime", {st_mode=S_IFREG|0644, st_size=3519, ...}) = 0
write(2, "--2014-06-30 12:11:51--  http://"..., 97) = 97
select(4, [3], NULL, NULL, {0, 1})      = 0 (Timeout)
getpeername(3, {sa_family=AF_INET, sin_port=htons(80), sin_addr=inet_addr("128.83.40.144")}, [16]) = 0
write(2, "Reusing existing connection to w"..., 50) = 50
select(4, NULL, [3], NULL, {900, 0})    = 1 (out [3], left {899, 999996})
write(3, "GET /sites/all/modules/lightbox2"..., 244) = 244
write(2, "HTTP request sent, awaiting resp"..., 40) = 40
select(4, [3], NULL, NULL, {900, 0})    = 1 (in [3], left {899, 944702})
recvfrom(3, "HTTP/1.1 200 OK\r\nDate: Mon, 30 J"..., 511, MSG_PEEK, NULL, NULL) = 271
read(3, "HTTP/1.1 200 OK\r\nDate: Mon, 30 J"..., 271) = 271
write(2, "200 OK\n", 7)                 = 7
stat("/home/bearface/website_output/www.utexas.edu/sites/all/modules/lightbox2/images/prev_hover.gif", 0x7fff188c2380) = -1 ENOENT (No such file or directory)
write(2, "Length: ", 8)                 = 8
write(2, "277", 3)                      = 3
write(2, " [image/gif]\n", 13)          = 13
stat("/home/bearface/website_output/www.utexas.edu/sites/all/modules/lightbox2/images", {st_mode=S_IFDIR|0755, st_size=4096, ...}) = 0
open("/home/bearface/website_output/www.utexas.edu/sites/all/modules/lightbox2/images/prev_hover.gif", O_WRONLY|O_CREAT|O_TRUNC, 0666) = 4
write(2, "Saving to: \342\200\230/home/bearface/web"..., 112) = 112
write(2, "\n", 1)                       = 1
write(2, "\r", 1)                       = 1
write(2, " 0% [                           "..., 79) = 79
select(4, [3], NULL, NULL, {0, 950000}) = 1 (in [3], left {0, 949996})
read(3, "GIF89a-\0-\0\204\17\0\261\261\261bbb\364\364\364mmm\322\322\322\335\335\335\204"..., 277) = 277
fstat(4, {st_mode=S_IFREG|0644, st_size=0, ...}) = 0
mmap(NULL, 4096, PROT_READ|PROT_WRITE, MAP_PRIVATE|MAP_ANONYMOUS, -1, 0) = 0x7fa25aace000
write(4, "GIF89a-\0-\0\204\17\0\261\261\261bbb\364\364\364mmm\322\322\322\335\335\335\204"..., 277) = 277
write(2, "\r", 1)                       = 1
write(2, "100%[==========================="..., 79) = 79
write(2, "\n\n", 2)                     = 2
close(4)                                = 0
munmap(0x7fa25aace000, 4096)            = 0
stat("/etc/localtime", {st_mode=S_IFREG|0644, st_size=3519, ...}) = 0
utime("/home/bearface/website_output/www.utexas.edu/sites/all/modules/lightbox2/images/prev_hover.gif", [2014/06/30-12:11:51, 2007/10/05-10:21:32]) = 0
write(2, "2014-06-30 12:11:51 (1.90 MB/s) "..., 152) = 152
statfs("/home/bearface/website_output/www.utexas.edu/sites/all/modules/lightbox2/images", {f_type="EXT2_SUPER_MAGIC", f_bsize=4096, f_blocks=59275954, f_bfree=49152165, f_bavail=46135359, f_files=15065088, f_ffree=14788753, f_fsid={533008265, 2108930253}, f_namelen=255, f_frsize=4096}) = 0
stat("/home/bearface/website_output/www.utexas.edu/sites/all/modules/lightbox2/images/next_hover.gif", 0x7fff188c2850) = -1 ENOENT (No such file or directory)
stat("/home/bearface/website_output/www.utexas.edu/sites/all/modules/lightbox2/images/next_hover.gif", 0x7fff188c28e0) = -1 ENOENT (No such file or directory)
statfs("/home/bearface/website_output/www.utexas.edu/sites/all/modules/lightbox2/images", {f_type="EXT2_SUPER_MAGIC", f_bsize=4096, f_blocks=59275954, f_bfree=49152164, f_bavail=46135358, f_files=15065088, f_ffree=14788753, f_fsid={533008265, 2108930253}, f_namelen=255, f_frsize=4096}) = 0
