write(4, "v\" role=\"navigation\" data-click-"..., 1380) = 1380
select(4, [3], NULL, NULL, {0, 950000}) = 1 (in [3], left {0, 949933})
read(3, "   <li><a href=\"http://www.corne"..., 8192) = 1380
write(4, "   <li><a href=\"http://www.corne"..., 1380) = 1380
select(4, [3], NULL, NULL, {0, 950000}) = 1 (in [3], left {0, 927078})
read(3, "           <li><a href=\"http://w"..., 8192) = 1380
write(4, "           <li><a href=\"http://w"..., 1380) = 1380
select(4, [3], NULL, NULL, {0, 950000}) = 1 (in [3], left {0, 949997})
read(3, " <li><a href=\"/academics/fields."..., 8192) = 2760
write(4, " <li><a href=\"/academics/fields."..., 2760) = 2760
select(4, [3], NULL, NULL, {0, 950000}) = 1 (in [3], left {0, 949997})
read(3, "   </div>\n      \n          <ul c"..., 8192) = 1380
write(4, "   </div>\n      \n          <ul c"..., 1380) = 1380
select(4, [3], NULL, NULL, {0, 950000}) = 1 (in [3], left {0, 949389})
read(3, "div class=\"submenu\" data-click-a"..., 8192) = 1380
write(4, "div class=\"submenu\" data-click-a"..., 1380) = 1380
select(4, [3], NULL, NULL, {0, 950000}) = 1 (in [3], left {0, 949997})
read(3, "menu-trigger\" href=\"/_includes/h"..., 8192) = 1380
write(4, "menu-trigger\" href=\"/_includes/h"..., 1380) = 1380
select(4, [3], NULL, NULL, {0, 950000}) = 1 (in [3], left {0, 949997})
read(3, "ee\"> \n\n    \n\t\t\t<span class=\"marq"..., 8192) = 1531
write(4, "ee\"> \n\n    \n\t\t\t<span class=\"marq"..., 1531) = 1531
select(4, [3], NULL, NULL, {0, 950000}) = 1 (in [3], left {0, 927477})
read(3, "E23-B2D3-A734-061F4174BD6D2D44|H"..., 8192) = 1380
write(4, "E23-B2D3-A734-061F4174BD6D2D44|H"..., 1380) = 1380
select(4, [3], NULL, NULL, {0, 950000}) = 1 (in [3], left {0, 949997})
read(3, "=\"https://www.cornell.edu/assets"..., 8192) = 1380
write(4, "=\"https://www.cornell.edu/assets"..., 1380) = 1380
select(4, [3], NULL, NULL, {0, 950000}) = 1 (in [3], left {0, 949997})
read(3, "ainer\">\n\t\t\t        <div class=\"m"..., 8192) = 2760
write(4, "ainer\">\n\t\t\t        <div class=\"m"..., 2760) = 2760
select(4, [3], NULL, NULL, {0, 950000}) = 1 (in [3], left {0, 949909})
read(3, "ick-action=\"news | more\" data-cl"..., 8192) = 1380
write(4, "ick-action=\"news | more\" data-cl"..., 1380) = 1380
select(4, [3], NULL, NULL, {0, 950000}) = 1 (in [3], left {0, 949997})
read(3, "ch/people.cfm\">Directory Search<"..., 8192) = 2760
write(4, "ch/people.cfm\">Directory Search<"..., 2760) = 2760
select(4, [3], NULL, NULL, {0, 950000}) = 1 (in [3], left {0, 949997})
read(3, "3F9-1EEB243748263019||Rawlings S"..., 8192) = 1380
write(4, "3F9-1EEB243748263019||Rawlings S"..., 1380) = 1380
select(4, [3], NULL, NULL, {0, 950000}) = 1 (in [3], left {0, 949182})
read(3, "events | more\" data-click-label="..., 8192) = 1380
write(4, "events | more\" data-click-label="..., 1380) = 1380
select(4, [3], NULL, NULL, {0, 950000}) = 1 (in [3], left {0, 949997})
read(3, "data-click-label=\"2|B3452FBF-D25"..., 8192) = 1380
write(4, "data-click-label=\"2|B3452FBF-D25"..., 1380) = 1380
select(4, [3], NULL, NULL, {0, 950000}) = 1 (in [3], left {0, 949998})
read(3, "gins\" itemprop=\"name\" title=\"Cou"..., 8192) = 2760
write(4, "gins\" itemprop=\"name\" title=\"Cou"..., 2760) = 2760
select(4, [3], NULL, NULL, {0, 950000}) = 1 (in [3], left {0, 949998})
read(3, "ilter-value=\"CBC0875D-FE63-AF24-"..., 8192) = 1380
write(4, "ilter-value=\"CBC0875D-FE63-AF24-"..., 1380) = 1380
select(4, [3], NULL, NULL, {0, 950000}) = 1 (in [3], left {0, 949998})
read(3, "k-action=\"around the u | apply f"..., 8192) = 2760
write(4, "k-action=\"around the u | apply f"..., 2760) = 2760
select(4, [3], NULL, NULL, {0, 950000}) = 1 (in [3], left {0, 949953})
read(3, "pply filter\" data-filter-value=\""..., 8192) = 1380
write(4, "pply filter\" data-filter-value=\""..., 1380) = 1380
select(4, [3], NULL, NULL, {0, 950000}) = 1 (in [3], left {0, 927773})
read(3, "C2B6|You Can Make It Happen: cre"..., 8192) = 1380
write(4, "C2B6|You Can Make It Happen: cre"..., 1380) = 1380
select(4, [3], NULL, NULL, {0, 950000}) = 1 (in [3], left {0, 949996})
read(3, "n gifts\" in support of sustainab"..., 8192) = 4140
write(4, "n gifts\" in support of sustainab"..., 4096) = 4096
write(4, "es Stout</h4>\n          </div>\n "..., 44) = 44
select(4, [3], NULL, NULL, {0, 950000}) = 1 (in [3], left {0, 949996})
read(3, ">\n        <div class=\"hc-rollove"..., 8192) = 2760
write(4, ">\n        <div class=\"hc-rollove"..., 2760) = 2760
select(4, [3], NULL, NULL, {0, 950000}) = 1 (in [3], left {0, 949998})
read(3, "E94E7E19EAEF5EE|CBC08645-B8BD-C1"..., 8192) = 1380
write(4, "E94E7E19EAEF5EE|CBC08645-B8BD-C1"..., 1380) = 1380
select(4, [3], NULL, NULL, {0, 950000}) = 1 (in [3], left {0, 949998})
read(3, "ted</p>\n            <div class=\""..., 8192) = 2760
write(4, "ted</p>\n            <div class=\""..., 2760) = 2760
select(4, [3], NULL, NULL, {0, 950000}) = 1 (in [3], left {0, 949948})
