write(4, "\334\267=\273\211\266G\327\321\366\350F\372\271\352X\332\354\215\10\231`\207\332\336S\241U\333y\334\\"..., 1368) = 1368
select(4, [3], NULL, NULL, {0, 950000}) = 1 (in [3], left {0, 949056})
read(3, "\265wW\335\376 \275\311\211\324\365P\5\1\0\0\0\0\0vC\255\262\307X\272\353&\322\355N\246"..., 8192) = 1352
write(4, "\265wW\335\376 \275\311\211\324\365P\5\1\0\0\0\0\0vC\255\262\307X\272\353&\322\355N\246"..., 1352) = 1352
select(4, [3], NULL, NULL, {0, 950000}) = 1 (in [3], left {0, 949919})
read(3, "\347\235w^:\235N\31\31\31\311'?\371\311\354\267\337~Y\275zu\222d0\30\24%\4\0\0"..., 8192) = 1368
write(4, "\347\235w^:\235N\31\31\31\311'?\371\311\354\267\337~Y\275zu\222d0\30\24%\4\0\0"..., 1368) = 1368
select(4, [3], NULL, NULL, {0, 950000}) = 1 (in [3], left {0, 949998})
read(3, "~%Y\374\322\34\265O\222\356\325\271\344\337\223\347\34\377\260\255~\240\203\366\352\344\344_\373_y\324"..., 8192) = 1368
write(4, "~%Y\374\322\34\265O\222\356\325\271\344\337\223\347\34\377\260\255~\240\203\366\352\344\344_\373_y\324"..., 1368) = 1368
select(4, [3], NULL, NULL, {0, 950000}) = 1 (in [3], left {0, 948915})
read(3, "\217_\222$Yu\355\267sSN\313\343\17\33OLi\372\261\0\0 \0IDAT\312M\371\177"..., 8192) = 2736
write(4, "\217_\222$Yu\355\267sSN\313\343\17\33OLi\372\261\0\0 \0IDAT\312M\371\177"..., 2736) = 2736
select(4, [3], NULL, NULL, {0, 950000}) = 1 (in [3], left {0, 919803})
read(3, "T\252\f\0\0\0\0\0\260\213i\375\3729g\37;\34\16\27\337z\353\255\347\264Z\255TU53"..., 8192) = 1368
write(4, "T\252\f\0\0\0\0\0\260\213i\375\3729g\37;\34\16\27\337z\353\255\347\264Z\255TU53"..., 1368) = 1368
select(4, [3], NULL, NULL, {0, 950000}) = 1 (in [3], left {0, 949933})
read(3, "\207\343\31\233l2\34Y\237\301\330HF[\355t&\6i\17\27\244\277\270\223\265\355\311\214\326cI"..., 8192) = 1352
write(4, "\207\343\31\233l2\34Y\237\301\330HF[\355t&\6i\17\27\244\277\270\223\265\355\311\214\326cI"..., 1352) = 1352
select(4, [3], NULL, NULL, {0, 950000}) = 1 (in [3], left {0, 949562})
read(3, "\354Y!\3233\315\316\316f\353\326\255\231L&\31\217\307IR\224\21\0\0\0\0\0`c\31v]"..., 8192) = 1368
write(4, "\354Y!\3233\315\316\316f\353\326\255\231L&\31\217\307IR\224\21\0\0\0\0\0`c\31v]"..., 1368) = 1368
select(4, [3], NULL, NULL, {0, 950000}) = 1 (in [3], left {0, 949997})
read(3, "J\226\272\262\272\261\351\f\vm\362\340b\237\266/\31\366\311b1.\17\0\0\0\0\0`\275\32&"..., 8192) = 1368
write(4, "J\226\272\262\272\261\351\f\vm\362\340b\237\266/\31\366\311b1.\17\0\0\0\0\0`\275\32&"..., 1368) = 1368
select(4, [3], NULL, NULL, {0, 950000}) = 1 (in [3], left {0, 949028})
read(3, "\217I'\23\0\0\0\0\0\300:5L\222\276\357\327:\217Vw0=\362\310#\331\275j\200\342\217"..., 8192) = 1368
write(4, "\217I'\23\0\0\0\0\0\300:5L\222\276\357\327:\217Vw0=\362\310#\331\275j\200\342\217"..., 1368) = 1368
select(4, [3], NULL, NULL, {0, 950000}) = 1 (in [3], left {0, 949563})
read(3, "i\273&I\257\202\0\0\0\0\0\0\33P\235$]\333e\241-)\245\244/\311G\2174g\204L"..., 8192) = 1368
write(4, "i\273&I\257\202\0\0\0\0\0\0\33P\235$]\333e\241-)\245\244/\311G\2174g\204L"..., 1368) = 1368
select(4, [3], NULL, NULL, {0, 950000}) = 1 (in [3], left {0, 949998})
read(3, "\316A\263\263\263\225*\0\0\0\0\0\300\271\251N\222SA\23\2343\4L\0\0\0\0\0pn;"..., 8192) = 1368
write(4, "\316A\263\263\263\225*\0\0\0\0\0\300\271\251N\222SA\23\2343\4L\0\0\0\0\0pn;"..., 1368) = 1368
select(4, [3], NULL, NULL, {0, 950000}) = 1 (in [3], left {0, 949997})
read(3, "\37\371\307\351\216\237H9>\237\301\17\377p\252\235;3\271\365\326LW%\345\360\23\31\317L\247\251"..., 8192) = 1352
write(4, "\37\371\307\351\216\237H9>\237\301\17\377p\252\235;3\271\365\326LW%\345\360\23\31\317L\247\251"..., 1352) = 1352
select(4, [3], NULL, NULL, {0, 950000}) = 1 (in [3], left {0, 949997})
read(3, "\0\0\353\3230\311Z\2604\231LRUUJ)\231L&\231\236\236N]\327\231\236\236\316\266m\333"..., 8192) = 2736
write(4, "\0\0\353\3230\311Z\2604\231LRUUJ)\231L&\231\236\236N]\327\231\236\236\316\266m\333"..., 2736) = 2736
select(4, [3], NULL, NULL, {0, 950000}) = 1 (in [3], left {0, 949943})
read(3, "\265\32$UuRW\251R\237\226@T\251\252\225\37\252N\225R\252TU\3113\342\214\265\277\320\312"..., 8192) = 1368
write(4, "\265\32$UuRW\251R\237\226@T\251\252\225\37\252N\225R\252TU\3113\342\214\265\277\320\312"..., 1368) = 1368
select(4, [3], NULL, NULL, {0, 950000}) = 1 (in [3], left {0, 949997})
read(3, "\16\271:aW\235\33y\323\n\320:UB\336\273\315\346\215j\266\324\317\37\312\343\272;\327\255\377\272"..., 8192) = 1368
write(4, "\16\271:aW\235\33y\323\n\320:UB\336\273\315\346\215j\266\324\317\37\312\343\272;\327\255\377\272"..., 1368) = 1368
select(4, [3], NULL, NULL, {0, 950000}) = 1 (in [3], left {0, 949437})
read(3, "\212^\315>\212\355\251\252 \242\371\266\16\256\202wj\203\352\312\235\330\6<^\317[R\347\365\2722"..., 8192) = 1368
write(4, "\212^\315>\212\355\251\252 \242\371\266\16\256\202wj\203\352\312\235\330\6<^\317[R\347\365\2722"..., 1368) = 1368
select(4, [3], NULL, NULL, {0, 950000}) = 1 (in [3], left {0, 949997})
read(3, "W7\343\235\252.\371\304<\247\272\37c}\377f\262\20:k\30\370\r\5\0\0\0\0\0\0\0`"..., 8192) = 1352
write(4, "W7\343\235\252.\371\304<\247\272\37c}\377f\262\20:k\30\370\r\5\0\0\0\0\0\0\0`"..., 1352) = 1352
select(4, [3], NULL, NULL, {0, 950000}) = 1 (in [3], left {0, 949997})
read(3, "\274\363l\325b\372\311\225O\365\177\r\353\207[\325\2437y\235M\324\34\325-\1\353\271Mm{?"..., 8192) = 2736
write(4, "\274\363l\325b\372\311\225O\365\177\r\353\207[\325\2437y\235M\324\34\325-\1\353\271Mm{?"..., 2736) = 2736
select(4, [3], NULL, NULL, {0, 950000}) = 1 (in [3], left {0, 949942})
read(3, "\0\0\0\0\0V\217\364\241\207\36\272tzzZ\227^zi\261y\363\346\244(\212:0\352\266\322"..., 8192) = 1368
write(4, "\0\0\0\0\0V\217\364\241\207\36\272tzzZ\227^zi\261y\363\346\244(\212:0\352\266\322"..., 1368) = 1368
select(4, [3], NULL, NULL, {0, 950000}) = 1 (in [3], left {0, 949998})
read(3, "\322\3220M\323BRV\24E\226\347y\36c\314\315,3\263<\306\230W\33323\313\223$\311B"..., 8192) = 1368
write(4, "\322\3220M\323BRV\24E\226\347y\36c\314\315,3\263<\306\230W\33323\313\223$\311B"..., 1368) = 1368
select(4, [3], NULL, NULL, {0, 950000}) = 1 (in [3], left {0, 949997})
read(3, "\325UW)\306\250\35;v\274b\310\364J\347\331\263g\317)\237\361T\6\203\201\206\303\241\314L\343"..., 8192) = 2720
write(4, "\325UW)\306\250\35;v\274b\310\364J\347\331\263g\317)\237\361T\6\203\201\206\303\241\314L\343"..., 2720) = 2720
select(4, [3], NULL, NULL, {0, 950000}) = 1 (in [3], left {0, 949934})
read(3, "{R\365\323h4\352\235\17\0\0\0\0\0\0\0\0\0\253G\220\312\220\251\16\205\362<W\214Q?"..., 8192) = 1368
write(4, "{R\365\323h4\352\235\17\0\0\0\0\0\0\0\0\0\253G\220\312\220\251\16\205\362<W\214Q?"..., 1368) = 1368
select(4, [3], NULL, NULL, {0, 950000}) = 1 (in [3], left {0, 949997})
read(3, "#\r~\206\262\341\224\216\345A\321sEwE\213\262P\206\36\241\210*\22S\f\246 )\216\243\246"..., 8192) = 1368
write(4, "#\r~\206\262\341\224\216\345A\321sEwE\213\262P\206\36\241\210*\22S\f\246 )\216\243\246"..., 1368) = 1368
select(4, [3], NULL, NULL, {0, 950000}) = 1 (in [3], left {0, 949457})
read(3, "2\332F\3605\303\364\10K.o\324\361\344\215\313m\4<[z\326=\225G\214&+\364\263U\332"..., 8192) = 1368
write(4, "2\332F\3605\303\364\10K.o\324\361\344\215\313m\4<[z\326=\225G\214&+\364\263U\332"..., 1368) = 1368
select(4, [3], NULL, NULL, {0, 950000}) = 1 (in [3], left {0, 949997})
read(3, "\373\357ce\3321/\3\t\307\340\266\254\371\264Qa\244EP\25J)\204\252f\32\7\226\303\30\301"..., 8192) = 1368
