getpeername(3, {sa_family=AF_INET, sin_port=htons(80), sin_addr=inet_addr("128.122.119.202")}, [16]) = 0
write(2, "Reusing existing connection to w"..., 47) = 47
select(4, NULL, [3], NULL, {900, 0})    = 1 (out [3], left {899, 999994})
write(3, "GET /content/dam/nyu/nyuToday/im"..., 250) = 250
write(2, "HTTP request sent, awaiting resp"..., 40) = 40
select(4, [3], NULL, NULL, {900, 0})    = 1 (in [3], left {899, 957060})
recvfrom(3, "HTTP/1.1 200 OK\r\nDate: Mon, 30 J"..., 511, MSG_PEEK, NULL, NULL) = 511
read(3, "HTTP/1.1 200 OK\r\nDate: Mon, 30 J"..., 366) = 366
write(2, "200 OK\n", 7)                 = 7
stat("/home/bearface/website_output/www.nyu.edu/content/dam/nyu/nyuToday/images/homepage/home-2014-0626-30JayStreet-v2.png", {st_mode=S_IFREG|0644, st_size=553702, ...}) = 0
write(2, "Length: ", 8)                 = 8
write(2, "553702", 6)                   = 6
write(2, " (541K)", 7)                  = 7
write(2, " [image/png]\n", 13)          = 13
stat("/home/bearface/website_output/www.nyu.edu/content/dam/nyu/nyuToday/images/homepage", {st_mode=S_IFDIR|0755, st_size=4096, ...}) = 0
open("/home/bearface/website_output/www.nyu.edu/content/dam/nyu/nyuToday/images/homepage/home-2014-0626-30JayStreet-v2.png", O_WRONLY|O_CREAT|O_TRUNC, 0666) = 4
write(2, "Saving to: \342\200\230/home/bearface/web"..., 134) = 134
write(2, "\n", 1)                       = 1
write(2, "\r", 1)                       = 1
write(2, " 0% [                           "..., 79) = 79
select(4, [3], NULL, NULL, {0, 950000}) = 1 (in [3], left {0, 949993})
read(3, "\211PNG\r\n\32\n\0\0\0\rIHDR\0\0\3\300\0\0\0014\10\2\0\0\0l(\315"..., 8192) = 8192
fstat(4, {st_mode=S_IFREG|0644, st_size=0, ...}) = 0
mmap(NULL, 4096, PROT_READ|PROT_WRITE, MAP_PRIVATE|MAP_ANONYMOUS, -1, 0) = 0x7f6a77ed4000
write(4, "\211PNG\r\n\32\n\0\0\0\rIHDR\0\0\3\300\0\0\0014\10\2\0\0\0l(\315"..., 8192) = 8192
select(4, [3], NULL, NULL, {0, 950000}) = 1 (in [3], left {0, 949996})
read(3, "uvkF\277\205\0\254O\273\321\351,\353pM\31\335\6\317\250aD\256\330\330\366R\35\376\3627"..., 8192) = 8192
write(4, "uvkF\277\205\0\254O\273\321\351,\353pM\31\335\6\317\250aD\256\330\330\366R\35\376\3627"..., 4096) = 4096
write(4, "\220\376\375\337\376#\16/\264/@\322\344h\311\325p\17\346eXr\2\f\301\364\3070\365\300\262\363"..., 4096) = 4096
select(4, [3], NULL, NULL, {0, 950000}) = 1 (in [3], left {0, 949997})
read(3, "\316\" \244\21\334\27o\256L\355\226{0\22>\270\354]_\232\32\204\262\316\217\254\343I\343JF"..., 8192) = 3850
write(4, "\316\" \244\21\334\27o\256L\355\226{0\22>\270\354]_\232\32\204\262\316\217\254\343I\343JF"..., 3850) = 3850
select(4, [3], NULL, NULL, {0, 950000}) = 1 (in [3], left {0, 949996})
read(3, "\223\230\23I\230\240\217#e\362\343\341\375s7\274\366\rppm\252\21n\313\333\215_\310TJl"..., 8192) = 2736
write(4, "\223\230\23I\230\240\217#e\362\343\341\375s7\274\366\rppm\252\21n\313\333\215_\310TJl"..., 2736) = 2736
select(4, [3], NULL, NULL, {0, 950000}) = 1 (in [3], left {0, 949995})
read(3, "<\204\325\203\232\361\345\255\271\335\222YA\326\31\335H)\220\247$\372\361\354\224\272`\0d\245\336\267"..., 8192) = 1368
write(4, "<\204\325\203\232\361\345\255\271\335\222YA\326\31\335H)\220\247$\372\361\354\224\272`\0d\245\336\267"..., 1368) = 1368
select(4, [3], NULL, NULL, {0, 950000}) = 1 (in [3], left {0, 949997})
read(3, "\301.Ic\33\245\325\376P\226\360\251<\352\17\265\264:\243\337\330o\244h\312H\237y\350\204&n"..., 8192) = 1368
write(4, "\301.Ic\33\245\325\376P\226\360\251<\352\17\265\264:\243\337\330o\244h\312H\237y\350\204&n"..., 1368) = 1368
select(4, [3], NULL, NULL, {0, 950000}) = 1 (in [3], left {0, 949997})
read(3, "h\231\251\3048\272\341\332\247xy\246m\3678\356\16u[\277\36\16/%\36\367\323\240\243\353n\20"..., 8192) = 1368
write(4, "h\231\251\3048\272\341\332\247xy\246m\3678\356\16u[\277\36\16/%\36\367\323\240\243\353n\20"..., 1368) = 1368
select(4, [3], NULL, NULL, {0, 950000}) = 1 (in [3], left {0, 949997})
read(3, "\315N\212\213\3235qy\344!\306\364k\30\246>%\n~\240\343\347\20223r\275\37\343x\277\230"..., 8192) = 2736
write(4, "\315N\212\213\3235qy\344!\306\364k\30\246>%\n~\240\343\347\20223r\275\37\343x\277\230"..., 2736) = 2736
select(4, [3], NULL, NULL, {0, 950000}) = 1 (in [3], left {0, 949997})
read(3, "t\340W\230\304\235\321\262i\6F\261\320\322\272\215\31\241^\36Z\203\330\232\354\330\274!UKO "..., 8192) = 1368
write(4, "t\340W\230\304\235\321\262i\6F\261\320\322\272\215\31\241^\36Z\203\330\232\354\330\274!UKO "..., 1368) = 1368
select(4, [3], NULL, NULL, {0, 950000}) = 1 (in [3], left {0, 903005})
read(3, "Op\326f\372;\313\337R+\262z\233\224\257\215a\5\7f:\241\220\352\271\264\326M\336\244\276\360"..., 8192) = 2736
write(4, "Op\326f\372;\313\337R+\262z\233\224\257\215a\5\7f:\241\220\352\271\264\326M\336\244\276\360"..., 2736) = 2736
select(4, [3], NULL, NULL, {0, 950000}) = 1 (in [3], left {0, 949993})
read(3, "\2512\305\364e[\363\2\304\212\330\332Nt\230H\340}\223\304\233\364\340\271j\323\325\316=\301-$"..., 8192) = 8192
write(4, "\2512\305\364e[\363\2\304\212\330\332Nt\230H\340}\223\304\233\364\340\271j\323\325\316=\301-$"..., 4096) = 4096
write(4, "jt\206\326 2\31\247y\247D(5\341\10\355\274\234\311?\2121\214\31\341\3523bp;CV"..., 4096) = 4096
select(4, [3], NULL, NULL, {0, 950000}) = 1 (in [3], left {0, 949994})
read(3, "\226\7\357\"0\231\324\205\204Y\373}\2603\vL\0175\337\324*C\204\377t\237\3630\361\30\201Y"..., 8192) = 6856
write(4, "\226\7\357\"0\231\324\205\204Y\373}\2603\vL\0175\337\324*C\204\377t\237\3630\361\30\201Y"..., 4096) = 4096
write(4, "\202\343\233\214}J\tU\10\323W\222\200\250\213N\327y\353#\30\304J\201\332\304\313\205\335\225\345\4"..., 2760) = 2760
select(4, [3], NULL, NULL, {0, 950000}) = 1 (in [3], left {0, 949996})
read(3, "\357\2\364=\327\314\220\2336QK\255+\201\227\326\332\361ze\210\310\342\376\215|\257\356\260\31\33\260"..., 8192) = 5472
write(4, "\357\2\364=\327\314\220\2336QK\255+\201\227\326\332\361ze\210\310\342\376\215|\257\356\260\31\33\260"..., 4096) = 4096
write(4, "O;\257\0j\203\257[\22V.\266`IS\341\226\236*\nt\nH\326\330\361\6\272\350\354\3716"..., 1376) = 1376
select(4, [3], NULL, NULL, {0, 950000}) = 1 (in [3], left {0, 949997})
read(3, "\312\305C\354\262\316\v\266\274\202\265\247\5\340[\21zs.\23J\327Q\265C\200e\250\242\374\3266"..., 8192) = 2736
write(4, "\312\305C\354\262\316\v\266\274\202\265\247\5\340[\21zs.\23J\327Q\265C\200e\250\242\374\3266"..., 2736) = 2736
select(4, [3], NULL, NULL, {0, 950000}) = 1 (in [3], left {0, 949997})
read(3, "\371\355\265\324+\300\243\265G\211\226\301\302\3308\3313D&\374w\222\346\372\246\337\271\275\265B6\332"..., 8192) = 2736
write(4, "\371\355\265\324+\300\243\265G\211\226\301\302\3308\3313D&\374w\222\346\372\246\337\271\275\265B6\332"..., 2736) = 2736
select(4, [3], NULL, NULL, {0, 950000}) = 1 (in [3], left {0, 949997})
read(3, "\266*\33@\31s\217\306m\264\245\330\231R\321n\262\255\324t\215\\\356e\2\10A\272\6h\266\264"..., 8192) = 1368
write(4, "\266*\33@\31s\217\306m\264\245\330\231R\321n\262\255\324t\215\\\356e\2\10A\272\6h\266\264"..., 1368) = 1368
select(4, [3], NULL, NULL, {0, 950000}) = 1 (in [3], left {0, 949997})
