munmap(0x7f6a77ed4000, 4096)            = 0
stat("/etc/localtime", {st_mode=S_IFREG|0644, st_size=3519, ...}) = 0
utime("/home/bearface/website_output/www.nyu.edu/common/images/carousel/bgCarouselTop.gif", [2014/06/30-12:10:02, 2014/02/21-16:48:09]) = 0
write(2, "2014-06-30 12:10:02 (7.63 MB/s) "..., 140) = 140
statfs("/home/bearface/website_output/www.nyu.edu/common/images/carousel", {f_type="EXT2_SUPER_MAGIC", f_bsize=4096, f_blocks=59275954, f_bfree=49157755, f_bavail=46140949, f_files=15065088, f_ffree=14788917, f_fsid={533008265, 2108930253}, f_namelen=255, f_frsize=4096}) = 0
stat("/home/bearface/website_output/www.nyu.edu/common/images/carousel/bgCarouselLeft.png", {st_mode=S_IFREG|0644, st_size=543, ...}) = 0
lstat("/home/bearface/website_output/www.nyu.edu/common/images/carousel/bgCarouselLeft.png", {st_mode=S_IFREG|0644, st_size=543, ...}) = 0
stat("/home/bearface/website_output/www.nyu.edu/common/images/carousel/bgCarouselLeft.png", {st_mode=S_IFREG|0644, st_size=543, ...}) = 0
statfs("/home/bearface/website_output/www.nyu.edu/common/images/carousel", {f_type="EXT2_SUPER_MAGIC", f_bsize=4096, f_blocks=59275954, f_bfree=49157755, f_bavail=46140949, f_files=15065088, f_ffree=14788917, f_fsid={533008265, 2108930253}, f_namelen=255, f_frsize=4096}) = 0
stat("/home/bearface/website_output/www.nyu.edu/common/images/carousel/bgCarouselLeft.png", {st_mode=S_IFREG|0644, st_size=543, ...}) = 0
lstat("/home/bearface/website_output/www.nyu.edu/common/images/carousel/bgCarouselLeft.png", {st_mode=S_IFREG|0644, st_size=543, ...}) = 0
nanosleep({1, 0}, 0x7fff7afecca0)       = 0
stat("/etc/localtime", {st_mode=S_IFREG|0644, st_size=3519, ...}) = 0
write(2, "--2014-06-30 12:10:03--  http://"..., 86) = 86
select(4, [3], NULL, NULL, {0, 1})      = 0 (Timeout)
getpeername(3, {sa_family=AF_INET, sin_port=htons(80), sin_addr=inet_addr("128.122.119.202")}, [16]) = 0
write(2, "Reusing existing connection to w"..., 47) = 47
select(4, NULL, [3], NULL, {900, 0})    = 1 (out [3], left {899, 999993})
write(3, "GET /common/images/carousel/bgCa"..., 240) = 240
write(2, "HTTP request sent, awaiting resp"..., 40) = 40
select(4, [3], NULL, NULL, {900, 0})    = 1 (in [3], left {899, 965552})
recvfrom(3, "HTTP/1.1 200 OK\r\nDate: Mon, 30 J"..., 511, MSG_PEEK, NULL, NULL) = 511
read(3, "HTTP/1.1 200 OK\r\nDate: Mon, 30 J"..., 361) = 361
write(2, "200 OK\n", 7)                 = 7
stat("/home/bearface/website_output/www.nyu.edu/common/images/carousel/bgCarouselLeft.png", {st_mode=S_IFREG|0644, st_size=543, ...}) = 0
write(2, "Length: ", 8)                 = 8
write(2, "543", 3)                      = 3
write(2, " [image/png]\n", 13)          = 13
stat("/home/bearface/website_output/www.nyu.edu/common/images/carousel", {st_mode=S_IFDIR|0755, st_size=4096, ...}) = 0
open("/home/bearface/website_output/www.nyu.edu/common/images/carousel/bgCarouselLeft.png", O_WRONLY|O_CREAT|O_TRUNC, 0666) = 4
write(2, "Saving to: \342\200\230/home/bearface/web"..., 101) = 101
write(2, "\n", 1)                       = 1
write(2, "\r", 1)                       = 1
write(2, " 0% [                           "..., 79) = 79
select(4, [3], NULL, NULL, {0, 950000}) = 1 (in [3], left {0, 949992})
read(3, "\211PNG\r\n\32\n\0\0\0\rIHDR\0\0\0\17\0\0\0\367\10\6\0\0\1\265\20>"..., 543) = 543
fstat(4, {st_mode=S_IFREG|0644, st_size=0, ...}) = 0
mmap(NULL, 4096, PROT_READ|PROT_WRITE, MAP_PRIVATE|MAP_ANONYMOUS, -1, 0) = 0x7f6a77ed4000
write(4, "\211PNG\r\n\32\n\0\0\0\rIHDR\0\0\0\17\0\0\0\367\10\6\0\0\1\265\20>"..., 543) = 543
write(2, "\r", 1)                       = 1
write(2, "100%[==========================="..., 79) = 79
write(2, "\n\n", 2)                     = 2
close(4)                                = 0
munmap(0x7f6a77ed4000, 4096)            = 0
stat("/etc/localtime", {st_mode=S_IFREG|0644, st_size=3519, ...}) = 0
utime("/home/bearface/website_output/www.nyu.edu/common/images/carousel/bgCarouselLeft.png", [2014/06/30-12:10:03, 2014/02/21-16:48:09]) = 0
write(2, "2014-06-30 12:10:03 (2.05 MB/s) "..., 141) = 141
statfs("/home/bearface/website_output/www.nyu.edu/common/images/carousel", {f_type="EXT2_SUPER_MAGIC", f_bsize=4096, f_blocks=59275954, f_bfree=49157686, f_bavail=46140880, f_files=15065088, f_ffree=14788916, f_fsid={533008265, 2108930253}, f_namelen=255, f_frsize=4096}) = 0
stat("/home/bearface/website_output/www.nyu.edu/common/images/carousel/bgCarouselRight.png", {st_mode=S_IFREG|0644, st_size=545, ...}) = 0
lstat("/home/bearface/website_output/www.nyu.edu/common/images/carousel/bgCarouselRight.png", {st_mode=S_IFREG|0644, st_size=545, ...}) = 0
stat("/home/bearface/website_output/www.nyu.edu/common/images/carousel/bgCarouselRight.png", {st_mode=S_IFREG|0644, st_size=545, ...}) = 0
statfs("/home/bearface/website_output/www.nyu.edu/common/images/carousel", {f_type="EXT2_SUPER_MAGIC", f_bsize=4096, f_blocks=59275954, f_bfree=49157686, f_bavail=46140880, f_files=15065088, f_ffree=14788916, f_fsid={533008265, 2108930253}, f_namelen=255, f_frsize=4096}) = 0
stat("/home/bearface/website_output/www.nyu.edu/common/images/carousel/bgCarouselRight.png", {st_mode=S_IFREG|0644, st_size=545, ...}) = 0
lstat("/home/bearface/website_output/www.nyu.edu/common/images/carousel/bgCarouselRight.png", {st_mode=S_IFREG|0644, st_size=545, ...}) = 0
nanosleep({1, 0}, 0x7fff7afecca0)       = 0
stat("/etc/localtime", {st_mode=S_IFREG|0644, st_size=3519, ...}) = 0
write(2, "--2014-06-30 12:10:04--  http://"..., 87) = 87
select(4, [3], NULL, NULL, {0, 1})      = 0 (Timeout)
getpeername(3, {sa_family=AF_INET, sin_port=htons(80), sin_addr=inet_addr("128.122.119.202")}, [16]) = 0
write(2, "Reusing existing connection to w"..., 47) = 47
select(4, NULL, [3], NULL, {900, 0})    = 1 (out [3], left {899, 999998})
write(3, "GET /common/images/carousel/bgCa"..., 241) = 241
write(2, "HTTP request sent, awaiting resp"..., 40) = 40
select(4, [3], NULL, NULL, {900, 0})    = 1 (in [3], left {899, 939033})
recvfrom(3, "HTTP/1.1 200 OK\r\nDate: Mon, 30 J"..., 511, MSG_PEEK, NULL, NULL) = 511
read(3, "HTTP/1.1 200 OK\r\nDate: Mon, 30 J"..., 361) = 361
write(2, "200 OK\n", 7)                 = 7
stat("/home/bearface/website_output/www.nyu.edu/common/images/carousel/bgCarouselRight.png", {st_mode=S_IFREG|0644, st_size=545, ...}) = 0
write(2, "Length: ", 8)                 = 8
write(2, "545", 3)                      = 3
write(2, " [image/png]\n", 13)          = 13
stat("/home/bearface/website_output/www.nyu.edu/common/images/carousel", {st_mode=S_IFDIR|0755, st_size=4096, ...}) = 0
open("/home/bearface/website_output/www.nyu.edu/common/images/carousel/bgCarouselRight.png", O_WRONLY|O_CREAT|O_TRUNC, 0666) = 4
write(2, "Saving to: \342\200\230/home/bearface/web"..., 102) = 102
write(2, "\n", 1)                       = 1
