read(3, "\377\377\377\377\377\377\377\377\377\377\377\377\377\377\377\377\357\377\377\3770\0\0\0\0\0\0\0\0\0\0\0"..., 8192) = 1380
write(4, "\377\377\377\377\377\377\377\377\377\377\377\377\377\377\377\377\357\377\377\3770\0\0\0\0\0\0\0\0\0\0\0"..., 1380) = 1380
select(4, [3], NULL, NULL, {0, 950000}) = 1 (in [3], left {0, 946167})
read(3, "\0\0\0\0\0\0\0\0\0\0\0\0\0\0\0\0\0\0\0\0\0\0\0\0\0\0\0\0\0\0\0\0"..., 8192) = 5520
write(4, "\0\0\0\0\0\0\0\0\0\0\0\0\0\0\0\0\0\0\0\0\0\0\0\0\0\0\0\0\0\0\0\0"..., 4096) = 4096
write(4, "\0\0\0\0\0\0\0\0\0\0\0\0\0\0\0\377\377\377\200\377\377\377\377\377\377\377\377\377\377\377\377\377"..., 1424) = 1424
select(4, [3], NULL, NULL, {0, 950000}) = 1 (in [3], left {0, 949975})
read(3, "\0\0\0\0\0\0\0\0\0\0\0\0\0\0\0\0\0\0\0\0\0\0\0\0\0\0\0\0\0\0\0\0"..., 8192) = 1380
write(4, "\0\0\0\0\0\0\0\0\0\0\0\0\0\0\0\0\0\0\0\0\0\0\0\0\0\0\0\0\0\0\0\0"..., 1380) = 1380
select(4, [3], NULL, NULL, {0, 950000}) = 1 (in [3], left {0, 944985})
read(3, "\377\377\377\377\377\377\377\377\377\257\0\0\0\0\0\0\0\0\0\0\0\0\0\0\0\0\0\0\0\0\0\0"..., 8192) = 8192
write(4, "\377\377\377\377\377\377\377\377\377\257\0\0\0\0\0\0\0\0\0\0\0\0\0\0\0\0\0\0\0\0\0\0"..., 4096) = 4096
write(4, "\0\0\0\0\0\0\0\0\0\0\0\0\0\0\0\0\0\0\0\0\0\0\0\0\0\0\0\0\0\0\377\377"..., 4096) = 4096
select(4, [3], NULL, NULL, {0, 950000}) = 1 (in [3], left {0, 949994})
read(3, "\0\0\0\0\0\0\0\0\0\0\0\0\0\0\0\0\0\0\0\0\0\0\0\0\0\0\0\0\0\0\0\0"..., 8192) = 8192
write(4, "\0\0\0\0\0\0\0\0\0\0\0\0\0\0\0\0\0\0\0\0\0\0\0\0\0\0\0\0\0\0\0\0"..., 4096) = 4096
write(4, "\377\377\377\377\377\377\377\377\377\377\377\377\377\377\377\377\377\377\377\377\377\377\377\377\377\377\377\377\377\377\377\377"..., 4096) = 4096
select(4, [3], NULL, NULL, {0, 950000}) = 1 (in [3], left {0, 949996})
read(3, "\0\0\0\0\0\0\0\0\0\0\0\0\0\0\0\0\0\0\0\0\0\0\0\0\0\0\0\0\0\0\0\0"..., 8192) = 2936
write(4, "\0\0\0\0\0\0\0\0\0\0\0\0\0\0\0\0\0\0\0\0\0\0\0\0\0\0\0\0\0\0\0\0"..., 2936) = 2936
select(4, [3], NULL, NULL, {0, 950000}) = 1 (in [3], left {0, 949855})
read(3, "\0\0\0\0\0\0\0\0\0\0\0\0\0\0\0\0\0\0\0\0\0\0\0\0\0\0\0\0\0\0\0\0"..., 8192) = 1380
write(4, "\0\0\0\0\0\0\0\0\0\0\0\0\0\0\0\0\0\0\0\0\0\0\0\0\0\0\0\0\0\0\0\0"..., 1380) = 1380
select(4, [3], NULL, NULL, {0, 950000}) = 1 (in [3], left {0, 940339})
read(3, "\0\0\0\0\0\0\20\0\0\0p\0\0\0\200\0\0\0\0\0\0\0\0\0\0\0\0\0\0\0\0\0"..., 8192) = 1380
write(4, "\0\0\0\0\0\0\20\0\0\0p\0\0\0\200\0\0\0\0\0\0\0\0\0\0\0\0\0\0\0\0\0"..., 1380) = 1380
select(4, [3], NULL, NULL, {0, 950000}) = 1 (in [3], left {0, 949997})
read(3, "\0\0\0\0\0\0\0\0\0\0\0\0\0\377\377\377\377\377\377\377\377\377\377\377\377\377\377\377\377\377\377\377"..., 8192) = 2760
write(4, "\0\0\0\0\0\0\0\0\0\0\0\0\0\377\377\377\377\377\377\377\377\377\377\377\377\377\377\377\377\377\377\377"..., 2760) = 2760
select(4, [3], NULL, NULL, {0, 950000}) = 1 (in [3], left {0, 948802})
read(3, "\0\0\0\0\0\0\0\0\0\0\0\0\0\0\0\360\0\0\0\221\0\0\0\0\0\0\0\0\0\0\0?"..., 8192) = 1380
write(4, "\0\0\0\0\0\0\0\0\0\0\0\0\0\0\0\360\0\0\0\221\0\0\0\0\0\0\0\0\0\0\0?"..., 1380) = 1380
select(4, [3], NULL, NULL, {0, 950000}) = 1 (in [3], left {0, 949998})
read(3, "\0\0\0\0\0\0\0\0\0\0\0\0\0\0\0\0\0\0\0\0\0\0\0\0\0\0\0\0\0\0\0\0"..., 8192) = 1380
write(4, "\0\0\0\0\0\0\0\0\0\0\0\0\0\0\0\0\0\0\0\0\0\0\0\0\0\0\0\0\0\0\0\0"..., 1380) = 1380
select(4, [3], NULL, NULL, {0, 950000}) = 1 (in [3], left {0, 949393})
read(3, "\0\0\0\0\0\0\0\0\0\0\0\0\0\0\0\0\0\0\0\0\0\0\377\377\3770\377\377\377\237\377\377"..., 8192) = 1380
write(4, "\0\0\0\0\0\0\0\0\0\0\0\0\0\0\0\0\0\0\0\0\0\0\377\377\3770\377\377\377\237\377\377"..., 1380) = 1380
select(4, [3], NULL, NULL, {0, 950000}) = 1 (in [3], left {0, 945778})
read(3, "\0\0\0\0\0\0\0\0\0\0\0\0\0\0\0\0\0\0\0\0\0\0\0\0\0\0\0\0\0\0\0\0"..., 8192) = 1380
write(4, "\0\0\0\0\0\0\0\0\0\0\0\0\0\0\0\0\0\0\0\0\0\0\0\0\0\0\0\0\0\0\0\0"..., 1380) = 1380
select(4, [3], NULL, NULL, {0, 950000}) = 1 (in [3], left {0, 945184})
read(3, "\0\0\0\0\0\0\0\0\0\0\0\0\0\0\0\0\0\0\0\0\0\0\0\0\0\0\0\0\0\0\0\0"..., 8192) = 2760
write(4, "\0\0\0\0\0\0\0\0\0\0\0\0\0\0\0\0\0\0\0\0\0\0\0\0\0\0\0\0\0\0\0\0"..., 2760) = 2760
select(4, [3], NULL, NULL, {0, 950000}) = 1 (in [3], left {0, 949997})
read(3, "\377\377\377\377\377\377\377\377\377\377\377\377\377\377\377\277\0\0\0\0\0\0\0\0\0\0\0\0\0\0\0\0"..., 8192) = 6900
write(4, "\377\377\377\377\377\377\377\377\377\377\377\377\377\377\377\277\0\0\0\0\0\0\0\0\0\0\0\0\0\0\0\0"..., 4096) = 4096
write(4, "\377\377\377@\0\0\0\0\0\0\0\0\0\0\0\0\0\0\0\0\0\0\0\0\0\0\0\0\0\0\0\0"..., 2804) = 2804
select(4, [3], NULL, NULL, {0, 950000}) = 1 (in [3], left {0, 949998})
read(3, "\0\0\0\0\0\0\0\0\0\0\0\0\0\0\0\0\0\0\0\0\0\0\0\0\0\0\0\0\0\0\0\0"..., 8192) = 2760
write(4, "\0\0\0\0\0\0\0\0\0\0\0\0\0\0\0\0\0\0\0\0\0\0\0\0\0\0\0\0\0\0\0\0"..., 2760) = 2760
select(4, [3], NULL, NULL, {0, 950000}) = 1 (in [3], left {0, 949916})
read(3, "\0\0\0\0\0\0\0\0\0\0\0\0\0\0\0\0\0\0\0\0\0\0\0\0\0\0\0\0\0\0\0\0"..., 8192) = 1380
write(4, "\0\0\0\0\0\0\0\0\0\0\0\0\0\0\0\0\0\0\0\0\0\0\0\0\0\0\0\0\0\0\0\0"..., 1380) = 1380
select(4, [3], NULL, NULL, {0, 950000}) = 1 (in [3], left {0, 949998})
read(3, "\377\377\377\377\377\377\377\377\377\377\337\377\377\377@\0\0\0\0\0\0\0\0\0\0\0\0\0\0\0\0\0"..., 8192) = 1380
write(4, "\377\377\377\377\377\377\377\377\377\377\337\377\377\377@\0\0\0\0\0\0\0\0\0\0\0\0\0\0\0\0\0"..., 1380) = 1380
select(4, [3], NULL, NULL, {0, 950000}) = 1 (in [3], left {0, 949998})
read(3, "\0\0\0\0\0\0\0\0\0\0\0\0\377\377\377\217\377\377\377\377\377\377\377\377\377\377\377\377\377\377\377\20"..., 8192) = 1380
write(4, "\0\0\0\0\0\0\0\0\0\0\0\0\377\377\377\217\377\377\377\377\377\377\377\377\377\377\377\377\377\377\377\20"..., 1380) = 1380
select(4, [3], NULL, NULL, {0, 950000}) = 1 (in [3], left {0, 946913})
read(3, "\0\0\0\0\0\0\0\0\0\0\377\377\377\20\377\377\377\257\377\377\377\377\377\377\377\377\377\377\377\377\377\377"..., 8192) = 6900
write(4, "\0\0\0\0\0\0\0\0\0\0\377\377\377\20\377\377\377\257\377\377\377\377\377\377\377\377\377\377\377\377\377\377"..., 4096) = 4096
write(4, "\0\0\0\0\0\0\0\0\0\0\0\0\0\0\0\0\0\0\0\0\0\0\0\0\0\0\0\0\0\0\0\0"..., 2804) = 2804
select(4, [3], NULL, NULL, {0, 950000}) = 1 (in [3], left {0, 949998})
read(3, "\0\0\0\0\0\0\0\0\0\0\0\0\0\0\0\0\0\0\0\0\0\0\0\0\0\0\0\0\0\0\0\0"..., 8192) = 1380
write(4, "\0\0\0\0\0\0\0\0\0\0\0\0\0\0\0\0\0\0\0\0\0\0\0\0\0\0\0\0\0\0\0\0"..., 1380) = 1380
select(4, [3], NULL, NULL, {0, 950000}) = 1 (in [3], left {0, 949966})
read(3, "\0\0\0\0\0\0\0\0\0\0\0\0\0\0\0\0\0\0\0\0\0\0\0\0\0\0\0\0\0\0\0\0"..., 8192) = 1380
write(4, "\0\0\0\0\0\0\0\0\0\0\0\0\0\0\0\0\0\0\0\0\0\0\0\0\0\0\0\0\0\0\0\0"..., 1380) = 1380
select(4, [3], NULL, NULL, {0, 950000}) = 1 (in [3], left {0, 949997})
read(3, "\0\0\0\0\0\0\0\0\0\0\0\0\0\0\0\0\0\0\0\0\0\0\0\0\0\0\0\0\0\0\0\0"..., 8192) = 1380
write(4, "\0\0\0\0\0\0\0\0\0\0\0\0\0\0\0\0\0\0\0\0\0\0\0\0\0\0\0\0\0\0\0\0"..., 1380) = 1380
select(4, [3], NULL, NULL, {0, 950000}) = 1 (in [3], left {0, 949998})
read(3, "\0\0\0\0\0\0\0\0\0\0\0\0\0\0\0\0\0\0\0\0\0\0\0\0\0\0\0\0\0\0\0\0"..., 8192) = 1380
