write(2, "2014-06-30 12:12:58 (28.9 MB/s) "..., 144) = 144
statfs("/home/bearface/website_output/www.berkeley.edu/img/socialmedia", {f_type="EXT2_SUPER_MAGIC", f_bsize=4096, f_blocks=59275954, f_bfree=49151506, f_bavail=46134700, f_files=15065088, f_ffree=14788685, f_fsid={533008265, 2108930253}, f_namelen=255, f_frsize=4096}) = 0
stat("/home/bearface/website_output/www.berkeley.edu/img/socialmedia/googleplus28sprite.png", 0x7ffffe5e1610) = -1 ENOENT (No such file or directory)
stat("/home/bearface/website_output/www.berkeley.edu/img/socialmedia/googleplus28sprite.png", 0x7ffffe5e16a0) = -1 ENOENT (No such file or directory)
statfs("/home/bearface/website_output/www.berkeley.edu/img/socialmedia", {f_type="EXT2_SUPER_MAGIC", f_bsize=4096, f_blocks=59275954, f_bfree=49151505, f_bavail=46134699, f_files=15065088, f_ffree=14788685, f_fsid={533008265, 2108930253}, f_namelen=255, f_frsize=4096}) = 0
stat("/home/bearface/website_output/www.berkeley.edu/img/socialmedia/googleplus28sprite.png", 0x7ffffe5e1610) = -1 ENOENT (No such file or directory)
nanosleep({1, 0}, 0x7ffffe5e1720)       = 0
stat("/etc/localtime", {st_mode=S_IFREG|0644, st_size=3519, ...}) = 0
write(2, "--2014-06-30 12:12:59--  http://"..., 88) = 88
select(4, [3], NULL, NULL, {0, 1})      = 0 (Timeout)
getpeername(3, {sa_family=AF_INET, sin_port=htons(80), sin_addr=inet_addr("169.229.216.200")}, [16]) = 0
write(2, "Reusing existing connection to w"..., 52) = 52
select(4, NULL, [3], NULL, {900, 0})    = 1 (out [3], left {899, 999994})
write(3, "GET /img/socialmedia/googleplus2"..., 183) = 183
write(2, "HTTP request sent, awaiting resp"..., 40) = 40
select(4, [3], NULL, NULL, {900, 0})    = 1 (in [3], left {899, 920109})
recvfrom(3, "HTTP/1.1 200 OK\r\nDate: Mon, 30 J"..., 511, MSG_PEEK, NULL, NULL) = 511
read(3, "HTTP/1.1 200 OK\r\nDate: Mon, 30 J"..., 366) = 366
write(2, "200 OK\n", 7)                 = 7
stat("/home/bearface/website_output/www.berkeley.edu/img/socialmedia/googleplus28sprite.png", 0x7ffffe5e1140) = -1 ENOENT (No such file or directory)
write(2, "Length: ", 8)                 = 8
write(2, "4248", 4)                     = 4
write(2, " (4.1K)", 7)                  = 7
write(2, " [image/png]\n", 13)          = 13
stat("/home/bearface/website_output/www.berkeley.edu/img/socialmedia", {st_mode=S_IFDIR|0755, st_size=4096, ...}) = 0
open("/home/bearface/website_output/www.berkeley.edu/img/socialmedia/googleplus28sprite.png", O_WRONLY|O_CREAT|O_TRUNC, 0666) = 4
write(2, "Saving to: \342\200\230/home/bearface/web"..., 103) = 103
write(2, "\n", 1)                       = 1
write(2, "\r", 1)                       = 1
write(2, " 0% [                           "..., 79) = 79
select(4, [3], NULL, NULL, {0, 950000}) = 1 (in [3], left {0, 949994})
read(3, "\211PNG\r\n\32\n\0\0\0\rIHDR\0\0\0\34\0\0\0008\10\6\0\0\0\3560\230"..., 4248) = 4248
fstat(4, {st_mode=S_IFREG|0644, st_size=0, ...}) = 0
mmap(NULL, 4096, PROT_READ|PROT_WRITE, MAP_PRIVATE|MAP_ANONYMOUS, -1, 0) = 0x7feb0e058000
write(4, "\211PNG\r\n\32\n\0\0\0\rIHDR\0\0\0\34\0\0\0008\10\6\0\0\0\3560\230"..., 4096) = 4096
write(4, "'\271\257U\211\3560\335\367\334\332k\22p&S{\260:]sQ\21[\313\200\326-\4\210B\370"..., 152) = 152
write(2, "\r", 1)                       = 1
write(2, "100%[==========================="..., 79) = 79
write(2, "\n\n", 2)                     = 2
close(4)                                = 0
munmap(0x7feb0e058000, 4096)            = 0
stat("/etc/localtime", {st_mode=S_IFREG|0644, st_size=3519, ...}) = 0
utime("/home/bearface/website_output/www.berkeley.edu/img/socialmedia/googleplus28sprite.png", [2014/06/30-12:12:59, 2014/06/25-17:38:26]) = 0
write(2, "2014-06-30 12:12:59 (14.8 MB/s) "..., 145) = 145
statfs("/home/bearface/website_output/www.berkeley.edu/img/socialmedia", {f_type="EXT2_SUPER_MAGIC", f_bsize=4096, f_blocks=59275954, f_bfree=49151502, f_bavail=46134696, f_files=15065088, f_ffree=14788684, f_fsid={533008265, 2108930253}, f_namelen=255, f_frsize=4096}) = 0
stat("/home/bearface/website_output/www.berkeley.edu/img/socialmedia/youtube28sprite.png", 0x7ffffe5e1610) = -1 ENOENT (No such file or directory)
stat("/home/bearface/website_output/www.berkeley.edu/img/socialmedia/youtube28sprite.png", 0x7ffffe5e16a0) = -1 ENOENT (No such file or directory)
statfs("/home/bearface/website_output/www.berkeley.edu/img/socialmedia", {f_type="EXT2_SUPER_MAGIC", f_bsize=4096, f_blocks=59275954, f_bfree=49151502, f_bavail=46134696, f_files=15065088, f_ffree=14788684, f_fsid={533008265, 2108930253}, f_namelen=255, f_frsize=4096}) = 0
stat("/home/bearface/website_output/www.berkeley.edu/img/socialmedia/youtube28sprite.png", 0x7ffffe5e1610) = -1 ENOENT (No such file or directory)
nanosleep({1, 0}, 0x7ffffe5e1720)       = 0
stat("/etc/localtime", {st_mode=S_IFREG|0644, st_size=3519, ...}) = 0
write(2, "--2014-06-30 12:13:00--  http://"..., 85) = 85
select(4, [3], NULL, NULL, {0, 1})      = 0 (Timeout)
getpeername(3, {sa_family=AF_INET, sin_port=htons(80), sin_addr=inet_addr("169.229.216.200")}, [16]) = 0
write(2, "Reusing existing connection to w"..., 52) = 52
select(4, NULL, [3], NULL, {900, 0})    = 1 (out [3], left {899, 999993})
write(3, "GET /img/socialmedia/youtube28sp"..., 180) = 180
write(2, "HTTP request sent, awaiting resp"..., 40) = 40
select(4, [3], NULL, NULL, {900, 0})    = 1 (in [3], left {899, 920897})
recvfrom(3, "HTTP/1.1 200 OK\r\nDate: Mon, 30 J"..., 511, MSG_PEEK, NULL, NULL) = 511
read(3, "HTTP/1.1 200 OK\r\nDate: Mon, 30 J"..., 366) = 366
write(2, "200 OK\n", 7)                 = 7
stat("/home/bearface/website_output/www.berkeley.edu/img/socialmedia/youtube28sprite.png", 0x7ffffe5e1140) = -1 ENOENT (No such file or directory)
write(2, "Length: ", 8)                 = 8
write(2, "4251", 4)                     = 4
write(2, " (4.2K)", 7)                  = 7
write(2, " [image/png]\n", 13)          = 13
stat("/home/bearface/website_output/www.berkeley.edu/img/socialmedia", {st_mode=S_IFDIR|0755, st_size=4096, ...}) = 0
open("/home/bearface/website_output/www.berkeley.edu/img/socialmedia/youtube28sprite.png", O_WRONLY|O_CREAT|O_TRUNC, 0666) = 4
write(2, "Saving to: \342\200\230/home/bearface/web"..., 100) = 100
write(2, "\n", 1)                       = 1
write(2, "\r", 1)                       = 1
write(2, " 0% [                           "..., 79) = 79
select(4, [3], NULL, NULL, {0, 950000}) = 1 (in [3], left {0, 949992})
read(3, "\211PNG\r\n\32\n\0\0\0\rIHDR\0\0\0\34\0\0\0008\10\6\0\0\0\3560\230"..., 4251) = 4251
