select(4, [3], NULL, NULL, {0, 950000}) = 1 (in [3], left {0, 946848})
read(3, "H405L235 215L195 169V0H63V550H19"..., 8192) = 1368
write(4, "H405L235 215L195 169V0H63V550H19"..., 1368) = 1368
select(4, [3], NULL, NULL, {0, 950000}) = 1 (in [3], left {0, 949996})
read(3, "8L267 -253Q288 -241 307 -218T330"..., 8192) = 8192
write(4, "8L267 -253Q288 -241 307 -218T330"..., 4096) = 4096
write(4, "30 -138ZM256\n-12Q180 -12 118 11T"..., 4096) = 4096
select(4, [3], NULL, NULL, {0, 950000}) = 1 (in [3], left {0, 949996})
read(3, "\"M263 -100H47V768H263V683H138V-1"..., 8192) = 2752
write(4, "\"M263 -100H47V768H263V683H138V-1"..., 2752) = 2752
select(4, [3], NULL, NULL, {0, 950000}) = 1 (in [3], left {0, 944294})
read(3, "204Q370 215 396 251L479 174Q428 "..., 8192) = 1368
write(4, "204Q370 215 396 251L479 174Q428 "..., 1368) = 1368
select(4, [3], NULL, NULL, {0, 950000}) = 1 (in [3], left {0, 949994})
read(3, "269 481 213 472V416H151ZM109 621"..., 8192) = 4104
write(4, "269 481 213 472V416H151ZM109 621"..., 4096) = 4096
write(4, "dv-x=\"33", 8)                = 8
select(4, [3], NULL, NULL, {0, 950000}) = 1 (in [3], left {0, 949994})
read(3, "6\" d=\"M164 318Q78 318 18 371L56 "..., 8192) = 5472
write(4, "6\" d=\"M164 318Q78 318 18 371L56 "..., 4096) = 4096
write(4, "riz-adv-x=\"608\" d=\"M322 -12Q178 "..., 1376) = 1376
select(4, [3], NULL, NULL, {0, 950000}) = 1 (in [3], left {0, 949996})
read(3, "322T260 288T237 251Q237 231 255 "..., 8192) = 2736
write(4, "322T260 288T237 251Q237 231 255 "..., 2736) = 2736
select(4, [3], NULL, NULL, {0, 950000}) = 1 (in [3], left {0, 949997})
read(3, "4T443 153T488 275Q488 349 444 39"..., 8192) = 1368
write(4, "4T443 153T488 275Q488 349 444 39"..., 1368) = 1368
select(4, [3], NULL, NULL, {0, 950000}) = 1 (in [3], left {0, 949580})
read(3, "oriz-adv-x=\"646\" d=\"M451 -12T323"..., 8192) = 2736
write(4, "oriz-adv-x=\"646\" d=\"M451 -12T323"..., 2736) = 2736
select(4, [3], NULL, NULL, {0, 950000}) = 1 (in [3], left {0, 949997})
read(3, "78 2 105 80T32 275Q32 401 117 48"..., 8192) = 1368
write(4, "78 2 105 80T32 275Q32 401 117 48"..., 1368) = 1368
select(4, [3], NULL, NULL, {0, 950000}) = 1 (in [3], left {0, 949997})
read(3, "e=\"Icircumflex.smcp\" horiz-adv-x"..., 7026) = 2736
write(4, "e=\"Icircumflex.smcp\" horiz-adv-x"..., 2736) = 2736
select(4, [3], NULL, NULL, {0, 950000}) = 1 (in [3], left {0, 949997})
read(3, "40 69T327 -12ZM327 104Q399 104\n4"..., 4290) = 1368
write(4, "40 69T327 -12ZM327 104Q399 104\n4"..., 1368) = 1368
select(4, [3], NULL, NULL, {0, 950000}) = 1 (in [3], left {0, 949997})
read(3, "nicode=\"&#xf7fe;\" glyph-name=\"Th"..., 2922) = 2922
write(4, "nicode=\"&#xf7fe;\" glyph-name=\"Th"..., 2922) = 2922
write(2, "\r", 1)                       = 1
write(2, "100%[==========================="..., 79) = 79
write(2, "\n\n", 2)                     = 2
close(4)                                = 0
munmap(0x7fcea595e000, 4096)            = 0
stat("/etc/localtime", {st_mode=S_IFREG|0644, st_size=3519, ...}) = 0
utime("/home/bearface/website_output/www.uchicago.edu/c/fonts/1415F2_4.svg", [2014/06/30-12:28:43, 2013/05/06-11:58:25]) = 0
write(2, "2014-06-30 12:28:43 (1.05 MB/s) "..., 131) = 131
statfs("/home/bearface/website_output/www.uchicago.edu/c/fonts/symbolset", 0x7fff7e3ef630) = -1 ENOENT (No such file or directory)
statfs("/home/bearface/website_output/www.uchicago.edu/c/fonts", {f_type="EXT2_SUPER_MAGIC", f_bsize=4096, f_blocks=59275954, f_bfree=49122852, f_bavail=46106046, f_files=15065088, f_ffree=14788055, f_fsid={533008265, 2108930253}, f_namelen=255, f_frsize=4096}) = 0
stat("/home/bearface/website_output/www.uchicago.edu/c/fonts/symbolset/ss-social-circle.eot", 0x7fff7e3ef680) = -1 ENOENT (No such file or directory)
stat("/home/bearface/website_output/www.uchicago.edu/c/fonts/symbolset/ss-social-circle.eot", 0x7fff7e3ef710) = -1 ENOENT (No such file or directory)
statfs("/home/bearface/website_output/www.uchicago.edu/c/fonts/symbolset", 0x7fff7e3ef630) = -1 ENOENT (No such file or directory)
statfs("/home/bearface/website_output/www.uchicago.edu/c/fonts", {f_type="EXT2_SUPER_MAGIC", f_bsize=4096, f_blocks=59275954, f_bfree=49122852, f_bavail=46106046, f_files=15065088, f_ffree=14788055, f_fsid={533008265, 2108930253}, f_namelen=255, f_frsize=4096}) = 0
stat("/home/bearface/website_output/www.uchicago.edu/c/fonts/symbolset/ss-social-circle.eot", 0x7fff7e3ef680) = -1 ENOENT (No such file or directory)
nanosleep({1, 0}, 0x7fff7e3ef790)       = 0
stat("/etc/localtime", {st_mode=S_IFREG|0644, st_size=3519, ...}) = 0
write(2, "--2014-06-30 12:28:44--  http://"..., 88) = 88
select(4, [3], NULL, NULL, {0, 1})      = 0 (Timeout)
getpeername(3, {sa_family=AF_INET, sin_port=htons(80), sin_addr=inet_addr("198.101.129.15")}, [16]) = 0
write(2, "Reusing existing connection to w"..., 52) = 52
select(4, NULL, [3], NULL, {900, 0})    = 1 (out [3], left {899, 999993})
write(3, "GET /c/fonts/symbolset/ss-social"..., 391) = 391
write(2, "HTTP request sent, awaiting resp"..., 40) = 40
select(4, [3], NULL, NULL, {900, 0})    = 1 (in [3], left {899, 968788})
recvfrom(3, "HTTP/1.1 200 OK\r\nDate: Mon, 30 J"..., 511, MSG_PEEK, NULL, NULL) = 511
read(3, "HTTP/1.1 200 OK\r\nDate: Mon, 30 J"..., 390) = 390
write(2, "200 OK\n", 7)                 = 7
stat("/home/bearface/website_output/www.uchicago.edu/c/fonts/symbolset/ss-social-circle.eot", 0x7fff7e3ef1b0) = -1 ENOENT (No such file or directory)
write(2, "Length: ", 8)                 = 8
write(2, "26704", 5)                    = 5
write(2, " (26K)", 6)                   = 6
write(2, " [application/vnd.ms-fontobject]"..., 33) = 33
