select(4, [3], NULL, NULL, {0, 950000}) = 1 (in [3], left {0, 949986})
read(3, "\346\fn\213\324\325\303\222\"\22\345\300\2D\231\213\26>Z\370C\227i\10\226\270\220\200\265M\2\271"..., 8192) = 2736
write(4, "\346\fn\213\324\325\303\222\"\22\345\300\2D\231\213\26>Z\370C\227i\10\226\270\220\200\265M\2\271"..., 2736) = 2736
select(4, [3], NULL, NULL, {0, 950000}) = 1 (in [3], left {0, 949997})
read(3, "\231\303\361\1\256\366\332\330-A\320\250\265\r\330\206\201s\226iwO8\256\326\16BD\375n\273\271"..., 8192) = 1368
write(4, "\231\303\361\1\256\366\332\330-A\320\250\265\r\330\206\201s\226iwO8\256\326\16BD\375n\273\271"..., 1368) = 1368
select(4, [3], NULL, NULL, {0, 950000}) = 1 (in [3], left {0, 949998})
read(3, "\10\35\300Y\220g\36\f\314\263\327>E\4\303fCM\206\34\36u\r\240\202\330\17\301\306\0\320\241"..., 8192) = 1368
write(4, "\10\35\300Y\220g\36\f\314\263\327>E\4\303fCM\206\34\36u\r\240\202\330\17\301\306\0\320\241"..., 1368) = 1368
select(4, [3], NULL, NULL, {0, 950000}) = 1 (in [3], left {0, 886312})
read(3, "\24D\324X\245\33\352\267$\201\23M;C}_\324\221\311\35\362\17\35\347h\342Gmq/\354h"..., 8192) = 1368
write(4, "\24D\324X\245\33\352\267$\201\23M;C}_\324\221\311\35\362\17\35\347h\342Gmq/\354h"..., 1368) = 1368
select(4, [3], NULL, NULL, {0, 950000}) = 1 (in [3], left {0, 949150})
read(3, "/\2207\256\343\10@|\263h\35\260\221\304 \222\2349 s\17\211\362\265\202\204\"\367\315\363t!"..., 8192) = 1368
write(4, "/\2207\256\343\10@|\263h\35\260\221\304 \222\2349 s\17\211\362\265\202\204\"\367\315\363t!"..., 1368) = 1368
select(4, [3], NULL, NULL, {0, 950000}) = 1 (in [3], left {0, 949206})
read(3, "\20\341\362\226\25\300\214\355iSMp\200\242\234\257v\352Xr\205\372\303~\336\334\341\333 \205\272\313"..., 7861) = 1368
write(4, "\20\341\362\226\25\300\214\355iSMp\200\242\234\257v\352Xr\205\372\303~\336\334\341\333 \205\272\313"..., 1368) = 1368
select(4, [3], NULL, NULL, {0, 950000}) = 1 (in [3], left {0, 949135})
read(3, "\22\6y\230\346dZ\6\244\nx\373h\354\244\34\202\361\342\2'K\r\344\207\347hG\236MrV"..., 6493) = 1368
write(4, "\22\6y\230\346dZ\6\244\nx\373h\354\244\34\202\361\342\2'K\r\344\207\347hG\236MrV"..., 1368) = 1368
select(4, [3], NULL, NULL, {0, 950000}) = 1 (in [3], left {0, 949898})
read(3, "\234<\361$t\25\365\344\314\30\341\331>\310:\v\373L\31\243d\223\337\312\0161\3\254\362\30\5W"..., 5125) = 1368
write(4, "\234<\361$t\25\365\344\314\30\341\331>\310:\v\373L\31\243d\223\337\312\0161\3\254\362\30\5W"..., 1368) = 1368
select(4, [3], NULL, NULL, {0, 950000}) = 1 (in [3], left {0, 949884})
read(3, "\303\342\27]\360\21\32\241\371.A\335@\33\t\261\30:\t1\220\376\7(!\35S\241\35PL3"..., 3757) = 1368
write(4, "\303\342\27]\360\21\32\241\371.A\335@\33\t\261\30:\t1\220\376\7(!\35S\241\35PL3"..., 1368) = 1368
select(4, [3], NULL, NULL, {0, 950000}) = 1 (in [3], left {0, 949744})
read(3, "\301\236\16\26\21\f\377\324]#S\252\256\217M\6\34\317\257\300B\211\354\307I\327[\272Jwu\4"..., 2389) = 1368
write(4, "\301\236\16\26\21\f\377\324]#S\252\256\217M\6\34\317\257\300B\211\354\307I\327[\272Jwu\4"..., 1368) = 1368
select(4, [3], NULL, NULL, {0, 950000}) = 1 (in [3], left {0, 949998})
read(3, "\352\254\327b#\202\270W\311\35\206\3047\20:p\216\225L\212a\251\326WZ\f\253b\221\371\36\312"..., 1021) = 1021
write(4, "\352\254\327b#\202\270W\311\35\206\3047\20:p\216\225L\212a\251\326WZ\f\253b\221\371\36\312"..., 1021) = 1021
write(2, "\r", 1)                       = 1
write(2, "100%[==========================="..., 79) = 79
write(2, "\n\n", 2)                     = 2
close(4)                                = 0
munmap(0x7f6529c37000, 4096)            = 0
stat("/etc/localtime", {st_mode=S_IFREG|0644, st_size=3519, ...}) = 0
utime("/home/bearface/website_output/www.ucla.edu/css/fonts/proximanova-light.eot?", [2014/06/30-12:17:35, 2014/05/01-15:09:18]) = 0
write(2, "2014-06-30 12:17:35 (161 KB/s) -"..., 136) = 136
statfs("/home/bearface/website_output/www.ucla.edu/css/fonts", {f_type="EXT2_SUPER_MAGIC", f_bsize=4096, f_blocks=59275954, f_bfree=49141228, f_bavail=46124422, f_files=15065088, f_ffree=14788410, f_fsid={533008265, 2108930253}, f_namelen=255, f_frsize=4096}) = 0
stat("/home/bearface/website_output/www.ucla.edu/css/fonts/proximanova-light.woff", 0x7fff13a30660) = -1 ENOENT (No such file or directory)
stat("/home/bearface/website_output/www.ucla.edu/css/fonts/proximanova-light.woff", 0x7fff13a306f0) = -1 ENOENT (No such file or directory)
statfs("/home/bearface/website_output/www.ucla.edu/css/fonts", {f_type="EXT2_SUPER_MAGIC", f_bsize=4096, f_blocks=59275954, f_bfree=49141228, f_bavail=46124422, f_files=15065088, f_ffree=14788410, f_fsid={533008265, 2108930253}, f_namelen=255, f_frsize=4096}) = 0
stat("/home/bearface/website_output/www.ucla.edu/css/fonts/proximanova-light.woff", 0x7fff13a30660) = -1 ENOENT (No such file or directory)
nanosleep({1, 0}, 0x7fff13a30770)       = 0
stat("/etc/localtime", {st_mode=S_IFREG|0644, st_size=3519, ...}) = 0
write(2, "--2014-06-30 12:17:36--  http://"..., 78) = 78
select(4, [3], NULL, NULL, {0, 1})      = 0 (Timeout)
getpeername(3, {sa_family=AF_INET, sin_port=htons(80), sin_addr=inet_addr("164.67.228.152")}, [16]) = 0
write(2, "Reusing existing connection to w"..., 48) = 48
select(4, NULL, [3], NULL, {900, 0})    = 1 (out [3], left {899, 999998})
write(3, "GET /css/fonts/proximanova-light"..., 171) = 171
write(2, "HTTP request sent, awaiting resp"..., 40) = 40
select(4, [3], NULL, NULL, {900, 0})    = 1 (in [3], left {899, 933387})
recvfrom(3, "HTTP/1.1 200 OK\r\nContent-Type: t"..., 511, MSG_PEEK, NULL, NULL) = 511
read(3, "HTTP/1.1 200 OK\r\nContent-Type: t"..., 393) = 393
write(2, "200 OK\n", 7)                 = 7
stat("/home/bearface/website_output/www.ucla.edu/css/fonts/proximanova-light.woff", 0x7fff13a30190) = -1 ENOENT (No such file or directory)
write(2, "Length: ", 8)                 = 8
write(2, "unspecified", 11)             = 11
write(2, " [text/plain]\n", 14)         = 14
stat("/home/bearface/website_output/www.ucla.edu/css/fonts", {st_mode=S_IFDIR|0755, st_size=4096, ...}) = 0
open("/home/bearface/website_output/www.ucla.edu/css/fonts/proximanova-light.woff", O_WRONLY|O_CREAT|O_TRUNC, 0666) = 4
write(2, "Saving to: \342\200\230/home/bearface/web"..., 93) = 93
write(2, "\n", 1)                       = 1
write(2, "\r", 1)                       = 1
write(2, "    [<=>                        "..., 79) = 79
select(4, [3], NULL, NULL, {900, 0})    = 1 (in [3], left {899, 999997})
recvfrom(3, "00638c\r\nwOFF\0\1\0\0\0\0c\214\0\23\0\0\0\0\325\314\0\1\0\0"..., 127, MSG_PEEK, NULL, NULL) = 127
read(3, "00638c\r\n", 8)                = 8
select(4, [3], NULL, NULL, {0, 950000}) = 1 (in [3], left {0, 949998})
read(3, "wOFF\0\1\0\0\0\0c\214\0\23\0\0\0\0\325\314\0\1\0\0\0\0\0\0\0\0\0\0"..., 8192) = 967
fstat(4, {st_mode=S_IFREG|0644, st_size=0, ...}) = 0
