socket(PF_INET, SOCK_STREAM, IPPROTO_IP) = 3
connect(3, {sa_family=AF_INET, sin_port=htons(80), sin_addr=inet_addr("128.125.253.146")}, 16) = 0
write(2, "connected.\n", 11)            = 11
select(4, NULL, [3], NULL, {900, 0})    = 1 (out [3], left {899, 999987})
write(3, "GET /x/usc_homepage/assets/css/f"..., 257) = 257
write(2, "HTTP request sent, awaiting resp"..., 40) = 40
select(4, [3], NULL, NULL, {900, 0})    = 1 (in [3], left {899, 932193})
recvfrom(3, "HTTP/1.1 200 OK\r\nDate: Mon, 30 J"..., 511, MSG_PEEK, NULL, NULL) = 511
read(3, "HTTP/1.1 200 OK\r\nDate: Mon, 30 J"..., 329) = 329
write(2, "200 OK\n", 7)                 = 7
stat("/home/bearface/website_output/www.usc.edu/x/usc_homepage/assets/css/fonts/ProximaNova-Bold-webfont.eot", 0x7fff959163d0) = -1 ENOENT (No such file or directory)
write(2, "Length: ", 8)                 = 8
write(2, "20906", 5)                    = 5
write(2, " (20K)", 6)                   = 6
write(2, " [text/plain]\n", 14)         = 14
stat("/home/bearface/website_output/www.usc.edu/x/usc_homepage/assets/css/fonts", {st_mode=S_IFDIR|0755, st_size=4096, ...}) = 0
open("/home/bearface/website_output/www.usc.edu/x/usc_homepage/assets/css/fonts/ProximaNova-Bold-webfont.eot", O_WRONLY|O_CREAT|O_TRUNC, 0666) = 4
write(2, "Saving to: \342\200\230/home/bearface/web"..., 120) = 120
write(2, "\n", 1)                       = 1
write(2, "\r", 1)                       = 1
write(2, " 0% [                           "..., 79) = 79
select(4, [3], NULL, NULL, {0, 950000}) = 1 (in [3], left {0, 949992})
read(3, "\252Q\0\0\322P\0\0\2\0\2\0\4\0\0\0\2\0\5\6\3\0\0\2\0\4\243\0\274\2\0\0"..., 8192) = 4180
fstat(4, {st_mode=S_IFREG|0644, st_size=0, ...}) = 0
mmap(NULL, 4096, PROT_READ|PROT_WRITE, MAP_PRIVATE|MAP_ANONYMOUS, -1, 0) = 0x7f76b35a5000
write(4, "\252Q\0\0\322P\0\0\2\0\2\0\4\0\0\0\2\0\5\6\3\0\0\2\0\4\243\0\274\2\0\0"..., 4096) = 4096
write(4, "\273\202f\243\4F\247\207+\212\353(8}a\357\344 \324k3\240\337c\242&G\256\fP\257\351"..., 84) = 84
select(4, [3], NULL, NULL, {0, 950000}) = 1 (in [3], left {0, 888483})
read(3, "\305J\5\224OED\201\245w\241\276\366~\1\336 \236\352\177K\321i\25[\30\275D5o\220\352"..., 8192) = 1360
write(4, "\305J\5\224OED\201\245w\241\276\366~\1\336 \236\352\177K\321i\25[\30\275D5o\220\352"..., 1360) = 1360
select(4, [3], NULL, NULL, {0, 950000}) = 1 (in [3], left {0, 949282})
read(3, "\372wV\374\257W\356\367APU\267\277W\240Z\350p\303j\242\37\32\274nU\216-\206\324s\340"..., 8192) = 1360
write(4, "\372wV\374\257W\356\367APU\267\277W\240Z\350p\303j\242\37\32\274nU\216-\206\324s\340"..., 1360) = 1360
select(4, [3], NULL, NULL, {0, 950000}) = 1 (in [3], left {0, 949998})
read(3, "\311\267@y%?\17\20THl\263\261K\3434\225S\355\350e\21\7\326\30Z\206\277U\3165}"..., 8192) = 1260
write(4, "\311\267@y%?\17\20THl\263\261K\3434\225S\355\350e\21\7\326\30Z\206\277U\3165}"..., 1260) = 1260
select(4, [3], NULL, NULL, {0, 950000}) = 1 (in [3], left {0, 949997})
read(3, "\331\221\363hB\30\6\203f\"\240\r\255\257^\230A\337\254\374\237\326%$q\20\343f3c\364="..., 8192) = 1360
write(4, "\331\221\363hB\30\6\203f\"\240\r\255\257^\230A\337\254\374\237\326%$q\20\343f3c\364="..., 1360) = 1360
select(4, [3], NULL, NULL, {0, 950000}) = 1 (in [3], left {0, 949997})
read(3, "\274\23:_\0344\315-V@\207X\245\363\3502'\360AV+\247e\263\237\344\3126\2451X\374"..., 8192) = 2720
write(4, "\274\23:_\0344\315-V@\207X\245\363\3502'\360AV+\247e\263\237\344\3126\2451X\374"..., 2720) = 2720
select(4, [3], NULL, NULL, {0, 950000}) = 1 (in [3], left {0, 949998})
read(3, "w\245\254\322\360?Q\27\255x7\230\322\335\243(9\205\344\302k\t\250#\233K\215y\34\301\336N"..., 8192) = 1360
write(4, "w\245\254\322\360?Q\27\255x7\230\322\335\243(9\205\344\302k\t\250#\233K\215y\34\301\336N"..., 1360) = 1360
select(4, [3], NULL, NULL, {0, 950000}) = 1 (in [3], left {0, 949998})
read(3, "\327\261\1,\206\344\345$%>\2262-\37B0\366!\305K t\300\27.w\352\234\26*\310\203"..., 7306) = 1460
write(4, "\327\261\1,\206\344\345$%>\2262-\37B0\366!\305K t\300\27.w\352\234\26*\310\203"..., 1460) = 1460
select(4, [3], NULL, NULL, {0, 950000}) = 1 (in [3], left {0, 949414})
read(3, "E\315\215G6oC=L\202\354\30\36\245Z\242y\324\0218\315\315\241\367\333\24\2314\224Hqs"..., 5846) = 1360
write(4, "E\315\215G6oC=L\202\354\30\36\245Z\242y\324\0218\315\315\241\367\333\24\2314\224Hqs"..., 1360) = 1360
select(4, [3], NULL, NULL, {0, 950000}) = 1 (in [3], left {0, 949998})
read(3, "p\"\204\216\320!w#\265\31\267,7\266.\27\370h\\k\17\1\215{\222\347\217\1#\342\305\254"..., 4486) = 2720
write(4, "p\"\204\216\320!w#\265\31\267,7\266.\27\370h\\k\17\1\215{\222\347\217\1#\342\305\254"..., 2720) = 2720
select(4, [3], NULL, NULL, {0, 950000}) = 1 (in [3], left {0, 949857})
read(3, "\360\23\233\206(#\300BT\266F\303\23\\\270\\&\267\2642\235\7\244m\302E\224$b\257\26\f"..., 1766) = 1766
write(4, "\360\23\233\206(#\300BT\266F\303\23\\\270\\&\267\2642\235\7\244m\302E\224$b\257\26\f"..., 1766) = 1766
write(2, "\r", 1)                       = 1
write(2, "100%[==========================="..., 79) = 79
write(2, "\n\n", 2)                     = 2
close(4)                                = 0
munmap(0x7f76b35a5000, 4096)            = 0
stat("/etc/localtime", {st_mode=S_IFREG|0644, st_size=3519, ...}) = 0
utime("/home/bearface/website_output/www.usc.edu/x/usc_homepage/assets/css/fonts/ProximaNova-Bold-webfont.eot", [2014/06/30-12:14:55, 2011/12/21-18:58:18]) = 0
write(2, "2014-06-30 12:14:55 (308 KB/s) -"..., 163) = 163
statfs("/home/bearface/website_output/www.usc.edu/x/usc_homepage/assets/css/fonts", {f_type="EXT2_SUPER_MAGIC", f_bsize=4096, f_blocks=59275954, f_bfree=49147799, f_bavail=46130993, f_files=15065088, f_ffree=14788567, f_fsid={533008265, 2108930253}, f_namelen=255, f_frsize=4096}) = 0
stat("/home/bearface/website_output/www.usc.edu/x/usc_homepage/assets/css/fonts/ProximaNova-Bold-webfont.eot?", 0x7fff959168a0) = -1 ENOENT (No such file or directory)
stat("/home/bearface/website_output/www.usc.edu/x/usc_homepage/assets/css/fonts/ProximaNova-Bold-webfont.eot?", 0x7fff95916930) = -1 ENOENT (No such file or directory)
statfs("/home/bearface/website_output/www.usc.edu/x/usc_homepage/assets/css/fonts", {f_type="EXT2_SUPER_MAGIC", f_bsize=4096, f_blocks=59275954, f_bfree=49147799, f_bavail=46130993, f_files=15065088, f_ffree=14788567, f_fsid={533008265, 2108930253}, f_namelen=255, f_frsize=4096}) = 0
stat("/home/bearface/website_output/www.usc.edu/x/usc_homepage/assets/css/fonts/ProximaNova-Bold-webfont.eot?", 0x7fff959168a0) = -1 ENOENT (No such file or directory)
nanosleep({1, 0}, 0x7fff959169b0)       = 0
stat("/etc/localtime", {st_mode=S_IFREG|0644, st_size=3519, ...}) = 0
write(2, "--2014-06-30 12:14:56--  http://"..., 106) = 106
select(4, [3], NULL, NULL, {0, 1})      = 1 (in [3], left {0, 0})
close(3)                                = 0
