select(4, [3], NULL, NULL, {0, 1})      = 0 (Timeout)
getpeername(3, {sa_family=AF_INET, sin_port=htons(80), sin_addr=inet_addr("128.83.40.144")}, [16]) = 0
write(2, "Reusing existing connection to w"..., 50) = 50
select(4, NULL, [3], NULL, {900, 0})    = 1 (out [3], left {899, 999998})
write(3, "GET /sites/all/themes/webcentral"..., 249) = 249
write(2, "HTTP request sent, awaiting resp"..., 40) = 40
select(4, [3], NULL, NULL, {900, 0})    = 1 (in [3], left {899, 952919})
recvfrom(3, "HTTP/1.1 200 OK\r\nDate: Mon, 30 J"..., 511, MSG_PEEK, NULL, NULL) = 511
read(3, "HTTP/1.1 200 OK\r\nDate: Mon, 30 J"..., 271) = 271
write(2, "200 OK\n", 7)                 = 7
stat("/home/bearface/website_output/www.utexas.edu/sites/all/themes/webcentral/_images/whatstartshere.png", 0x7fff188c2380) = -1 ENOENT (No such file or directory)
write(2, "Length: ", 8)                 = 8
write(2, "3258", 4)                     = 4
write(2, " (3.2K)", 7)                  = 7
write(2, " [image/png]\n", 13)          = 13
stat("/home/bearface/website_output/www.utexas.edu/sites/all/themes/webcentral/_images", {st_mode=S_IFDIR|0755, st_size=4096, ...}) = 0
open("/home/bearface/website_output/www.utexas.edu/sites/all/themes/webcentral/_images/whatstartshere.png", O_WRONLY|O_CREAT|O_TRUNC, 0666) = 4
write(2, "Saving to: \342\200\230/home/bearface/web"..., 117) = 117
write(2, "\n", 1)                       = 1
write(2, "\r", 1)                       = 1
write(2, " 0% [                           "..., 79) = 79
select(4, [3], NULL, NULL, {0, 950000}) = 1 (in [3], left {0, 949997})
read(3, "\211PNG\r\n\32\n\0\0\0\rIHDR\0\0\1\"\0\0\0\f\10\6\0\0\0\306o\260"..., 3258) = 3258
fstat(4, {st_mode=S_IFREG|0644, st_size=0, ...}) = 0
mmap(NULL, 4096, PROT_READ|PROT_WRITE, MAP_PRIVATE|MAP_ANONYMOUS, -1, 0) = 0x7fa25aace000
write(4, "\211PNG\r\n\32\n\0\0\0\rIHDR\0\0\1\"\0\0\0\f\10\6\0\0\0\306o\260"..., 3258) = 3258
write(2, "\r", 1)                       = 1
write(2, "100%[==========================="..., 79) = 79
write(2, "\n\n", 2)                     = 2
close(4)                                = 0
munmap(0x7fa25aace000, 4096)            = 0
stat("/etc/localtime", {st_mode=S_IFREG|0644, st_size=3519, ...}) = 0
utime("/home/bearface/website_output/www.utexas.edu/sites/all/themes/webcentral/_images/whatstartshere.png", [2014/06/30-12:12:03, 2012/07/30-13:58:57]) = 0
write(2, "2014-06-30 12:12:03 (27.4 MB/s) "..., 159) = 159
statfs("/home/bearface/website_output/www.utexas.edu/sites/all/themes/webcentral/_images", {f_type="EXT2_SUPER_MAGIC", f_bsize=4096, f_blocks=59275954, f_bfree=49151490, f_bavail=46134684, f_files=15065088, f_ffree=14788730, f_fsid={533008265, 2108930253}, f_namelen=255, f_frsize=4096}) = 0
stat("/home/bearface/website_output/www.utexas.edu/sites/all/themes/webcentral/_images/whatstartshere_hover.png", 0x7fff188c2850) = -1 ENOENT (No such file or directory)
stat("/home/bearface/website_output/www.utexas.edu/sites/all/themes/webcentral/_images/whatstartshere_hover.png", 0x7fff188c28e0) = -1 ENOENT (No such file or directory)
statfs("/home/bearface/website_output/www.utexas.edu/sites/all/themes/webcentral/_images", {f_type="EXT2_SUPER_MAGIC", f_bsize=4096, f_blocks=59275954, f_bfree=49151490, f_bavail=46134684, f_files=15065088, f_ffree=14788730, f_fsid={533008265, 2108930253}, f_namelen=255, f_frsize=4096}) = 0
stat("/home/bearface/website_output/www.utexas.edu/sites/all/themes/webcentral/_images/whatstartshere_hover.png", 0x7fff188c2850) = -1 ENOENT (No such file or directory)
nanosleep({1, 0}, 0x7fff188c2960)       = 0
stat("/etc/localtime", {st_mode=S_IFREG|0644, st_size=3519, ...}) = 0
write(2, "--2014-06-30 12:12:04--  http://"..., 108) = 108
select(4, [3], NULL, NULL, {0, 1})      = 0 (Timeout)
getpeername(3, {sa_family=AF_INET, sin_port=htons(80), sin_addr=inet_addr("128.83.40.144")}, [16]) = 0
write(2, "Reusing existing connection to w"..., 50) = 50
select(4, NULL, [3], NULL, {900, 0})    = 1 (out [3], left {899, 999995})
write(3, "GET /sites/all/themes/webcentral"..., 255) = 255
write(2, "HTTP request sent, awaiting resp"..., 40) = 40
select(4, [3], NULL, NULL, {900, 0})    = 1 (in [3], left {899, 956342})
recvfrom(3, "HTTP/1.1 200 OK\r\nDate: Mon, 30 J"..., 511, MSG_PEEK, NULL, NULL) = 511
read(3, "HTTP/1.1 200 OK\r\nDate: Mon, 30 J"..., 271) = 271
write(2, "200 OK\n", 7)                 = 7
stat("/home/bearface/website_output/www.utexas.edu/sites/all/themes/webcentral/_images/whatstartshere_hover.png", 0x7fff188c2380) = -1 ENOENT (No such file or directory)
write(2, "Length: ", 8)                 = 8
write(2, "3333", 4)                     = 4
write(2, " (3.3K)", 7)                  = 7
write(2, " [image/png]\n", 13)          = 13
stat("/home/bearface/website_output/www.utexas.edu/sites/all/themes/webcentral/_images", {st_mode=S_IFDIR|0755, st_size=4096, ...}) = 0
open("/home/bearface/website_output/www.utexas.edu/sites/all/themes/webcentral/_images/whatstartshere_hover.png", O_WRONLY|O_CREAT|O_TRUNC, 0666) = 4
write(2, "Saving to: \342\200\230/home/bearface/web"..., 123) = 123
write(2, "\n", 1)                       = 1
write(2, "\r", 1)                       = 1
write(2, " 0% [                           "..., 79) = 79
select(4, [3], NULL, NULL, {0, 950000}) = 1 (in [3], left {0, 949993})
read(3, "\211PNG\r\n\32\n\0\0\0\rIHDR\0\0\1\"\0\0\0\f\10\6\0\0\0\306o\260"..., 3333) = 3333
fstat(4, {st_mode=S_IFREG|0644, st_size=0, ...}) = 0
mmap(NULL, 4096, PROT_READ|PROT_WRITE, MAP_PRIVATE|MAP_ANONYMOUS, -1, 0) = 0x7fa25aace000
write(4, "\211PNG\r\n\32\n\0\0\0\rIHDR\0\0\1\"\0\0\0\f\10\6\0\0\0\306o\260"..., 3333) = 3333
write(2, "\r", 1)                       = 1
write(2, "100%[==========================="..., 79) = 79
write(2, "\n\n", 2)                     = 2
close(4)                                = 0
munmap(0x7fa25aace000, 4096)            = 0
stat("/etc/localtime", {st_mode=S_IFREG|0644, st_size=3519, ...}) = 0
utime("/home/bearface/website_output/www.utexas.edu/sites/all/themes/webcentral/_images/whatstartshere_hover.png", [2014/06/30-12:12:04, 2012/07/30-14:07:15]) = 0
