write(4, "\0\0\0\0\0\0\3\0B\377\364\2\234\3\215\0\10\0\21\0!\0}\0\262\23\0\0+\260\33\315"..., 2736) = 2736
select(4, [3], NULL, NULL, {0, 950000}) = 1 (in [3], left {0, 949997})
read(3, " /\260\t\326\260\f\315\260\f\20\261\21\1+\260\4\315\260\0232\263\33\4\21\10+\260\0\315\261!"..., 8192) = 1368
write(4, " /\260\t\326\260\f\315\260\f\20\261\21\1+\260\4\315\260\0232\263\33\4\21\10+\260\0\315\261!"..., 1368) = 1368
select(4, [3], NULL, NULL, {0, 950000}) = 1 (in [3], left {0, 949540})
read(3, "\16\315\263\4\16\0\10+\260\n\315\1\260\24/\260\7\326\260\6\315\260\6\20\261\20\1+\260\21\315\261"..., 8192) = 1368
write(4, "\16\315\263\4\16\0\10+\260\n\315\1\260\24/\260\7\326\260\6\315\260\6\20\261\20\1+\260\21\315\261"..., 1368) = 1368
select(4, [3], NULL, NULL, {0, 950000}) = 1 (in [3], left {0, 927461})
read(3, "\260\25\20\261\21\1+\260\f\315\261\27\1+\261\21\25\21\22\263\1\4\t\0$\0279\0\261\1\17\21"..., 8192) = 1368
write(4, "\260\25\20\261\21\1+\260\f\315\261\27\1+\261\21\25\21\22\263\1\4\t\0$\0279\0\261\1\17\21"..., 1368) = 1368
select(4, [3], NULL, NULL, {0, 950000}) = 1 (in [3], left {0, 949992})
read(3, "\2\300\16\260\4\20\260\5\300\2725\273\335:\0\25+\n\261\4\5\10\260\6\20\260\5\300\4\260\7\20"..., 8192) = 4104
write(4, "\2\300\16\260\4\20\260\5\300\2725\273\335:\0\25+\n\261\4\5\10\260\6\20\260\5\300\4\260\7\20"..., 4096) = 4096
write(4, "\261\7\10\10\260\t\20\260", 8) = 8
select(4, [3], NULL, NULL, {0, 950000}) = 1 (in [3], left {0, 949994})
read(3, "\10\300\16\260\n\20\260\v\300\272\306\333\343.\0\25+\n\4\260\1.\261\3\2\10\260\2\300\4\261\0"..., 8192) = 5472
write(4, "\10\300\16\260\n\20\260\v\300\272\306\333\343.\0\25+\n\4\260\1.\261\3\2\10\260\2\300\4\261\0"..., 4096) = 4096
write(4, "\264\2\5\10\v\23.....\1\262\2\v\23...\260@\32\1\261\t\10\21\22\260\0169\0"..., 1376) = 1376
select(4, [3], NULL, NULL, {0, 950000}) = 1 (in [3], left {0, 949996})
read(3, "\21\22\260\0069013#\21!2\26\25\24\6+\0017264&+\1\25\320\216\0018iw"..., 8192) = 1368
write(4, "\21\22\260\0069013#\21!2\26\25\24\6+\0017264&+\1\25\320\216\0018iw"..., 1368) = 1368
select(4, [3], NULL, NULL, {0, 950000}) = 1 (in [3], left {0, 947720})
read(3, "\2\36\375\342\0\0\2\0\31\0\0\2\365\2\233\0\f\0\24\0L\0\262\1\0\0+\260\17\315\262\4"..., 8192) = 1368
write(4, "\2\36\375\342\0\0\2\0\31\0\0\2\365\2\233\0\f\0\24\0L\0\262\1\0\0+\260\17\315\262\4"..., 1368) = 1368
select(4, [3], NULL, NULL, {0, 950000}) = 1 (in [3], left {0, 949541})
read(3, "9QP:=\303\233y\255\254\21\20\31i\31\24eO\224hk\224\0\0\0\0\3\0?\0\0\2"..., 8192) = 2736
write(4, "9QP:=\303\233y\255\254\21\20\31i\31\24eO\224hk\224\0\0\0\0\3\0?\0\0\2"..., 2736) = 2736
select(4, [3], NULL, NULL, {0, 950000}) = 1 (in [3], left {0, 949997})
read(3, "+\262\3\2\0+\262\0\1\0+\260\0073\260\30\315\260+2\1\2602/\260\26\326\260\33\315\260\33"..., 8192) = 1368
write(4, "+\262\3\2\0+\262\0\1\0+\260\0073\260\30\315\260+2\1\2602/\260\26\326\260\33\315\260\33"..., 1368) = 1368
select(4, [3], NULL, NULL, {0, 950000}) = 1 (in [3], left {0, 949997})
read(3, ".\35\0\0\0\0\1\0\24\377\364\1\323\1\357\0\27\0[\0\262\0\0\0+\260\5\315\262\23\1\0"..., 8192) = 2736
write(4, ".\35\0\0\0\0\1\0\24\377\364\1\323\1\357\0\27\0[\0\262\0\0\0+\260\5\315\262\23\1\0"..., 2736) = 2736
select(4, [3], NULL, NULL, {0, 950000}) = 1 (in [3], left {0, 949997})
read(3, "\315\262\3\0\n+\263@\3\5\t+\1\260\10/\260\2\326\260\1\315\260\1\20\261\4\1+\260\6\315"..., 8192) = 2736
write(4, "\315\262\3\0\n+\263@\3\5\t+\1\260\10/\260\2\326\260\1\315\260\1\20\261\4\1+\260\6\315"..., 2736) = 2736
select(4, [3], NULL, NULL, {0, 950000}) = 1 (in [3], left {0, 949321})
read(3, "(\34\30\22\27\n\24\34=-@XBW\30 \33\25\20\25\n\25\35@.DW\2+'\35\34"..., 8192) = 1368
write(4, "(\34\30\22\27\n\24\34=-@XBW\30 \33\25\20\25\n\25\35@.DW\2+'\35\34"..., 1368) = 1368
select(4, [3], NULL, NULL, {0, 950000}) = 1 (in [3], left {0, 949997})
read(3, " \377<\1\340\1\357\0\30\0#\0-\0\215\0\262\1\0\0+\262\4\0\0+\260\31\315\262\25\1"..., 8192) = 2736
write(4, " \377<\1\340\1\357\0\30\0#\0-\0\215\0\262\1\0\0+\262\4\0\0+\260\31\315\262\25\1"..., 2736) = 2736
select(4, [3], NULL, NULL, {0, 950000}) = 1 (in [3], left {0, 949997})
read(3, "\341\1\375T\\<< **\0\0\0\377\377\0 \377\364\1\340\3\n\0#\1\324\0\0\0\0\0"..., 8192) = 1368
write(4, "\341\1\375T\\<< **\0\0\0\377\377\0 \377\364\1\340\3\n\0#\1\324\0\0\0\0\0"..., 1368) = 1368
select(4, [3], NULL, NULL, {0, 950000}) = 1 (in [3], left {0, 949997})
read(3, "\23\0\32\0$\0S\0\262\0\0\0+\260\16\315\262\6\1\0+\260\27\315\260\33/\260 \315\264\32"..., 8192) = 2736
write(4, "\23\0\32\0$\0S\0\262\0\0\0+\260\16\315\262\6\1\0+\260\27\315\260\33/\260 \315\264\32"..., 2736) = 2736
select(4, [3], NULL, NULL, {0, 950000}) = 1 (in [3], left {0, 949997})
read(3, "q\0\262\7\0\0+\260\22\315\262\f\2\0+\260\26\315\260&/\260\34\315\1\260(/\260\n\326\260"..., 8192) = 2736
write(4, "q\0\262\7\0\0+\260\22\315\262\f\2\0+\260\26\315\260&/\260\34\315\1\260(/\260\n\326\260"..., 2736) = 2736
select(4, [3], NULL, NULL, {0, 950000}) = 1 (in [3], left {0, 949997})
read(3, "\3\1+\260\10\315\260\10\20\261\33\1+\260\16\315\260\0352\263%\16\33\10+\260\n\315\261+\1+"..., 8192) = 2736
write(4, "\3\1+\260\10\315\260\10\20\261\33\1+\260\16\315\260\0352\263%\16\33\10+\260\n\315\261+\1+"..., 2736) = 2736
select(4, [3], NULL, NULL, {0, 950000}) = 1 (in [3], left {0, 949997})
read(3, "\0\t+\262\f\10\n+\263@\f\5\t+\260\0062\261\17\1+\2606\32\2726\n\335\266\0\25+"..., 8192) = 1368
write(4, "\0\t+\262\f\10\n+\263@\f\5\t+\260\0062\261\17\1+\2606\32\2726\n\335\266\0\25+"..., 1368) = 1368
select(4, [3], NULL, NULL, {0, 950000}) = 1 (in [3], left {0, 949997})
read(3, "\260\6\326\260\22\315\260\0332\260\22\20\261\26\1+\260\1\315\261\"\1+\261\26\22\21\22\263\t\16\3"..., 8192) = 2736
write(4, "\260\6\326\260\22\315\260\0332\260\22\20\261\26\1+\260\1\315\261\"\1+\261\26\22\21\22\263\t\16\3"..., 2736) = 2736
select(4, [3], NULL, NULL, {0, 950000}) = 1 (in [3], left {0, 929762})
read(3, "\21\1\f\21;\20\371\21P\21\223\f\v\376~\v\f\252\5\t\347\347\347HBH\342\342\342\342\342\342"..., 8192) = 1368
write(4, "\21\1\f\21;\20\371\21P\21\223\f\v\376~\v\f\252\5\t\347\347\347HBH\342\342\342\342\342\342"..., 1368) = 1368
select(4, [3], NULL, NULL, {0, 950000}) = 1 (in [3], left {0, 949586})
read(3, "\t\300\272;,\347\236\0\25+\n\4\260\2.\5\260\3\300\261\v%\371\261\t\n\10\260\n\300\0\262"..., 8192) = 2736
write(4, "\t\300\272;,\347\236\0\25+\n\4\260\2.\5\260\3\300\261\v%\371\261\t\n\10\260\n\300\0\262"..., 2736) = 2736
select(4, [3], NULL, NULL, {0, 950000}) = 1 (in [3], left {0, 949994})
read(3, "\376\262\1CM\375e\2\233\0\1\0\0\0Q\2\32\1\352\0\6\0\37\0\262\4\1\0+\260\1/"..., 8192) = 4104
write(4, "\376\262\1CM\375e\2\233\0\1\0\0\0Q\2\32\1\352\0\6\0\37\0\262\4\1\0+\260\1/"..., 4096) = 4096
write(4, "3265\0213\21\24", 8)          = 8
select(4, [3], NULL, NULL, {0, 950000}) = 1 (in [3], left {0, 949996})
read(3, "\6\333\200PP[H6&\32\21\30\34 bb\1\t>--\37 ,\270,1\34#\36#\36"..., 8192) = 4104
write(4, "\6\333\200PP[H6&\32\21\30\34 bb\1\t>--\37 ,\270,1\34#\36#\36"..., 4096) = 4096
write(4, "j\234\32/%\1\1%", 8)          = 8
select(4, [3], NULL, NULL, {0, 950000}) = 1 (in [3], left {0, 949997})
