read(3, "\377\330\377\340\0\20JFIF\0\1\1\0\0\1\0\1\0\0\377\376\0;CREATOR:"..., 7822) = 3781
fstat(4, {st_mode=S_IFREG|0644, st_size=0, ...}) = 0
mmap(NULL, 4096, PROT_READ|PROT_WRITE, MAP_PRIVATE|MAP_ANONYMOUS, -1, 0) = 0x7fcea595e000
write(4, "\377\330\377\340\0\20JFIF\0\1\1\0\0\1\0\1\0\0\377\376\0;CREATOR:"..., 3781) = 3781
select(4, [3], NULL, NULL, {0, 950000}) = 1 (in [3], left {0, 920732})
read(3, "zq^\v\253B\326\3360\202\325\211\"\335B\201\351\324\377\0Z\372kO\360\342\351\272m\304\315+"..., 4041) = 4041
write(4, "zq^\v\253B\326\3360\202\325\211\"\335B\201\351\324\377\0Z\372kO\360\342\351\272m\304\315+"..., 4041) = 4041
write(2, "\r", 1)                       = 1
write(2, "100%[==========================="..., 79) = 79
write(2, "\n\n", 2)                     = 2
close(4)                                = 0
munmap(0x7fcea595e000, 4096)            = 0
stat("/etc/localtime", {st_mode=S_IFREG|0644, st_size=3519, ...}) = 0
utime("/home/bearface/website_output/www.uchicago.edu/news_feeds_cache/dcwulqtxrs.17993.20140612.jpeg", [2014/06/30-12:28:20, 2014/06/30-12:25:07]) = 0
write(2, "2014-06-30 12:28:20 (253 KB/s) -"..., 153) = 153
statfs("/home/bearface/website_output/www.uchicago.edu/news_feeds_cache", {f_type="EXT2_SUPER_MAGIC", f_bsize=4096, f_blocks=59275954, f_bfree=49123723, f_bavail=46106917, f_files=15065088, f_ffree=14788080, f_fsid={533008265, 2108930253}, f_namelen=255, f_frsize=4096}) = 0
stat("/home/bearface/website_output/www.uchicago.edu/news_feeds_cache/txvmwsrqjz.17979.20140624.jpeg", 0x7fff7e3ef680) = -1 ENOENT (No such file or directory)
stat("/home/bearface/website_output/www.uchicago.edu/news_feeds_cache/txvmwsrqjz.17979.20140624.jpeg", 0x7fff7e3ef710) = -1 ENOENT (No such file or directory)
statfs("/home/bearface/website_output/www.uchicago.edu/news_feeds_cache", {f_type="EXT2_SUPER_MAGIC", f_bsize=4096, f_blocks=59275954, f_bfree=49123723, f_bavail=46106917, f_files=15065088, f_ffree=14788080, f_fsid={533008265, 2108930253}, f_namelen=255, f_frsize=4096}) = 0
stat("/home/bearface/website_output/www.uchicago.edu/news_feeds_cache/txvmwsrqjz.17979.20140624.jpeg", 0x7fff7e3ef680) = -1 ENOENT (No such file or directory)
nanosleep({1, 0}, 0x7fff7e3ef790)       = 0
stat("/etc/localtime", {st_mode=S_IFREG|0644, st_size=3519, ...}) = 0
write(2, "--2014-06-30 12:28:21--  http://"..., 97) = 97
select(4, [3], NULL, NULL, {0, 1})      = 0 (Timeout)
getpeername(3, {sa_family=AF_INET, sin_port=htons(80), sin_addr=inet_addr("198.101.129.15")}, [16]) = 0
write(2, "Reusing existing connection to w"..., 52) = 52
select(4, NULL, [3], NULL, {900, 0})    = 1 (out [3], left {899, 999997})
write(3, "GET /news_feeds_cache/txvmwsrqjz"..., 358) = 358
write(2, "HTTP request sent, awaiting resp"..., 40) = 40
select(4, [3], NULL, NULL, {900, 0})    = 1 (in [3], left {899, 969610})
recvfrom(3, "HTTP/1.1 200 OK\r\nDate: Mon, 30 J"..., 511, MSG_PEEK, NULL, NULL) = 511
read(3, "HTTP/1.1 200 OK\r\nDate: Mon, 30 J"..., 315) = 315
write(2, "200 OK\n", 7)                 = 7
stat("/home/bearface/website_output/www.uchicago.edu/news_feeds_cache/txvmwsrqjz.17979.20140624.jpeg", 0x7fff7e3ef1b0) = -1 ENOENT (No such file or directory)
write(2, "Length: ", 8)                 = 8
write(2, "9774", 4)                     = 4
write(2, " (9.5K)", 7)                  = 7
write(2, " [image/jpeg]\n", 14)         = 14
stat("/home/bearface/website_output/www.uchicago.edu/news_feeds_cache", {st_mode=S_IFDIR|0755, st_size=4096, ...}) = 0
open("/home/bearface/website_output/www.uchicago.edu/news_feeds_cache/txvmwsrqjz.17979.20140624.jpeg", O_WRONLY|O_CREAT|O_TRUNC, 0666) = 4
write(2, "Saving to: \342\200\230/home/bearface/web"..., 112) = 112
write(2, "\n", 1)                       = 1
write(2, "\r", 1)                       = 1
write(2, " 0% [                           "..., 79) = 79
select(4, [3], NULL, NULL, {0, 950000}) = 1 (in [3], left {0, 949996})
read(3, "\377\330\377\340\0\20JFIF\0\1\1\0\0\1\0\1\0\0\377\376\0;CREATOR:"..., 8192) = 3781
fstat(4, {st_mode=S_IFREG|0644, st_size=0, ...}) = 0
mmap(NULL, 4096, PROT_READ|PROT_WRITE, MAP_PRIVATE|MAP_ANONYMOUS, -1, 0) = 0x7fcea595e000
write(4, "\377\330\377\340\0\20JFIF\0\1\1\0\0\1\0\1\0\0\377\376\0;CREATOR:"..., 3781) = 3781
select(4, [3], NULL, NULL, {0, 950000}) = 1 (in [3], left {0, 921845})
read(3, "\327\260\363\2\177\272+'\25)\273\232\2518\303C\215\213\303\2360\2065\216?\35_,k\300Q\27"..., 5993) = 2736
write(4, "\327\260\363\2\177\272+'\25)\273\232\2518\303C\215\213\303\2360\2065\216?\35_,k\300Q\27"..., 2736) = 2736
select(4, [3], NULL, NULL, {0, 950000}) = 1 (in [3], left {0, 949995})
read(3, "j>-\3225\235\16]CG\275\212\376\326\"D\336^U\220\214pT\340\216\265\315\370V\324\"\315"..., 3257) = 2736
write(4, "j>-\3225\235\16]CG\275\212\376\326\"D\336^U\220\214pT\340\216\265\315\370V\324\"\315"..., 2736) = 2736
select(4, [3], NULL, NULL, {0, 950000}) = 1 (in [3], left {0, 949139})
read(3, "-\316\337l\327\227\350\232\224\272%\206\247\f<\313v\0Iv\34\250\31\376\206\250\301$\360\261>{"..., 521) = 521
write(4, "-\316\337l\327\227\350\232\224\272%\206\247\f<\313v\0Iv\34\250\31\376\206\250\301$\360\261>{"..., 521) = 521
write(2, "\r", 1)                       = 1
write(2, "100%[==========================="..., 79) = 79
write(2, "\n\n", 2)                     = 2
close(4)                                = 0
munmap(0x7fcea595e000, 4096)            = 0
stat("/etc/localtime", {st_mode=S_IFREG|0644, st_size=3519, ...}) = 0
utime("/home/bearface/website_output/www.uchicago.edu/news_feeds_cache/txvmwsrqjz.17979.20140624.jpeg", [2014/06/30-12:28:21, 2014/06/30-12:25:07]) = 0
write(2, "2014-06-30 12:28:21 (313 KB/s) -"..., 153) = 153
statfs("/home/bearface/website_output/www.uchicago.edu/i/homepage/crescat/spring", 0x7fff7e3ef630) = -1 ENOENT (No such file or directory)
statfs("/home/bearface/website_output/www.uchicago.edu/i/homepage/crescat", 0x7fff7e3ef630) = -1 ENOENT (No such file or directory)
statfs("/home/bearface/website_output/www.uchicago.edu/i/homepage", 0x7fff7e3ef630) = -1 ENOENT (No such file or directory)
statfs("/home/bearface/website_output/www.uchicago.edu/i", {f_type="EXT2_SUPER_MAGIC", f_bsize=4096, f_blocks=59275954, f_bfree=49123676, f_bavail=46106870, f_files=15065088, f_ffree=14788078, f_fsid={533008265, 2108930253}, f_namelen=255, f_frsize=4096}) = 0
stat("/home/bearface/website_output/www.uchicago.edu/i/homepage/crescat/spring/rotator.php", 0x7fff7e3ef680) = -1 ENOENT (No such file or directory)
stat("/home/bearface/website_output/www.uchicago.edu/i/homepage/crescat/spring/rotator.php", 0x7fff7e3ef710) = -1 ENOENT (No such file or directory)
statfs("/home/bearface/website_output/www.uchicago.edu/i/homepage/crescat/spring", 0x7fff7e3ef630) = -1 ENOENT (No such file or directory)
statfs("/home/bearface/website_output/www.uchicago.edu/i/homepage/crescat", 0x7fff7e3ef630) = -1 ENOENT (No such file or directory)
statfs("/home/bearface/website_output/www.uchicago.edu/i/homepage", 0x7fff7e3ef630) = -1 ENOENT (No such file or directory)
