write(2, "\n", 1)                       = 1
write(2, "\r", 1)                       = 1
write(2, " 0% [                           "..., 79) = 79
select(4, [3], NULL, NULL, {0, 950000}) = 1 (in [3], left {0, 949997})
read(3, "/*!\n * iScroll v4.1.9 ~ Copyrigh"..., 8192) = 2820
fstat(4, {st_mode=S_IFREG|0644, st_size=0, ...}) = 0
mmap(NULL, 4096, PROT_READ|PROT_WRITE, MAP_PRIVATE|MAP_ANONYMOUS, -1, 0) = 0x7f76b35a5000
write(4, "/*!\n * iScroll v4.1.9 ~ Copyrigh"..., 2820) = 2820
select(4, [3], NULL, NULL, {0, 950000}) = 1 (in [3], left {0, 949275})
read(3, "nRefresh: null,\n\t\t\tonBeforeScrol"..., 8192) = 1360
write(4, "nRefresh: null,\n\t\t\tonBeforeScrol"..., 1360) = 1360
select(4, [3], NULL, NULL, {0, 950000}) = 1 (in [3], left {0, 849761})
read(3, "or + 'TransformOrigin'] = '0 0';"..., 8192) = 3980
write(4, "or + 'TransformOrigin'] = '0 0';"..., 3980) = 3980
select(4, [3], NULL, NULL, {0, 950000}) = 1 (in [3], left {0, 949997})
read(3, "lbarSize * that.hScrollbarSize /"..., 8192) = 1360
write(4, "lbarSize * that.hScrollbarSize /"..., 1360) = 1360
select(4, [3], NULL, NULL, {0, 950000}) = 1 (in [3], left {0, 949746})
read(3, "on (dir, hidden) {\n\t\tvar that = "..., 8192) = 1360
write(4, "on (dir, hidden) {\n\t\tvar that = "..., 1360) = 1360
select(4, [3], NULL, NULL, {0, 950000}) = 1 (in [3], left {0, 949949})
read(3, "\n\n\t\tif (that.options.onBeforeScr"..., 8192) = 1360
write(4, "\n\n\t\tif (that.options.onBeforeScr"..., 1360) = 1360
select(4, [3], NULL, NULL, {0, 950000}) = 1 (in [3], left {0, 949678})
read(3, "if (x != that.x || y != that.y) "..., 8192) = 1360
write(4, "if (x != that.x || y != that.y) "..., 1360) = 1360
select(4, [3], NULL, NULL, {0, 950000}) = 1 (in [3], left {0, 934723})
read(3, "cale / that.options.zoomMin);\n\t\t"..., 8192) = 1460
write(4, "cale / that.options.zoomMin);\n\t\t"..., 1460) = 1460
select(4, [3], NULL, NULL, {0, 950000}) = 1 (in [3], left {0, 945447})
read(3, "ewY);\n\t\tthat.dirX = deltaX > 0 ?"..., 8192) = 1360
write(4, "ewY);\n\t\tthat.dirX = deltaX > 0 ?"..., 1360) = 1360
select(4, [3], NULL, NULL, {0, 950000}) = 1 (in [3], left {0, 945437})
read(3, " + that.y + 'px' + trnClose + ' "..., 8192) = 1360
write(4, " + that.y + 'px' + trnClose + ' "..., 1360) = 1360
select(4, [3], NULL, NULL, {0, 950000}) = 1 (in [3], left {0, 945747})
read(3, " that.options.zoom ? 250 : 0);\n\t"..., 8192) = 1360
write(4, " that.options.zoom ? 250 : 0);\n\t"..., 1360) = 1360
select(4, [3], NULL, NULL, {0, 950000}) = 1 (in [3], left {0, 934851})
read(3, " }\n\t\t\t\telse {\n\t\t\t\t\tsnap = that._"..., 8192) = 1360
write(4, " }\n\t\t\t\telse {\n\t\t\t\t\tsnap = that._"..., 1360) = 1360
select(4, [3], NULL, NULL, {0, 950000}) = 1 (in [3], left {0, 949996})
read(3, "custom code on scroll end\n\t\t\t}\n\n"..., 8192) = 1360
write(4, "custom code on scroll end\n\t\t\t}\n\n"..., 1360) = 1360
select(4, [3], NULL, NULL, {0, 950000}) = 1 (in [3], left {0, 949324})
read(3, " deltaScale, 400);\n\t\t\t\t\n\t\t\t\tsetT"..., 8192) = 1360
write(4, " deltaScale, 400);\n\t\t\t\t\n\t\t\t\tsetT"..., 1360) = 1360
select(4, [3], NULL, NULL, {0, 950000}) = 1 (in [3], left {0, 897303})
read(3, "step.time);\n\t\t\tthat._pos(step.x,"..., 8192) = 8060
write(4, "step.time);\n\t\t\tthat._pos(step.x,"..., 4096) = 4096
write(4, "clearInterval(that.checkDOMTime)"..., 3964) = 3964
write(2, "\r", 1)                       = 1
write(2, "93% [==========================="..., 79) = 79
select(4, [3], NULL, NULL, {0, 950000}) = 1 (in [3], left {0, 932265})
read(3, "geY+1 : pageY == 'prev' ? that.c"..., 2052) = 1360
write(4, "geY+1 : pageY == 'prev' ? that.c"..., 1360) = 1360
select(4, [3], NULL, NULL, {0, 950000}) = 1 (in [3], left {0, 949019})
read(3, "+ that.x;\n\t\tthat.y = y - y * rel"..., 692) = 692
write(4, "+ that.x;\n\t\tthat.y = y - y * rel"..., 692) = 692
write(2, "\r", 1)                       = 1
write(2, "100%[==========================="..., 79) = 79
write(2, "\n\n", 2)                     = 2
close(4)                                = 0
munmap(0x7f76b35a5000, 4096)            = 0
stat("/etc/localtime", {st_mode=S_IFREG|0644, st_size=3519, ...}) = 0
utime("/home/bearface/website_output/www.usc.edu/x/usc_homepage/assets/js/iscroll.js", [2014/06/30-12:14:24, 2011/12/21-18:58:05]) = 0
write(2, "2014-06-30 12:14:24 (146 KB/s) -"..., 138) = 138
statfs("/home/bearface/website_output/www.usc.edu/x/usc_homepage/assets/js", {f_type="EXT2_SUPER_MAGIC", f_bsize=4096, f_blocks=59275954, f_bfree=49149920, f_bavail=46133114, f_files=15065088, f_ffree=14788604, f_fsid={533008265, 2108930253}, f_namelen=255, f_frsize=4096}) = 0
stat("/home/bearface/website_output/www.usc.edu/x/usc_homepage/assets/js/usc_v4.js?v=4", 0x7fff959168a0) = -1 ENOENT (No such file or directory)
stat("/home/bearface/website_output/www.usc.edu/x/usc_homepage/assets/js/usc_v4.js?v=4", 0x7fff95916930) = -1 ENOENT (No such file or directory)
statfs("/home/bearface/website_output/www.usc.edu/x/usc_homepage/assets/js", {f_type="EXT2_SUPER_MAGIC", f_bsize=4096, f_blocks=59275954, f_bfree=49149920, f_bavail=46133114, f_files=15065088, f_ffree=14788604, f_fsid={533008265, 2108930253}, f_namelen=255, f_frsize=4096}) = 0
stat("/home/bearface/website_output/www.usc.edu/x/usc_homepage/assets/js/usc_v4.js?v=4", 0x7fff959168a0) = -1 ENOENT (No such file or directory)
nanosleep({1, 0}, 0x7fff959169b0)       = 0
stat("/etc/localtime", {st_mode=S_IFREG|0644, st_size=3519, ...}) = 0
write(2, "--2014-06-30 12:14:25--  http://"..., 83) = 83
