stat("/home/bearface/website_output/www.uchicago.edu/c", 0x7fff7e3ef0c0) = -1 ENOENT (No such file or directory)
mkdir("/home/bearface/website_output/www.uchicago.edu/c", 0777) = 0
open("/home/bearface/website_output/www.uchicago.edu/c/base_styles.min.css?updated=201406242014", O_WRONLY|O_CREAT|O_TRUNC, 0666) = 4
write(2, "Saving to: \342\200\230/home/bearface/web"..., 107) = 107
write(2, "\n", 1)                       = 1
write(2, "\r", 1)                       = 1
write(2, " 0% [                           "..., 79) = 79
select(4, [3], NULL, NULL, {0, 950000}) = 1 (in [3], left {0, 949993})
read(3, "/*The University of Chicago Scre"..., 8192) = 3743
fstat(4, {st_mode=S_IFREG|0644, st_size=0, ...}) = 0
mmap(NULL, 4096, PROT_READ|PROT_WRITE, MAP_PRIVATE|MAP_ANONYMOUS, -1, 0) = 0x7fcea595e000
write(4, "/*The University of Chicago Scre"..., 3743) = 3743
select(4, [3], NULL, NULL, {0, 950000}) = 1 (in [3], left {0, 923329})
read(3, "ght:after{content:'\357\230\243'}.ss-quor"..., 8192) = 2736
write(4, "ght:after{content:'\357\230\243'}.ss-quor"..., 2736) = 2736
select(4, [3], NULL, NULL, {0, 950000}) = 1 (in [3], left {0, 949530})
read(3, ":before,[class*=\" ss-\"].ss-stand"..., 8192) = 1368
write(4, ":before,[class*=\" ss-\"].ss-stand"..., 1368) = 1368
select(4, [3], NULL, NULL, {0, 950000}) = 1 (in [3], left {0, 949863})
read(3, ".right:after{content:'\360\237\223\235'}.ss-"..., 8192) = 1368
write(4, ".right:after{content:'\360\237\223\235'}.ss-"..., 1368) = 1368
select(4, [3], NULL, NULL, {0, 950000}) = 1 (in [3], left {0, 949499})
read(3, "me.right:after{content:'\356\214\240'}.ss"..., 8192) = 1368
write(4, "me.right:after{content:'\356\214\240'}.ss"..., 1368) = 1368
select(4, [3], NULL, NULL, {0, 950000}) = 1 (in [3], left {0, 948684})
read(3, "ter{content:'\356\231\263'}.ss-location:b"..., 8192) = 1368
write(4, "ter{content:'\356\231\263'}.ss-location:b"..., 1368) = 1368
select(4, [3], NULL, NULL, {0, 950000}) = 1 (in [3], left {0, 924630})
read(3, "huffle:before,.ss-shuffle.right:"..., 8192) = 2736
write(4, "huffle:before,.ss-shuffle.right:"..., 2736) = 2736
select(4, [3], NULL, NULL, {0, 950000}) = 1 (in [3], left {0, 949993})
read(3, "caution.right:after{content:'\342\233\224"..., 8192) = 1368
write(4, "caution.right:after{content:'\342\233\224"..., 1368) = 1368
select(4, [3], NULL, NULL, {0, 950000}) = 1 (in [3], left {0, 949523})
read(3, "ore,.ss-right.right:after{conten"..., 8192) = 1368
write(4, "ore,.ss-right.right:after{conten"..., 1368) = 1368
select(4, [3], NULL, NULL, {0, 950000}) = 1 (in [3], left {0, 949124})
read(3, "gcaption,figure,footer,header,hg"..., 8192) = 1368
write(4, "gcaption,figure,footer,header,hg"..., 1368) = 1368
select(4, [3], NULL, NULL, {0, 950000}) = 1 (in [3], left {0, 949212})
read(3, "rder:0; -ms-interpolation-mode:b"..., 8192) = 1368
write(4, "rder:0; -ms-interpolation-mode:b"..., 1368) = 1368
select(4, [3], NULL, NULL, {0, 950000}) = 1 (in [3], left {0, 949433})
read(3, "*width:99.94680850063828%;}.row-"..., 8192) = 1368
write(4, "*width:99.94680850063828%;}.row-"..., 1368) = 1368
select(4, [3], NULL, NULL, {0, 950000}) = 1 (in [3], left {0, 949939})
read(3, "+thead tr:first-child th, .table"..., 8192) = 1368
write(4, "+thead tr:first-child th, .table"..., 1368) = 1368
select(4, [3], NULL, NULL, {0, 950000}) = 1 (in [3], left {0, 949997})
read(3, "body:first-child tr:first-child "..., 8192) = 2736
write(4, "body:first-child tr:first-child "..., 2736) = 2736
select(4, [3], NULL, NULL, {0, 950000}) = 1 (in [3], left {0, 949997})
read(3, ":15px; padding-right:15px; margi"..., 8192) = 2736
write(4, ":15px; padding-right:15px; margi"..., 2736) = 2736
select(4, [3], NULL, NULL, {0, 950000}) = 1 (in [3], left {0, 926654})
read(3, "gin-left:-1px; -webkit-border-ra"..., 8192) = 1368
write(4, "gin-left:-1px; -webkit-border-ra"..., 1368) = 1368
select(4, [3], NULL, NULL, {0, 950000}) = 1 (in [3], left {0, 945982})
read(3, "ottom:0;}.navbar-form input[type"..., 8192) = 6840
write(4, "ottom:0;}.navbar-form input[type"..., 4096) = 4096
write(4, ":active, .container.page .btn-su"..., 2744) = 2744
select(4, [3], NULL, NULL, {0, 950000}) = 1 (in [3], left {0, 949110})
read(3, "-250px 0 0 -280px; background-co"..., 8192) = 5472
write(4, "-250px 0 0 -280px; background-co"..., 4096) = 4096
write(4, "sabled] {cursor:default; backgro"..., 1376) = 1376
select(4, [3], NULL, NULL, {0, 950000}) = 1 (in [3], left {0, 949216})
read(3, "0055cc); background-image:linear"..., 8192) = 2736
write(4, "0055cc); background-image:linear"..., 2736) = 2736
select(4, [3], NULL, NULL, {0, 950000}) = 1 (in [3], left {0, 928258})
read(3, ":-ms-linear-gradient(top, #62c46"..., 8192) = 1368
write(4, ":-ms-linear-gradient(top, #62c46"..., 1368) = 1368
select(4, [3], NULL, NULL, {0, 950000}) = 1 (in [3], left {0, 949482})
read(3, "gradient(startColorstr='#5bc0de'"..., 8192) = 1368
write(4, "gradient(startColorstr='#5bc0de'"..., 1368) = 1368
select(4, [3], NULL, NULL, {0, 950000}) = 1 (in [3], left {0, 947952})
