write(4, "GIF89a\"\0\31\0\304\30\0\266\233\220v%\253X\7\215Z\t\217t#\251Y\10\216m"..., 207) = 207
write(2, "\r", 1)                       = 1
write(2, "100%[==========================="..., 79) = 79
write(2, "\n\n", 2)                     = 2
close(4)                                = 0
munmap(0x7f6a77ed4000, 4096)            = 0
stat("/etc/localtime", {st_mode=S_IFREG|0644, st_size=3519, ...}) = 0
utime("/home/bearface/website_output/www.nyu.edu/common/images/gradientPipeArrowAZ.gif", [2014/06/30-12:09:18, 2014/02/21-16:48:12]) = 0
write(2, "2014-06-30 12:09:18 (1.64 MB/s) "..., 137) = 137
statfs("/home/bearface/website_output/www.nyu.edu/common/images/search", {f_type="EXT2_SUPER_MAGIC", f_bsize=4096, f_blocks=59275954, f_bfree=49160383, f_bavail=46143577, f_files=15065088, f_ffree=14788951, f_fsid={533008265, 2108930253}, f_namelen=255, f_frsize=4096}) = 0
stat("/home/bearface/website_output/www.nyu.edu/common/images/search/gradientPipeArrowHover.gif", {st_mode=S_IFREG|0644, st_size=73, ...}) = 0
lstat("/home/bearface/website_output/www.nyu.edu/common/images/search/gradientPipeArrowHover.gif", {st_mode=S_IFREG|0644, st_size=73, ...}) = 0
stat("/home/bearface/website_output/www.nyu.edu/common/images/search/gradientPipeArrowHover.gif", {st_mode=S_IFREG|0644, st_size=73, ...}) = 0
statfs("/home/bearface/website_output/www.nyu.edu/common/images/search", {f_type="EXT2_SUPER_MAGIC", f_bsize=4096, f_blocks=59275954, f_bfree=49160382, f_bavail=46143576, f_files=15065088, f_ffree=14788951, f_fsid={533008265, 2108930253}, f_namelen=255, f_frsize=4096}) = 0
stat("/home/bearface/website_output/www.nyu.edu/common/images/search/gradientPipeArrowHover.gif", {st_mode=S_IFREG|0644, st_size=73, ...}) = 0
lstat("/home/bearface/website_output/www.nyu.edu/common/images/search/gradientPipeArrowHover.gif", {st_mode=S_IFREG|0644, st_size=73, ...}) = 0
nanosleep({1, 0}, 0x7fff7afecca0)       = 0
stat("/etc/localtime", {st_mode=S_IFREG|0644, st_size=3519, ...}) = 0
write(2, "--2014-06-30 12:09:19--  http://"..., 92) = 92
select(4, [3], NULL, NULL, {0, 1})      = 0 (Timeout)
getpeername(3, {sa_family=AF_INET, sin_port=htons(80), sin_addr=inet_addr("128.122.119.202")}, [16]) = 0
write(2, "Reusing existing connection to w"..., 47) = 47
select(4, NULL, [3], NULL, {900, 0})    = 1 (out [3], left {899, 999997})
write(3, "GET /common/images/search/gradie"..., 242) = 242
write(2, "HTTP request sent, awaiting resp"..., 40) = 40
select(4, [3], NULL, NULL, {900, 0})    = 1 (in [3], left {899, 971257})
recvfrom(3, "HTTP/1.1 200 OK\r\nDate: Mon, 30 J"..., 511, MSG_PEEK, NULL, NULL) = 432
read(3, "HTTP/1.1 200 OK\r\nDate: Mon, 30 J"..., 359) = 359
write(2, "200 OK\n", 7)                 = 7
stat("/home/bearface/website_output/www.nyu.edu/common/images/search/gradientPipeArrowHover.gif", {st_mode=S_IFREG|0644, st_size=73, ...}) = 0
write(2, "Length: ", 8)                 = 8
write(2, "73", 2)                       = 2
write(2, " [image/gif]\n", 13)          = 13
stat("/home/bearface/website_output/www.nyu.edu/common/images/search", {st_mode=S_IFDIR|0755, st_size=4096, ...}) = 0
open("/home/bearface/website_output/www.nyu.edu/common/images/search/gradientPipeArrowHover.gif", O_WRONLY|O_CREAT|O_TRUNC, 0666) = 4
write(2, "Saving to: \342\200\230/home/bearface/web"..., 107) = 107
write(2, "\n", 1)                       = 1
write(2, "\r", 1)                       = 1
write(2, " 0% [                           "..., 79) = 79
select(4, [3], NULL, NULL, {0, 950000}) = 1 (in [3], left {0, 949993})
read(3, "GIF89a\"\0\31\0\200\1\0\336\0H\334\351\352!\371\4\1\0\0\1\0,\0\0\0\0"..., 73) = 73
fstat(4, {st_mode=S_IFREG|0644, st_size=0, ...}) = 0
mmap(NULL, 4096, PROT_READ|PROT_WRITE, MAP_PRIVATE|MAP_ANONYMOUS, -1, 0) = 0x7f6a77ed4000
write(4, "GIF89a\"\0\31\0\200\1\0\336\0H\334\351\352!\371\4\1\0\0\1\0,\0\0\0\0"..., 73) = 73
write(2, "\r", 1)                       = 1
write(2, "100%[==========================="..., 79) = 79
write(2, "\n\n", 2)                     = 2
close(4)                                = 0
munmap(0x7f6a77ed4000, 4096)            = 0
stat("/etc/localtime", {st_mode=S_IFREG|0644, st_size=3519, ...}) = 0
utime("/home/bearface/website_output/www.nyu.edu/common/images/search/gradientPipeArrowHover.gif", [2014/06/30-12:09:19, 2014/02/21-16:48:12]) = 0
write(2, "2014-06-30 12:09:19 (208 KB/s) -"..., 144) = 144
statfs("/home/bearface/website_output/www.nyu.edu/common/images", {f_type="EXT2_SUPER_MAGIC", f_bsize=4096, f_blocks=59275954, f_bfree=49160323, f_bavail=46143517, f_files=15065088, f_ffree=14788950, f_fsid={533008265, 2108930253}, f_namelen=255, f_frsize=4096}) = 0
stat("/home/bearface/website_output/www.nyu.edu/common/images/searchBar.gif", {st_mode=S_IFREG|0644, st_size=687, ...}) = 0
lstat("/home/bearface/website_output/www.nyu.edu/common/images/searchBar.gif", {st_mode=S_IFREG|0644, st_size=687, ...}) = 0
stat("/home/bearface/website_output/www.nyu.edu/common/images/searchBar.gif", {st_mode=S_IFREG|0644, st_size=687, ...}) = 0
statfs("/home/bearface/website_output/www.nyu.edu/common/images", {f_type="EXT2_SUPER_MAGIC", f_bsize=4096, f_blocks=59275954, f_bfree=49160322, f_bavail=46143516, f_files=15065088, f_ffree=14788950, f_fsid={533008265, 2108930253}, f_namelen=255, f_frsize=4096}) = 0
stat("/home/bearface/website_output/www.nyu.edu/common/images/searchBar.gif", {st_mode=S_IFREG|0644, st_size=687, ...}) = 0
lstat("/home/bearface/website_output/www.nyu.edu/common/images/searchBar.gif", {st_mode=S_IFREG|0644, st_size=687, ...}) = 0
nanosleep({1, 0}, 0x7fff7afecca0)       = 0
stat("/etc/localtime", {st_mode=S_IFREG|0644, st_size=3519, ...}) = 0
write(2, "--2014-06-30 12:09:20--  http://"..., 72) = 72
select(4, [3], NULL, NULL, {0, 1})      = 0 (Timeout)
getpeername(3, {sa_family=AF_INET, sin_port=htons(80), sin_addr=inet_addr("128.122.119.202")}, [16]) = 0
write(2, "Reusing existing connection to w"..., 47) = 47
select(4, NULL, [3], NULL, {900, 0})    = 1 (out [3], left {899, 999997})
write(3, "GET /common/images/searchBar.gif"..., 222) = 222
write(2, "HTTP request sent, awaiting resp"..., 40) = 40
select(4, [3], NULL, NULL, {900, 0})    = 1 (in [3], left {899, 939232})
recvfrom(3, "HTTP/1.1 200 OK\r\nDate: Mon, 30 J"..., 511, MSG_PEEK, NULL, NULL) = 511
read(3, "HTTP/1.1 200 OK\r\nDate: Mon, 30 J"..., 361) = 361
write(2, "200 OK\n", 7)                 = 7
stat("/home/bearface/website_output/www.nyu.edu/common/images/searchBar.gif", {st_mode=S_IFREG|0644, st_size=687, ...}) = 0
write(2, "Length: ", 8)                 = 8
write(2, "687", 3)                      = 3
