<svg width="27px" height="25px" viewBox="0 0 27 25" version="1.1" xmlns="http://www.w3.org/2000/svg">
    <defs></defs>
    <g id="Page-1" stroke="none" stroke-width="1" fill="none" fill-rule="evenodd">
        <g id="3513" transform="translate(4.000000, 0.000000)" fill-rule="nonzero" fill="#ffffff">
            <path d="M18.0342716,10.3432584 C14.7966667,3.45140449 13.1139753,0.834269663 7.82369136,0.94241573 C5.93967901,0.980898876 6.3922963,-0.407303371 4.95579012,0.119382022 C3.52041975,0.646348315 4.75219753,1.41713483 3.28360494,2.60898876 C-0.83737037,5.95505618 -0.457444444,9.0508427 1.45354321,16.4289326 C2.25939506,19.536236 -0.48754321,19.688764 0.599419753,22.7014045 C1.39249383,24.8977528 7.24187654,25.8174157 13.4132593,23.5519663 C19.584642,21.2870787 23.4801605,16.7907303 22.6870864,14.594382 C21.5998395,11.5817416 19.3986543,13.2449438 18.0342716,10.3432584 Z M12.7434198,21.6960674 C7.23193827,23.7191011 2.70207407,22.5289326 2.51069136,22.0002809 C2.18074074,21.0879213 4.28992593,18.0449438 10.5910741,15.7317416 C16.8927901,13.4188202 20.4089506,14.2764045 20.7766667,15.2955056 C20.9941728,15.897191 18.2554691,19.6730337 12.7434198,21.6960674 Z M10.9721358,16.7876404 C8.09060494,17.8455056 6.08790123,19.0553371 4.79223457,20.1446629 C5.704,20.9643258 7.41309877,21.1643258 9.11680247,20.5390449 C11.2853333,19.7432584 12.6167778,17.9162921 12.0900494,16.4587079 C12.0840864,16.4410112 12.0744321,16.4252809 12.0679012,16.4078652 C11.7123951,16.5241573 11.3475185,16.65 10.9721358,16.7876404 Z" id="Shape"></path>
        </g>
    </g>
</svg>
