^C:\USERS\MOXLEY\DOCUMENTS\GUIDYNAMIC\MAIN.CPP
/c /IC:\USERS\MOXLEY\DOCUMENTS\GUIDYNAMIC\BUILD /IC:\USERS\MOXLEY\DOCUMENTS\GUIDYNAMIC /IC:\USERS\MOXLEY\DOCUMENTS\GUIDYNAMIC\BUILD\HELLOWORLD_AUTOGEN\INCLUDE /IC:\QT\5.8\MSVC2015_64\INCLUDE /IC:\QT\5.8\MSVC2015_64\INCLUDE\QTWIDGETS /IC:\QT\5.8\MSVC2015_64\INCLUDE\QTGUI /IC:\QT\5.8\MSVC2015_64\INCLUDE\QTANGLE /IC:\QT\5.8\MSVC2015_64\INCLUDE\QTCORE /I"C:\QT\5.8\MSVC2015_64\.\MKSPECS\WIN32-MSVC2015" /Zi /nologo /W3 /WX- /Od /Ob0 /D WIN32 /D _WINDOWS /D QT_WIDGETS_LIB /D QT_GUI_LIB /D QT_CORE_LIB /D "CMAKE_INTDIR=\"Debug\"" /D _MBCS /Gm- /EHsc /RTC1 /MDd /GS /fp:precise /Zc:wchar_t /Zc:forScope /Zc:inline /GR /Fo"HELLOWORLD.DIR\DEBUG\\" /Fd"HELLOWORLD.DIR\DEBUG\VC140.PDB" /Gd /TP C:\USERS\MOXLEY\DOCUMENTS\GUIDYNAMIC\MAIN.CPP
^C:\USERS\MOXLEY\DOCUMENTS\GUIDYNAMIC\BUILD\HELLOWORLD_AUTOGEN\MOC_COMPILATION.CPP
/c /IC:\USERS\MOXLEY\DOCUMENTS\GUIDYNAMIC\BUILD /IC:\USERS\MOXLEY\DOCUMENTS\GUIDYNAMIC /IC:\USERS\MOXLEY\DOCUMENTS\GUIDYNAMIC\BUILD\HELLOWORLD_AUTOGEN\INCLUDE /IC:\QT\5.8\MSVC2015_64\INCLUDE /IC:\QT\5.8\MSVC2015_64\INCLUDE\QTWIDGETS /IC:\QT\5.8\MSVC2015_64\INCLUDE\QTGUI /IC:\QT\5.8\MSVC2015_64\INCLUDE\QTANGLE /IC:\QT\5.8\MSVC2015_64\INCLUDE\QTCORE /I"C:\QT\5.8\MSVC2015_64\.\MKSPECS\WIN32-MSVC2015" /Zi /nologo /W3 /WX- /Od /Ob0 /D WIN32 /D _WINDOWS /D QT_WIDGETS_LIB /D QT_GUI_LIB /D QT_CORE_LIB /D "CMAKE_INTDIR=\"Debug\"" /D _MBCS /Gm- /EHsc /RTC1 /MDd /GS /fp:precise /Zc:wchar_t /Zc:forScope /Zc:inline /GR /Fo"HELLOWORLD.DIR\DEBUG\\" /Fd"HELLOWORLD.DIR\DEBUG\VC140.PDB" /Gd /TP C:\USERS\MOXLEY\DOCUMENTS\GUIDYNAMIC\BUILD\HELLOWORLD_AUTOGEN\MOC_COMPILATION.CPP
^C:\USERS\MOXLEY\DOCUMENTS\GUIDYNAMIC\MAINWINDOW.CPP
/c /IC:\USERS\MOXLEY\DOCUMENTS\GUIDYNAMIC\BUILD /IC:\USERS\MOXLEY\DOCUMENTS\GUIDYNAMIC /IC:\USERS\MOXLEY\DOCUMENTS\GUIDYNAMIC\BUILD\HELLOWORLD_AUTOGEN\INCLUDE /IC:\QT\5.8\MSVC2015_64\INCLUDE /IC:\QT\5.8\MSVC2015_64\INCLUDE\QTWIDGETS /IC:\QT\5.8\MSVC2015_64\INCLUDE\QTGUI /IC:\QT\5.8\MSVC2015_64\INCLUDE\QTANGLE /IC:\QT\5.8\MSVC2015_64\INCLUDE\QTCORE /I"C:\QT\5.8\MSVC2015_64\.\MKSPECS\WIN32-MSVC2015" /Zi /nologo /W3 /WX- /Od /Ob0 /D WIN32 /D _WINDOWS /D QT_WIDGETS_LIB /D QT_GUI_LIB /D QT_CORE_LIB /D "CMAKE_INTDIR=\"Debug\"" /D _MBCS /Gm- /EHsc /RTC1 /MDd /GS /fp:precise /Zc:wchar_t /Zc:forScope /Zc:inline /GR /Fo"HELLOWORLD.DIR\DEBUG\\" /Fd"HELLOWORLD.DIR\DEBUG\VC140.PDB" /Gd /TP C:\USERS\MOXLEY\DOCUMENTS\GUIDYNAMIC\MAINWINDOW.CPP
