#Command:  
^C:\C++\APPLICATION_DESIGN_PART1\BIN\CMAKEFILES\3.7.2\COMPILERIDC\DEBUG\CMAKECCOMPILERID.OBJ
C:\USERS\RADU\APPDATA\LOCAL\MICROSOFT\APPLICATIONINSIGHTS\VSTELAIF-312CBD79-9DBB-4C48-A7DA-3CC2A931CB70\4F8AA237B8DB47BD9E1B1C0B2ECC879C.TMP
