#Command:  
^C:\C++\DSP\AQUILA\BIN\CMAKEFILES\3.7.2\COMPILERIDCXX\DEBUG\CMAKECXXCOMPILERID.OBJ
C:\PROGRAMDATA\MICROSOFT\WINDOWS\WER\REPORTQUEUE\NONCRITICAL_VCTIP.EXE_FA3F56286735C412927232DFAF152F7E4D865291_00000000_3A550D3D\REPORT.WER
