^C:\USERS\MOXLEY\DOCUMENTS\GUIADDBUTTONS\BUILD\HELLOWORLD.DIR\DEBUG\MAIN.OBJ|C:\USERS\MOXLEY\DOCUMENTS\GUIADDBUTTONS\BUILD\HELLOWORLD.DIR\DEBUG\MAINWINDOW.OBJ|C:\USERS\MOXLEY\DOCUMENTS\GUIADDBUTTONS\BUILD\HELLOWORLD.DIR\DEBUG\MOC_COMPILATION.OBJ
C:\WINDOWS\GLOBALIZATION\SORTING\SORTDEFAULT.NLS
C:\PROGRAM FILES (X86)\WINDOWS KITS\8.1\LIB\WINV6.3\UM\X64\KERNEL32.LIB
C:\PROGRAM FILES (X86)\WINDOWS KITS\8.1\LIB\WINV6.3\UM\X64\USER32.LIB
C:\PROGRAM FILES (X86)\WINDOWS KITS\8.1\LIB\WINV6.3\UM\X64\GDI32.LIB
C:\PROGRAM FILES (X86)\WINDOWS KITS\8.1\LIB\WINV6.3\UM\X64\WINSPOOL.LIB
C:\PROGRAM FILES (X86)\WINDOWS KITS\8.1\LIB\WINV6.3\UM\X64\SHELL32.LIB
C:\PROGRAM FILES (X86)\WINDOWS KITS\8.1\LIB\WINV6.3\UM\X64\OLE32.LIB
C:\PROGRAM FILES (X86)\WINDOWS KITS\8.1\LIB\WINV6.3\UM\X64\OLEAUT32.LIB
C:\PROGRAM FILES (X86)\WINDOWS KITS\8.1\LIB\WINV6.3\UM\X64\UUID.LIB
C:\PROGRAM FILES (X86)\WINDOWS KITS\8.1\LIB\WINV6.3\UM\X64\COMDLG32.LIB
C:\PROGRAM FILES (X86)\WINDOWS KITS\8.1\LIB\WINV6.3\UM\X64\ADVAPI32.LIB
C:\QT\5.8\MSVC2015_64\LIB\QT5WIDGETSD.LIB
C:\QT\5.8\MSVC2015_64\LIB\QT5GUID.LIB
C:\QT\5.8\MSVC2015_64\LIB\QT5CORED.LIB
C:\QT\5.8\MSVC2015_64\LIB\QTMAIND.LIB
C:\USERS\MOXLEY\DOCUMENTS\GUIADDBUTTONS\BUILD\HELLOWORLD.DIR\DEBUG\MAIN.OBJ
C:\USERS\MOXLEY\DOCUMENTS\GUIADDBUTTONS\BUILD\HELLOWORLD.DIR\DEBUG\MAINWINDOW.OBJ
C:\USERS\MOXLEY\DOCUMENTS\GUIADDBUTTONS\BUILD\HELLOWORLD.DIR\DEBUG\MOC_COMPILATION.OBJ
C:\WINDOWS\SYSTEM32\TZRES.DLL
C:\PROGRAM FILES (X86)\MICROSOFT VISUAL STUDIO 14.0\VC\LIB\AMD64\MSVCPRTD.LIB
C:\PROGRAM FILES (X86)\MICROSOFT VISUAL STUDIO 14.0\VC\LIB\AMD64\MSVCRTD.LIB
C:\PROGRAM FILES (X86)\MICROSOFT VISUAL STUDIO 14.0\VC\LIB\AMD64\OLDNAMES.LIB
C:\PROGRAM FILES (X86)\MICROSOFT VISUAL STUDIO 14.0\VC\LIB\AMD64\VCRUNTIMED.LIB
C:\PROGRAM FILES (X86)\WINDOWS KITS\10\LIB\10.0.10240.0\UCRT\X64\UCRTD.LIB
