^C:\USERS\MOXLEY\DOCUMENTS\CMAKE_AND_BOOST\BUILD\HELLOWORLD.DIR\DEBUG\MAIN.OBJ
C:\USERS\MOXLEY\DOCUMENTS\CMAKE_AND_BOOST\BUILD\DEBUG\HELLOWORLD.ILK
C:\USERS\MOXLEY\DOCUMENTS\CMAKE_AND_BOOST\BUILD\DEBUG\HELLOWORLD.EXE
C:\USERS\MOXLEY\DOCUMENTS\CMAKE_AND_BOOST\BUILD\DEBUG\HELLOWORLD.PDB
