#Command: "C:\Windows\system32\wermgr.exe" "-queuereporting_s_user" "C:\Users\MRN\AppData\Local\Microsoft\Windows\WER\ReportQueue\NonCritical_VCTIP.EXE_fa3f56286735c412927232dfaf152f7e4d865291_00000000_cab_32b6e187" 
C:\WINDOWS\GLOBALIZATION\SORTING\SORTDEFAULT.NLS
C:\PROGRAM FILES (X86)\MICROSOFT VISUAL STUDIO 14.0\VC\BIN\X86_AMD64\VCTIP.EXE
C:\WINDOWS\FONTS\STATICCACHE.DAT
