^C:\USERS\MRN\DOCUMENTS\_CODEZILLA_\FRAMEWORK + QCUSTOMPLOT COURSE\SRC\SPRING\LOADER\MAIN.CPP
C:\USERS\MRN\DOCUMENTS\_CODEZILLA_\FRAMEWORK + QCUSTOMPLOT COURSE\BUILD\SRC\SPRING\LOADER\LOADER.DIR\DEBUG\VC140.PDB
C:\USERS\MRN\DOCUMENTS\_CODEZILLA_\FRAMEWORK + QCUSTOMPLOT COURSE\BUILD\SRC\SPRING\LOADER\LOADER.DIR\DEBUG\MAIN.OBJ
