#Command:  
^C:\USERS\MRN\DOCUMENTS\_CODEZILLA_\FRAMEWORK + QCUSTOMPLOT COURSE\BUILD\CMAKEFILES\3.8.0-RC2\COMPILERIDC\DEBUG\CMAKECCOMPILERID.OBJ
C:\USERS\MRN\APPDATA\LOCAL\MICROSOFT\APPLICATIONINSIGHTS\VSTELAIF-312CBD79-9DBB-4C48-A7DA-3CC2A931CB70\58D02F8031E34B5590BD3D1D315C8551.TMP
