#Command:  
^C:\C++\DSP\AQUILA\BIN\CMAKEFILES\3.7.2\COMPILERIDCXX\DEBUG\CMAKECXXCOMPILERID.OBJ
C:\USERS\RADU\APPDATA\LOCAL\MICROSOFT\APPLICATIONINSIGHTS\VSTELAIF-312CBD79-9DBB-4C48-A7DA-3CC2A931CB70\A8508B9C64F74C368B2921656BCE267D.TMP
