^C:\SPRING-SCHOOL-FRAMEWORK-STRUCTURE-COMPLETE\BIN\SRC\SPRING\LOADER\LOADER.DIR\DEBUG\MAIN.OBJ
C:\SPRING-SCHOOL-FRAMEWORK-STRUCTURE-COMPLETE\BIN\DEBUG\LOADER.ILK
C:\SPRING-SCHOOL-FRAMEWORK-STRUCTURE-COMPLETE\BIN\DEBUG\LOADER.EXE
C:\SPRING-SCHOOL-FRAMEWORK-STRUCTURE-COMPLETE\BIN\DEBUG\LOADER.PDB
