^C:\C++\APPLICATION_DESIGN_PART1\BIN\SRC\SPRING\APPLICATION\APPLICATION.DIR\DEBUG\APPLICATIONMODEL.OBJ|C:\C++\APPLICATION_DESIGN_PART1\BIN\SRC\SPRING\APPLICATION\APPLICATION.DIR\DEBUG\APPLICATION_AUTOMOC.OBJ|C:\C++\APPLICATION_DESIGN_PART1\BIN\SRC\SPRING\APPLICATION\APPLICATION.DIR\DEBUG\BASESCENE.OBJ|C:\C++\APPLICATION_DESIGN_PART1\BIN\SRC\SPRING\APPLICATION\APPLICATION.DIR\DEBUG\INITIALSCENE.OBJ
C:\C++\APPLICATION_DESIGN_PART1\BIN\DEBUG\APPLICATION.ILK
C:\C++\APPLICATION_DESIGN_PART1\BIN\DEBUG\APPLICATION.DLL
C:\C++\APPLICATION_DESIGN_PART1\BIN\DEBUG\APPLICATION.PDB
