^C:\USERS\MRN\DOCUMENTS\_CODEZILLA_\FRAMEWORK + QCUSTOMPLOT COURSE\BUILD\SRC\SPRING\FRAMEWORK\FRAMEWORK.DIR\DEBUG\APPLICATION.OBJ|C:\USERS\MRN\DOCUMENTS\_CODEZILLA_\FRAMEWORK + QCUSTOMPLOT COURSE\BUILD\SRC\SPRING\FRAMEWORK\FRAMEWORK.DIR\DEBUG\MOC_COMPILATION.OBJ|C:\USERS\MRN\DOCUMENTS\_CODEZILLA_\FRAMEWORK + QCUSTOMPLOT COURSE\BUILD\SRC\SPRING\FRAMEWORK\FRAMEWORK.DIR\DEBUG\SCENEMACHINE.OBJ
C:\USERS\MRN\DOCUMENTS\_CODEZILLA_\FRAMEWORK + QCUSTOMPLOT COURSE\BIN\DEBUG\FRAMEWORK.ILK
C:\USERS\MRN\DOCUMENTS\_CODEZILLA_\FRAMEWORK + QCUSTOMPLOT COURSE\BIN\DEBUG\FRAMEWORK.DLL
C:\USERS\MRN\DOCUMENTS\_CODEZILLA_\FRAMEWORK + QCUSTOMPLOT COURSE\BIN\DEBUG\FRAMEWORK.PDB
