#Command:  
^C:\USERS\MRN\DOCUMENTS\_CODEZILLA_\FRAMEWORK + QCUSTOMPLOT COURSE\BUILD\CMAKEFILES\3.8.0-RC2\COMPILERIDC\DEBUG\CMAKECCOMPILERID.OBJ
C:\PROGRAM FILES (X86)\MICROSOFT VISUAL STUDIO 14.0\VC\BIN\X86_AMD64\VCTIP.EXE
C:\WINDOWS\SYSTEM32\NTDLL.DLL
C:\WINDOWS\SYSTEM32\MSCOREE.DLL
C:\WINDOWS\SYSTEM32\KERNEL32.DLL
C:\WINDOWS\SYSTEM32\KERNELBASE.DLL
C:\PROGRAM FILES (X86)\MSBUILD\14.0\BIN\FILETRACKER32.DLL
C:\WINDOWS\SYSTEM32\API-MS-WIN-CRT-STDIO-L1-1-0.DLL
C:\WINDOWS\SYSTEM32\VCRUNTIME140.DLL
C:\WINDOWS\SYSTEM32\API-MS-WIN-CRT-RUNTIME-L1-1-0.DLL
C:\WINDOWS\SYSTEM32\API-MS-WIN-CRT-MATH-L1-1-0.DLL
C:\WINDOWS\SYSTEM32\API-MS-WIN-CRT-LOCALE-L1-1-0.DLL
C:\WINDOWS\SYSTEM32\API-MS-WIN-CRT-HEAP-L1-1-0.DLL
C:\WINDOWS\SYSTEM32\ADVAPI32.DLL
C:\WINDOWS\SYSTEM32\API-MS-WIN-CRT-STRING-L1-1-0.DLL
C:\WINDOWS\SYSTEM32\API-MS-WIN-CRT-FILESYSTEM-L1-1-0.DLL
C:\WINDOWS\SYSTEM32\API-MS-WIN-CRT-CONVERT-L1-1-0.DLL
C:\WINDOWS\SYSTEM32\OLE32.DLL
C:\WINDOWS\SYSTEM32\OLEAUT32.DLL
C:\WINDOWS\SYSTEM32\MSVCP140.DLL
C:\WINDOWS\SYSTEM32\SHELL32.DLL
C:\WINDOWS\SYSTEM32\MSVCRT.DLL
C:\WINDOWS\SYSTEM32\SECHOST.DLL
C:\WINDOWS\SYSTEM32\RPCRT4.DLL
C:\WINDOWS\SYSTEM32\COMBASE.DLL
C:\WINDOWS\SYSTEM32\GDI32.DLL
C:\WINDOWS\SYSTEM32\USER32.DLL
C:\WINDOWS\SYSTEM32\API-MS-WIN-CRT-MULTIBYTE-L1-1-0.DLL
C:\WINDOWS\SYSTEM32\API-MS-WIN-CRT-TIME-L1-1-0.DLL
C:\WINDOWS\SYSTEM32\API-MS-WIN-CRT-ENVIRONMENT-L1-1-0.DLL
C:\WINDOWS\SYSTEM32\API-MS-WIN-CRT-UTILITY-L1-1-0.DLL
C:\WINDOWS\SYSTEM32\SHLWAPI.DLL
C:\WINDOWS\SYSTEM32\CRYPTBASE.DLL
C:\WINDOWS\SYSTEM32\SSPICLI.DLL
C:\WINDOWS\SYSTEM32\UCRTBASE.DLL
C:\WINDOWS\SYSTEM32\BCRYPTPRIMITIVES.DLL
C:\WINDOWS\SYSTEM32\IMM32.DLL
C:\WINDOWS\SYSTEM32\MSCTF.DLL
C:\WINDOWS\MICROSOFT.NET\FRAMEWORK\V4.0.30319\MSCOREEI.DLL
C:\WINDOWS\SYSTEM32\KERNEL.APPCORE.DLL
C:\WINDOWS\SYSTEM32\VERSION.DLL
C:\WINDOWS\MICROSOFT.NET\FRAMEWORK\V4.0.30319\CLR.DLL
C:\WINDOWS\SYSTEM32\MSVCR120_CLR0400.DLL
C:\WINDOWS\ASSEMBLY\NATIVEIMAGES_V4.0.30319_32\MSCORLIB\02795048C7EDE81AF33ACDB56F905958\MSCORLIB.NI.DLL
C:\WINDOWS\MICROSOFT.NET\FRAMEWORK\V4.0.30319\CLRJIT.DLL
C:\WINDOWS\SYSTEM32\SHCORE.DLL
C:\WINDOWS\ASSEMBLY\NATIVEIMAGES_V4.0.30319_32\SYSTEM\E49AF6ABC3FB5DDA64392CAE6CA45DB9\SYSTEM.NI.DLL
C:\WINDOWS\ASSEMBLY\NATIVEIMAGES_V4.0.30319_32\SYSTEM.CORE\6AD7BDC64040BFDA8AA2C21B1E4394B0\SYSTEM.CORE.NI.DLL
C:\WINDOWS\SYSTEM32\SQMAPI.DLL
C:\WINDOWS\SYSTEM32\BCRYPT.DLL
C:\WINDOWS\SYSTEM32\PROFAPI.DLL
C:\WINDOWS\SYSTEM32\CLBCATQ.DLL
C:\WINDOWS\SYSTEM32\CRYPTSP.DLL
C:\WINDOWS\SYSTEM32\RSAENH.DLL
C:\WINDOWS\ASSEMBLY\NATIVEIMAGES_V4.0.30319_32\SYSTEM.DRAWING\C55A38896FEF55FAFAFD1BE9C8437243\SYSTEM.DRAWING.NI.DLL
C:\WINDOWS\ASSEMBLY\NATIVEIMAGES_V4.0.30319_32\SYSTEM.WINDOWS.FORMS\FE00BBADB017064DC2340734108AD22E\SYSTEM.WINDOWS.FORMS.NI.DLL
C:\WINDOWS\SYSTEM32\UXTHEME.DLL
C:\WINDOWS\WINSXS\X86_MICROSOFT.WINDOWS.GDIPLUS_6595B64144CCF1DF_1.1.9600.18592_NONE_DAE0BA965BC4A8DC\GDIPLUS.DLL
C:\WINDOWS\SYSTEM32\WKSCLI.DLL
C:\WINDOWS\SYSTEM32\NETUTILS.DLL
C:\WINDOWS\ASSEMBLY\NATIVEIMAGES_V4.0.30319_32\SYSTEM.CONFIGURATION\E4B51F793514A0D7324EF02828145130\SYSTEM.CONFIGURATION.NI.DLL
C:\WINDOWS\ASSEMBLY\NATIVEIMAGES_V4.0.30319_32\SYSTEM.XML\4D0104BB5509D906F129D54B070D1BD6\SYSTEM.XML.NI.DLL
C:\WINDOWS\SYSTEM32\RASAPI32.DLL
C:\WINDOWS\SYSTEM32\RASMAN.DLL
C:\WINDOWS\SYSTEM32\WS2_32.DLL
C:\WINDOWS\SYSTEM32\NSI.DLL
C:\WINDOWS\SYSTEM32\RTUTILS.DLL
C:\WINDOWS\SYSTEM32\MSWSOCK.DLL
C:\WINDOWS\SYSTEM32\WINHTTP.DLL
C:\WINDOWS\SYSTEM32\IPHLPAPI.DLL
C:\WINDOWS\SYSTEM32\WINNSI.DLL
C:\WINDOWS\SYSTEM32\DHCPCSVC6.DLL
C:\WINDOWS\SYSTEM32\DHCPCSVC.DLL
C:\WINDOWS\SYSTEM32\DNSAPI.DLL
C:\WINDOWS\SYSTEM32\RASADHLP.DLL
C:\WINDOWS\SYSTEM32\FWPUCLNT.DLL
C:\WINDOWS\SYSTEM32\PSAPI.DLL
C:\WINDOWS\SYSTEM32\SECUR32.DLL
C:\WINDOWS\SYSTEM32\SCHANNEL.DLL
C:\WINDOWS\SYSTEM32\CRYPT32.DLL
C:\WINDOWS\SYSTEM32\MSASN1.DLL
C:\WINDOWS\SYSTEM32\NCRYPT.DLL
C:\WINDOWS\SYSTEM32\NTASN1.DLL
C:\WINDOWS\SYSTEM32\NCRYPTSSLP.DLL
C:\WINDOWS\SYSTEM32\GPAPI.DLL
C:\WINDOWS\ASSEMBLY\NATIVEIMAGES_V4.0.30319_32\SYSTEM.XML.LINQ\84AA347C058F8E8596BDB3A354848F7D\SYSTEM.XML.LINQ.NI.DLL
C:\WINDOWS\MICROSOFT.NET\FRAMEWORK\V4.0.30319\DIASYMREADER.DLL
C:\WINDOWS\MICROSOFT.NET\FRAMEWORK\V4.0.30319\CLRCOMPRESSION.DLL
C:\WINDOWS\ASSEMBLY\NATIVEIMAGES_V4.0.30319_32\SYSTEM.NET.HTTP\2821DC78750C2CE9F32849258E733C72\SYSTEM.NET.HTTP.NI.DLL
C:\WINDOWS\SYSTEM32\WER.DLL
C:\WINDOWS\SYSTEM32\NTMARTA.DLL
C:\WINDOWS\SYSTEM32\DBGHELP.DLL
C:\PROGRAM FILES (X86)\MICROSOFT VISUAL STUDIO 14.0\VC\BIN\X86_AMD64\VCTIP.EXE
C:\WINDOWS\SYSTEM32\NTDLL.DLL
C:\WINDOWS\SYSTEM32\MSCOREE.DLL
C:\WINDOWS\SYSTEM32\KERNEL32.DLL
C:\WINDOWS\SYSTEM32\KERNELBASE.DLL
C:\PROGRAM FILES (X86)\MSBUILD\14.0\BIN\FILETRACKER32.DLL
C:\WINDOWS\SYSTEM32\API-MS-WIN-CRT-STDIO-L1-1-0.DLL
C:\WINDOWS\SYSTEM32\VCRUNTIME140.DLL
C:\WINDOWS\SYSTEM32\API-MS-WIN-CRT-RUNTIME-L1-1-0.DLL
C:\WINDOWS\SYSTEM32\API-MS-WIN-CRT-MATH-L1-1-0.DLL
C:\WINDOWS\SYSTEM32\API-MS-WIN-CRT-LOCALE-L1-1-0.DLL
C:\WINDOWS\SYSTEM32\API-MS-WIN-CRT-HEAP-L1-1-0.DLL
C:\WINDOWS\SYSTEM32\ADVAPI32.DLL
C:\WINDOWS\SYSTEM32\API-MS-WIN-CRT-STRING-L1-1-0.DLL
C:\WINDOWS\SYSTEM32\API-MS-WIN-CRT-FILESYSTEM-L1-1-0.DLL
C:\WINDOWS\SYSTEM32\API-MS-WIN-CRT-CONVERT-L1-1-0.DLL
C:\WINDOWS\SYSTEM32\OLE32.DLL
C:\WINDOWS\SYSTEM32\OLEAUT32.DLL
C:\WINDOWS\SYSTEM32\MSVCP140.DLL
C:\WINDOWS\SYSTEM32\SHELL32.DLL
C:\WINDOWS\SYSTEM32\MSVCRT.DLL
C:\WINDOWS\SYSTEM32\SECHOST.DLL
C:\WINDOWS\SYSTEM32\RPCRT4.DLL
C:\WINDOWS\SYSTEM32\COMBASE.DLL
C:\WINDOWS\SYSTEM32\GDI32.DLL
C:\WINDOWS\SYSTEM32\USER32.DLL
C:\WINDOWS\SYSTEM32\API-MS-WIN-CRT-MULTIBYTE-L1-1-0.DLL
C:\WINDOWS\SYSTEM32\API-MS-WIN-CRT-TIME-L1-1-0.DLL
C:\WINDOWS\SYSTEM32\API-MS-WIN-CRT-ENVIRONMENT-L1-1-0.DLL
C:\WINDOWS\SYSTEM32\API-MS-WIN-CRT-UTILITY-L1-1-0.DLL
C:\WINDOWS\SYSTEM32\SHLWAPI.DLL
C:\WINDOWS\SYSTEM32\CRYPTBASE.DLL
C:\WINDOWS\SYSTEM32\SSPICLI.DLL
C:\WINDOWS\SYSTEM32\UCRTBASE.DLL
C:\WINDOWS\SYSTEM32\BCRYPTPRIMITIVES.DLL
C:\WINDOWS\SYSTEM32\IMM32.DLL
C:\WINDOWS\SYSTEM32\MSCTF.DLL
C:\WINDOWS\MICROSOFT.NET\FRAMEWORK\V4.0.30319\MSCOREEI.DLL
C:\WINDOWS\SYSTEM32\KERNEL.APPCORE.DLL
C:\WINDOWS\SYSTEM32\VERSION.DLL
C:\WINDOWS\MICROSOFT.NET\FRAMEWORK\V4.0.30319\CLR.DLL
C:\WINDOWS\SYSTEM32\MSVCR120_CLR0400.DLL
C:\WINDOWS\ASSEMBLY\NATIVEIMAGES_V4.0.30319_32\MSCORLIB\02795048C7EDE81AF33ACDB56F905958\MSCORLIB.NI.DLL
C:\WINDOWS\MICROSOFT.NET\FRAMEWORK\V4.0.30319\CLRJIT.DLL
C:\WINDOWS\SYSTEM32\SHCORE.DLL
C:\WINDOWS\ASSEMBLY\NATIVEIMAGES_V4.0.30319_32\SYSTEM\E49AF6ABC3FB5DDA64392CAE6CA45DB9\SYSTEM.NI.DLL
C:\WINDOWS\ASSEMBLY\NATIVEIMAGES_V4.0.30319_32\SYSTEM.CORE\6AD7BDC64040BFDA8AA2C21B1E4394B0\SYSTEM.CORE.NI.DLL
C:\WINDOWS\SYSTEM32\SQMAPI.DLL
C:\WINDOWS\SYSTEM32\BCRYPT.DLL
C:\WINDOWS\SYSTEM32\PROFAPI.DLL
C:\WINDOWS\SYSTEM32\CLBCATQ.DLL
C:\WINDOWS\SYSTEM32\CRYPTSP.DLL
C:\WINDOWS\SYSTEM32\RSAENH.DLL
C:\WINDOWS\ASSEMBLY\NATIVEIMAGES_V4.0.30319_32\SYSTEM.DRAWING\C55A38896FEF55FAFAFD1BE9C8437243\SYSTEM.DRAWING.NI.DLL
C:\WINDOWS\ASSEMBLY\NATIVEIMAGES_V4.0.30319_32\SYSTEM.WINDOWS.FORMS\FE00BBADB017064DC2340734108AD22E\SYSTEM.WINDOWS.FORMS.NI.DLL
C:\WINDOWS\SYSTEM32\UXTHEME.DLL
C:\WINDOWS\WINSXS\X86_MICROSOFT.WINDOWS.GDIPLUS_6595B64144CCF1DF_1.1.9600.18592_NONE_DAE0BA965BC4A8DC\GDIPLUS.DLL
C:\WINDOWS\SYSTEM32\WKSCLI.DLL
C:\WINDOWS\SYSTEM32\NETUTILS.DLL
C:\WINDOWS\ASSEMBLY\NATIVEIMAGES_V4.0.30319_32\SYSTEM.CONFIGURATION\E4B51F793514A0D7324EF02828145130\SYSTEM.CONFIGURATION.NI.DLL
C:\WINDOWS\ASSEMBLY\NATIVEIMAGES_V4.0.30319_32\SYSTEM.XML\4D0104BB5509D906F129D54B070D1BD6\SYSTEM.XML.NI.DLL
C:\WINDOWS\SYSTEM32\RASAPI32.DLL
C:\WINDOWS\SYSTEM32\RASMAN.DLL
C:\WINDOWS\SYSTEM32\WS2_32.DLL
C:\WINDOWS\SYSTEM32\NSI.DLL
C:\WINDOWS\SYSTEM32\RTUTILS.DLL
C:\WINDOWS\SYSTEM32\MSWSOCK.DLL
C:\WINDOWS\SYSTEM32\WINHTTP.DLL
C:\WINDOWS\SYSTEM32\IPHLPAPI.DLL
C:\WINDOWS\SYSTEM32\WINNSI.DLL
C:\WINDOWS\SYSTEM32\DHCPCSVC6.DLL
C:\WINDOWS\SYSTEM32\DHCPCSVC.DLL
C:\WINDOWS\SYSTEM32\DNSAPI.DLL
C:\WINDOWS\SYSTEM32\RASADHLP.DLL
C:\WINDOWS\SYSTEM32\FWPUCLNT.DLL
C:\WINDOWS\SYSTEM32\PSAPI.DLL
C:\WINDOWS\SYSTEM32\SECUR32.DLL
C:\WINDOWS\SYSTEM32\SCHANNEL.DLL
C:\WINDOWS\SYSTEM32\CRYPT32.DLL
C:\WINDOWS\SYSTEM32\MSASN1.DLL
C:\WINDOWS\SYSTEM32\NCRYPT.DLL
C:\WINDOWS\SYSTEM32\NTASN1.DLL
C:\WINDOWS\SYSTEM32\NCRYPTSSLP.DLL
C:\WINDOWS\SYSTEM32\GPAPI.DLL
C:\WINDOWS\ASSEMBLY\NATIVEIMAGES_V4.0.30319_32\SYSTEM.XML.LINQ\84AA347C058F8E8596BDB3A354848F7D\SYSTEM.XML.LINQ.NI.DLL
C:\WINDOWS\MICROSOFT.NET\FRAMEWORK\V4.0.30319\DIASYMREADER.DLL
C:\WINDOWS\MICROSOFT.NET\FRAMEWORK\V4.0.30319\CLRCOMPRESSION.DLL
C:\WINDOWS\ASSEMBLY\NATIVEIMAGES_V4.0.30319_32\SYSTEM.NET.HTTP\2821DC78750C2CE9F32849258E733C72\SYSTEM.NET.HTTP.NI.DLL
C:\WINDOWS\SYSTEM32\WER.DLL
C:\WINDOWS\SYSTEM32\NTMARTA.DLL
C:\WINDOWS\SYSTEM32\DBGHELP.DLL
C:\PROGRAM FILES (X86)\MICROSOFT VISUAL STUDIO 14.0\VC\BIN\X86_AMD64\VCTIP.EXE
C:\WINDOWS\SYSTEM32\NTDLL.DLL
C:\WINDOWS\SYSTEM32\MSCOREE.DLL
C:\WINDOWS\SYSTEM32\KERNEL32.DLL
C:\WINDOWS\SYSTEM32\KERNELBASE.DLL
C:\PROGRAM FILES (X86)\MSBUILD\14.0\BIN\FILETRACKER32.DLL
C:\WINDOWS\SYSTEM32\API-MS-WIN-CRT-STDIO-L1-1-0.DLL
C:\WINDOWS\SYSTEM32\VCRUNTIME140.DLL
C:\WINDOWS\SYSTEM32\API-MS-WIN-CRT-RUNTIME-L1-1-0.DLL
C:\WINDOWS\SYSTEM32\API-MS-WIN-CRT-MATH-L1-1-0.DLL
C:\WINDOWS\SYSTEM32\API-MS-WIN-CRT-LOCALE-L1-1-0.DLL
C:\WINDOWS\SYSTEM32\API-MS-WIN-CRT-HEAP-L1-1-0.DLL
C:\WINDOWS\SYSTEM32\ADVAPI32.DLL
C:\WINDOWS\SYSTEM32\API-MS-WIN-CRT-STRING-L1-1-0.DLL
C:\WINDOWS\SYSTEM32\API-MS-WIN-CRT-FILESYSTEM-L1-1-0.DLL
C:\WINDOWS\SYSTEM32\API-MS-WIN-CRT-CONVERT-L1-1-0.DLL
C:\WINDOWS\SYSTEM32\OLE32.DLL
C:\WINDOWS\SYSTEM32\OLEAUT32.DLL
C:\WINDOWS\SYSTEM32\MSVCP140.DLL
C:\WINDOWS\SYSTEM32\SHELL32.DLL
C:\WINDOWS\SYSTEM32\MSVCRT.DLL
C:\WINDOWS\SYSTEM32\SECHOST.DLL
C:\WINDOWS\SYSTEM32\RPCRT4.DLL
C:\WINDOWS\SYSTEM32\COMBASE.DLL
C:\WINDOWS\SYSTEM32\GDI32.DLL
C:\WINDOWS\SYSTEM32\USER32.DLL
C:\WINDOWS\SYSTEM32\API-MS-WIN-CRT-MULTIBYTE-L1-1-0.DLL
C:\WINDOWS\SYSTEM32\API-MS-WIN-CRT-TIME-L1-1-0.DLL
C:\WINDOWS\SYSTEM32\API-MS-WIN-CRT-ENVIRONMENT-L1-1-0.DLL
C:\WINDOWS\SYSTEM32\API-MS-WIN-CRT-UTILITY-L1-1-0.DLL
C:\WINDOWS\SYSTEM32\SHLWAPI.DLL
C:\WINDOWS\SYSTEM32\CRYPTBASE.DLL
C:\WINDOWS\SYSTEM32\SSPICLI.DLL
C:\WINDOWS\SYSTEM32\UCRTBASE.DLL
C:\WINDOWS\SYSTEM32\BCRYPTPRIMITIVES.DLL
C:\WINDOWS\SYSTEM32\IMM32.DLL
C:\WINDOWS\SYSTEM32\MSCTF.DLL
C:\WINDOWS\MICROSOFT.NET\FRAMEWORK\V4.0.30319\MSCOREEI.DLL
C:\WINDOWS\SYSTEM32\KERNEL.APPCORE.DLL
C:\WINDOWS\SYSTEM32\VERSION.DLL
C:\WINDOWS\MICROSOFT.NET\FRAMEWORK\V4.0.30319\CLR.DLL
C:\WINDOWS\SYSTEM32\MSVCR120_CLR0400.DLL
C:\WINDOWS\ASSEMBLY\NATIVEIMAGES_V4.0.30319_32\MSCORLIB\02795048C7EDE81AF33ACDB56F905958\MSCORLIB.NI.DLL
C:\WINDOWS\MICROSOFT.NET\FRAMEWORK\V4.0.30319\CLRJIT.DLL
C:\WINDOWS\SYSTEM32\SHCORE.DLL
C:\WINDOWS\ASSEMBLY\NATIVEIMAGES_V4.0.30319_32\SYSTEM\E49AF6ABC3FB5DDA64392CAE6CA45DB9\SYSTEM.NI.DLL
C:\WINDOWS\ASSEMBLY\NATIVEIMAGES_V4.0.30319_32\SYSTEM.CORE\6AD7BDC64040BFDA8AA2C21B1E4394B0\SYSTEM.CORE.NI.DLL
C:\WINDOWS\SYSTEM32\SQMAPI.DLL
C:\WINDOWS\SYSTEM32\BCRYPT.DLL
C:\WINDOWS\SYSTEM32\PROFAPI.DLL
C:\WINDOWS\SYSTEM32\CLBCATQ.DLL
C:\WINDOWS\SYSTEM32\CRYPTSP.DLL
C:\WINDOWS\SYSTEM32\RSAENH.DLL
C:\WINDOWS\ASSEMBLY\NATIVEIMAGES_V4.0.30319_32\SYSTEM.DRAWING\C55A38896FEF55FAFAFD1BE9C8437243\SYSTEM.DRAWING.NI.DLL
C:\WINDOWS\ASSEMBLY\NATIVEIMAGES_V4.0.30319_32\SYSTEM.WINDOWS.FORMS\FE00BBADB017064DC2340734108AD22E\SYSTEM.WINDOWS.FORMS.NI.DLL
C:\WINDOWS\SYSTEM32\UXTHEME.DLL
C:\WINDOWS\WINSXS\X86_MICROSOFT.WINDOWS.GDIPLUS_6595B64144CCF1DF_1.1.9600.18592_NONE_DAE0BA965BC4A8DC\GDIPLUS.DLL
C:\WINDOWS\SYSTEM32\WKSCLI.DLL
C:\WINDOWS\SYSTEM32\NETUTILS.DLL
C:\WINDOWS\ASSEMBLY\NATIVEIMAGES_V4.0.30319_32\SYSTEM.CONFIGURATION\E4B51F793514A0D7324EF02828145130\SYSTEM.CONFIGURATION.NI.DLL
C:\WINDOWS\ASSEMBLY\NATIVEIMAGES_V4.0.30319_32\SYSTEM.XML\4D0104BB5509D906F129D54B070D1BD6\SYSTEM.XML.NI.DLL
C:\WINDOWS\SYSTEM32\RASAPI32.DLL
C:\WINDOWS\SYSTEM32\RASMAN.DLL
C:\WINDOWS\SYSTEM32\WS2_32.DLL
C:\WINDOWS\SYSTEM32\NSI.DLL
C:\WINDOWS\SYSTEM32\RTUTILS.DLL
C:\WINDOWS\SYSTEM32\MSWSOCK.DLL
C:\WINDOWS\SYSTEM32\WINHTTP.DLL
C:\WINDOWS\SYSTEM32\IPHLPAPI.DLL
C:\WINDOWS\SYSTEM32\WINNSI.DLL
C:\WINDOWS\SYSTEM32\DHCPCSVC6.DLL
C:\WINDOWS\SYSTEM32\DHCPCSVC.DLL
C:\WINDOWS\SYSTEM32\DNSAPI.DLL
C:\WINDOWS\SYSTEM32\RASADHLP.DLL
C:\WINDOWS\SYSTEM32\FWPUCLNT.DLL
C:\WINDOWS\SYSTEM32\PSAPI.DLL
C:\WINDOWS\SYSTEM32\SECUR32.DLL
C:\WINDOWS\SYSTEM32\SCHANNEL.DLL
C:\WINDOWS\SYSTEM32\CRYPT32.DLL
C:\WINDOWS\SYSTEM32\MSASN1.DLL
C:\WINDOWS\SYSTEM32\NCRYPT.DLL
C:\WINDOWS\SYSTEM32\NTASN1.DLL
C:\WINDOWS\SYSTEM32\NCRYPTSSLP.DLL
C:\WINDOWS\SYSTEM32\GPAPI.DLL
C:\WINDOWS\ASSEMBLY\NATIVEIMAGES_V4.0.30319_32\SYSTEM.XML.LINQ\84AA347C058F8E8596BDB3A354848F7D\SYSTEM.XML.LINQ.NI.DLL
C:\WINDOWS\MICROSOFT.NET\FRAMEWORK\V4.0.30319\DIASYMREADER.DLL
C:\WINDOWS\MICROSOFT.NET\FRAMEWORK\V4.0.30319\CLRCOMPRESSION.DLL
C:\WINDOWS\ASSEMBLY\NATIVEIMAGES_V4.0.30319_32\SYSTEM.NET.HTTP\2821DC78750C2CE9F32849258E733C72\SYSTEM.NET.HTTP.NI.DLL
C:\WINDOWS\SYSTEM32\WER.DLL
C:\WINDOWS\SYSTEM32\NTMARTA.DLL
C:\WINDOWS\SYSTEM32\DBGHELP.DLL
C:\PROGRAM FILES (X86)\MICROSOFT VISUAL STUDIO 14.0\VC\BIN\X86_AMD64\VCTIP.EXE
C:\WINDOWS\SYSTEM32\NTDLL.DLL
C:\WINDOWS\SYSTEM32\MSCOREE.DLL
C:\WINDOWS\SYSTEM32\KERNEL32.DLL
C:\WINDOWS\SYSTEM32\KERNELBASE.DLL
C:\PROGRAM FILES (X86)\MSBUILD\14.0\BIN\FILETRACKER32.DLL
C:\WINDOWS\SYSTEM32\API-MS-WIN-CRT-STDIO-L1-1-0.DLL
C:\WINDOWS\SYSTEM32\VCRUNTIME140.DLL
C:\WINDOWS\SYSTEM32\API-MS-WIN-CRT-RUNTIME-L1-1-0.DLL
C:\WINDOWS\SYSTEM32\API-MS-WIN-CRT-MATH-L1-1-0.DLL
C:\WINDOWS\SYSTEM32\API-MS-WIN-CRT-LOCALE-L1-1-0.DLL
C:\WINDOWS\SYSTEM32\API-MS-WIN-CRT-HEAP-L1-1-0.DLL
C:\WINDOWS\SYSTEM32\ADVAPI32.DLL
C:\WINDOWS\SYSTEM32\API-MS-WIN-CRT-STRING-L1-1-0.DLL
C:\WINDOWS\SYSTEM32\API-MS-WIN-CRT-FILESYSTEM-L1-1-0.DLL
C:\WINDOWS\SYSTEM32\API-MS-WIN-CRT-CONVERT-L1-1-0.DLL
C:\WINDOWS\SYSTEM32\OLE32.DLL
C:\WINDOWS\SYSTEM32\OLEAUT32.DLL
C:\WINDOWS\SYSTEM32\MSVCP140.DLL
C:\WINDOWS\SYSTEM32\SHELL32.DLL
C:\WINDOWS\SYSTEM32\MSVCRT.DLL
C:\WINDOWS\SYSTEM32\SECHOST.DLL
C:\WINDOWS\SYSTEM32\RPCRT4.DLL
C:\WINDOWS\SYSTEM32\COMBASE.DLL
C:\WINDOWS\SYSTEM32\GDI32.DLL
C:\WINDOWS\SYSTEM32\USER32.DLL
C:\WINDOWS\SYSTEM32\API-MS-WIN-CRT-MULTIBYTE-L1-1-0.DLL
C:\WINDOWS\SYSTEM32\API-MS-WIN-CRT-TIME-L1-1-0.DLL
C:\WINDOWS\SYSTEM32\API-MS-WIN-CRT-ENVIRONMENT-L1-1-0.DLL
C:\WINDOWS\SYSTEM32\API-MS-WIN-CRT-UTILITY-L1-1-0.DLL
C:\WINDOWS\SYSTEM32\SHLWAPI.DLL
C:\WINDOWS\SYSTEM32\CRYPTBASE.DLL
C:\WINDOWS\SYSTEM32\SSPICLI.DLL
C:\WINDOWS\SYSTEM32\UCRTBASE.DLL
C:\WINDOWS\SYSTEM32\BCRYPTPRIMITIVES.DLL
C:\WINDOWS\SYSTEM32\IMM32.DLL
C:\WINDOWS\SYSTEM32\MSCTF.DLL
C:\WINDOWS\MICROSOFT.NET\FRAMEWORK\V4.0.30319\MSCOREEI.DLL
C:\WINDOWS\SYSTEM32\KERNEL.APPCORE.DLL
C:\WINDOWS\SYSTEM32\VERSION.DLL
C:\WINDOWS\MICROSOFT.NET\FRAMEWORK\V4.0.30319\CLR.DLL
C:\WINDOWS\SYSTEM32\MSVCR120_CLR0400.DLL
C:\WINDOWS\ASSEMBLY\NATIVEIMAGES_V4.0.30319_32\MSCORLIB\02795048C7EDE81AF33ACDB56F905958\MSCORLIB.NI.DLL
C:\WINDOWS\MICROSOFT.NET\FRAMEWORK\V4.0.30319\CLRJIT.DLL
C:\WINDOWS\SYSTEM32\SHCORE.DLL
C:\WINDOWS\ASSEMBLY\NATIVEIMAGES_V4.0.30319_32\SYSTEM\E49AF6ABC3FB5DDA64392CAE6CA45DB9\SYSTEM.NI.DLL
C:\WINDOWS\ASSEMBLY\NATIVEIMAGES_V4.0.30319_32\SYSTEM.CORE\6AD7BDC64040BFDA8AA2C21B1E4394B0\SYSTEM.CORE.NI.DLL
C:\WINDOWS\SYSTEM32\SQMAPI.DLL
C:\WINDOWS\SYSTEM32\BCRYPT.DLL
C:\WINDOWS\SYSTEM32\PROFAPI.DLL
C:\WINDOWS\SYSTEM32\CLBCATQ.DLL
C:\WINDOWS\SYSTEM32\CRYPTSP.DLL
C:\WINDOWS\SYSTEM32\RSAENH.DLL
C:\WINDOWS\ASSEMBLY\NATIVEIMAGES_V4.0.30319_32\SYSTEM.DRAWING\C55A38896FEF55FAFAFD1BE9C8437243\SYSTEM.DRAWING.NI.DLL
C:\WINDOWS\ASSEMBLY\NATIVEIMAGES_V4.0.30319_32\SYSTEM.WINDOWS.FORMS\FE00BBADB017064DC2340734108AD22E\SYSTEM.WINDOWS.FORMS.NI.DLL
C:\WINDOWS\SYSTEM32\UXTHEME.DLL
C:\WINDOWS\WINSXS\X86_MICROSOFT.WINDOWS.GDIPLUS_6595B64144CCF1DF_1.1.9600.18592_NONE_DAE0BA965BC4A8DC\GDIPLUS.DLL
C:\WINDOWS\SYSTEM32\WKSCLI.DLL
C:\WINDOWS\SYSTEM32\NETUTILS.DLL
C:\WINDOWS\ASSEMBLY\NATIVEIMAGES_V4.0.30319_32\SYSTEM.CONFIGURATION\E4B51F793514A0D7324EF02828145130\SYSTEM.CONFIGURATION.NI.DLL
C:\WINDOWS\ASSEMBLY\NATIVEIMAGES_V4.0.30319_32\SYSTEM.XML\4D0104BB5509D906F129D54B070D1BD6\SYSTEM.XML.NI.DLL
C:\WINDOWS\SYSTEM32\RASAPI32.DLL
C:\WINDOWS\SYSTEM32\RASMAN.DLL
C:\WINDOWS\SYSTEM32\WS2_32.DLL
C:\WINDOWS\SYSTEM32\NSI.DLL
C:\WINDOWS\SYSTEM32\RTUTILS.DLL
C:\WINDOWS\SYSTEM32\MSWSOCK.DLL
C:\WINDOWS\SYSTEM32\WINHTTP.DLL
C:\WINDOWS\SYSTEM32\IPHLPAPI.DLL
C:\WINDOWS\SYSTEM32\WINNSI.DLL
C:\WINDOWS\SYSTEM32\DHCPCSVC6.DLL
C:\WINDOWS\SYSTEM32\DHCPCSVC.DLL
C:\WINDOWS\SYSTEM32\DNSAPI.DLL
C:\WINDOWS\SYSTEM32\RASADHLP.DLL
C:\WINDOWS\SYSTEM32\FWPUCLNT.DLL
C:\WINDOWS\SYSTEM32\PSAPI.DLL
C:\WINDOWS\SYSTEM32\SECUR32.DLL
C:\WINDOWS\SYSTEM32\SCHANNEL.DLL
C:\WINDOWS\SYSTEM32\CRYPT32.DLL
C:\WINDOWS\SYSTEM32\MSASN1.DLL
C:\WINDOWS\SYSTEM32\NCRYPT.DLL
C:\WINDOWS\SYSTEM32\NTASN1.DLL
C:\WINDOWS\SYSTEM32\NCRYPTSSLP.DLL
C:\WINDOWS\SYSTEM32\GPAPI.DLL
C:\WINDOWS\ASSEMBLY\NATIVEIMAGES_V4.0.30319_32\SYSTEM.XML.LINQ\84AA347C058F8E8596BDB3A354848F7D\SYSTEM.XML.LINQ.NI.DLL
C:\WINDOWS\MICROSOFT.NET\FRAMEWORK\V4.0.30319\DIASYMREADER.DLL
C:\WINDOWS\MICROSOFT.NET\FRAMEWORK\V4.0.30319\CLRCOMPRESSION.DLL
C:\WINDOWS\ASSEMBLY\NATIVEIMAGES_V4.0.30319_32\SYSTEM.NET.HTTP\2821DC78750C2CE9F32849258E733C72\SYSTEM.NET.HTTP.NI.DLL
C:\WINDOWS\SYSTEM32\WER.DLL
C:\WINDOWS\SYSTEM32\NTMARTA.DLL
C:\WINDOWS\SYSTEM32\DBGHELP.DLL
