^C:\USERS\MOXLEY\DOCUMENTS\GUIADDBUTTONS\BUILD\HELLOWORLD_AUTOGEN\MOC_COMPILATION.CPP|C:\USERS\MOXLEY\DOCUMENTS\GUIADDBUTTONS\MAIN.CPP|C:\USERS\MOXLEY\DOCUMENTS\GUIADDBUTTONS\MAINWINDOW.CPP
C:\USERS\MOXLEY\DOCUMENTS\GUIADDBUTTONS\BUILD\HELLOWORLD.DIR\DEBUG\VC140.PDB
C:\USERS\MOXLEY\DOCUMENTS\GUIADDBUTTONS\BUILD\HELLOWORLD.DIR\DEBUG\MAINWINDOW.OBJ
C:\USERS\MOXLEY\DOCUMENTS\GUIADDBUTTONS\BUILD\HELLOWORLD.DIR\DEBUG\MAIN.OBJ
C:\USERS\MOXLEY\DOCUMENTS\GUIADDBUTTONS\BUILD\HELLOWORLD.DIR\DEBUG\MOC_COMPILATION.OBJ
^C:\USERS\MOXLEY\DOCUMENTS\GUIADDBUTTONS\BUILD\HELLOWORLD_AUTOGEN\MOC_COMPILATION.CPP
C:\USERS\MOXLEY\DOCUMENTS\GUIADDBUTTONS\BUILD\HELLOWORLD.DIR\DEBUG\VC140.PDB
^C:\USERS\MOXLEY\DOCUMENTS\GUIADDBUTTONS\MAIN.CPP
C:\USERS\MOXLEY\DOCUMENTS\GUIADDBUTTONS\BUILD\HELLOWORLD.DIR\DEBUG\VC140.PDB
^C:\USERS\MOXLEY\DOCUMENTS\GUIADDBUTTONS\MAINWINDOW.CPP
C:\USERS\MOXLEY\DOCUMENTS\GUIADDBUTTONS\BUILD\HELLOWORLD.DIR\DEBUG\VC140.PDB
C:\USERS\MOXLEY\DOCUMENTS\GUIADDBUTTONS\BUILD\HELLOWORLD.DIR\DEBUG\MAINWINDOW.OBJ
