^C:\C++\APPLICATION_DESIGN_PART1\SRC\SPRING\FRAMEWORK\CMAKELISTS.TXT
C:\QT\QT5.8.0\5.8\MSVC2015_64\LIB\CMAKE\QT5\QT5CONFIGVERSION.CMAKE
C:\QT\QT5.8.0\5.8\MSVC2015_64\LIB\CMAKE\QT5\QT5CONFIG.CMAKE
C:\QT\QT5.8.0\5.8\MSVC2015_64\LIB\CMAKE\QT5\QT5MODULELOCATION.CMAKE
C:\QT\QT5.8.0\5.8\MSVC2015_64\LIB\CMAKE\QT5CORE\QT5CORECONFIGVERSION.CMAKE
C:\QT\QT5.8.0\5.8\MSVC2015_64\LIB\CMAKE\QT5CORE\QT5CORECONFIG.CMAKE
C:\QT\QT5.8.0\5.8\MSVC2015_64\LIB\CMAKE\QT5CORE\QT5CORECONFIGEXTRAS.CMAKE
C:\QT\QT5.8.0\5.8\MSVC2015_64\LIB\CMAKE\QT5CORE\QT5CORECONFIGEXTRASMKSPECDIR.CMAKE
C:\QT\QT5.8.0\5.8\MSVC2015_64\LIB\CMAKE\QT5CORE\QT5COREMACROS.CMAKE
C:\PROGRAM FILES\CMAKE\SHARE\CMAKE-3.7\MODULES\CMAKEPARSEARGUMENTS.CMAKE
C:\QT\QT5.8.0\5.8\MSVC2015_64\LIB\CMAKE\QT5WIDGETS\QT5WIDGETSCONFIGVERSION.CMAKE
C:\QT\QT5.8.0\5.8\MSVC2015_64\LIB\CMAKE\QT5WIDGETS\QT5WIDGETSCONFIG.CMAKE
C:\QT\QT5.8.0\5.8\MSVC2015_64\LIB\CMAKE\QT5GUI\QT5GUICONFIGVERSION.CMAKE
C:\QT\QT5.8.0\5.8\MSVC2015_64\LIB\CMAKE\QT5GUI\QT5GUICONFIG.CMAKE
C:\QT\QT5.8.0\5.8\MSVC2015_64\LIB\CMAKE\QT5GUI\QT5GUI_QGIFPLUGIN.CMAKE
C:\QT\QT5.8.0\5.8\MSVC2015_64\LIB\CMAKE\QT5GUI\QT5GUI_QICNSPLUGIN.CMAKE
C:\QT\QT5.8.0\5.8\MSVC2015_64\LIB\CMAKE\QT5GUI\QT5GUI_QICOPLUGIN.CMAKE
C:\QT\QT5.8.0\5.8\MSVC2015_64\LIB\CMAKE\QT5GUI\QT5GUI_QJPEGPLUGIN.CMAKE
C:\QT\QT5.8.0\5.8\MSVC2015_64\LIB\CMAKE\QT5GUI\QT5GUI_QMINIMALINTEGRATIONPLUGIN.CMAKE
C:\QT\QT5.8.0\5.8\MSVC2015_64\LIB\CMAKE\QT5GUI\QT5GUI_QOFFSCREENINTEGRATIONPLUGIN.CMAKE
C:\QT\QT5.8.0\5.8\MSVC2015_64\LIB\CMAKE\QT5GUI\QT5GUI_QTGAPLUGIN.CMAKE
C:\QT\QT5.8.0\5.8\MSVC2015_64\LIB\CMAKE\QT5GUI\QT5GUI_QTIFFPLUGIN.CMAKE
C:\QT\QT5.8.0\5.8\MSVC2015_64\LIB\CMAKE\QT5GUI\QT5GUI_QTUIOTOUCHPLUGIN.CMAKE
C:\QT\QT5.8.0\5.8\MSVC2015_64\LIB\CMAKE\QT5GUI\QT5GUI_QVIRTUALKEYBOARDPLUGIN.CMAKE
C:\QT\QT5.8.0\5.8\MSVC2015_64\LIB\CMAKE\QT5GUI\QT5GUI_QWBMPPLUGIN.CMAKE
C:\QT\QT5.8.0\5.8\MSVC2015_64\LIB\CMAKE\QT5GUI\QT5GUI_QWEBPPLUGIN.CMAKE
C:\QT\QT5.8.0\5.8\MSVC2015_64\LIB\CMAKE\QT5GUI\QT5GUI_QWINDOWSDIRECT2DINTEGRATIONPLUGIN.CMAKE
C:\QT\QT5.8.0\5.8\MSVC2015_64\LIB\CMAKE\QT5GUI\QT5GUI_QWINDOWSINTEGRATIONPLUGIN.CMAKE
C:\QT\QT5.8.0\5.8\MSVC2015_64\LIB\CMAKE\QT5GUI\QT5GUICONFIGEXTRAS.CMAKE
C:\QT\QT5.8.0\5.8\MSVC2015_64\LIB\CMAKE\QT5WIDGETS\QT5WIDGETSCONFIGEXTRAS.CMAKE
C:\QT\QT5.8.0\5.8\MSVC2015_64\LIB\CMAKE\QT5WIDGETS\QT5WIDGETSMACROS.CMAKE
C:\PROGRAM FILES\CMAKE\SHARE\CMAKE-3.7\MODULES\AUTOGENINFO.CMAKE.IN
