0:0:0:0:0:0:0:1 - - [19/May/2015:06:24:14 +0200] "GET /logger/log.jsp HTTP/1.1" 200 12987
0:0:0:0:0:0:0:1 - - [19/May/2015:06:24:15 +0200] "GET /favicon.ico HTTP/1.1" 404 1016
0:0:0:0:0:0:0:1 - - [19/May/2015:06:24:26 +0200] "GET /logger/log.jsp?schnippel=pippe HTTP/1.1" 200 13052
0:0:0:0:0:0:0:1 - - [19/May/2015:06:25:36 +0200] "GET /logger/log.jsp?schnippel=pippe HTTP/1.1" 200 117
