// Jest Snapshot v1, https://goo.gl/fbAQLP

exports[`CardTitle renders correctly 1`] = `
<h4
  className="card-title foo bar"
  style={
    Object {
      "width": 10,
    }
  }
>
  Hello World
</h4>
`;
