// Jest Snapshot v1, https://goo.gl/fbAQLP

exports[`Button renders correctly 1`] = `
<button
  className="btn foo bar"
  onClick={[Function]}
  style={
    Object {
      "backgroundColor": "blue",
    }
  }
>
  Hello World
</button>
`;
